hbase-dev mailing list archives

Site index · List index
Message view « Date » · « Thread »
Top « Date » · « Thread »
From Apache Jenkins Server <jenk...@builds.apache.org>
Subject Build failed in Jenkins: HBase-TRUNK #3061
Date Sat, 23 Jun 2012 01:07:37 GMT
See <https://builds.apache.org/job/HBase-TRUNK/3061/changes>

Changes:

[apurtell] HBASE-6224. Add pre and post coprocessor hooks for bulk load (Francis Liu)

[tedyu] HBASE-5630 hbck should disable the balancer using synchronousBalanceSwitch (Gregory
Chanan)

------------------------------------------
[...truncated 1525 lines...]
A         hbase-common/src/main/java/org/apache/hadoop/hbase/KeyValue.java
A         hbase-common/src/main/java/org/apache/hadoop/hbase/io
A         hbase-common/src/main/java/org/apache/hadoop/hbase/io/ImmutableBytesWritable.java
A         hbase-common/src/main/java/org/apache/hadoop/hbase/io/HeapSize.java
A         hbase-common/src/main/java/org/apache/hadoop/hbase/HBaseConfiguration.java
A         hbase-common/src/main/java/org/apache/hadoop/hbase/util
A         hbase-common/src/main/java/org/apache/hadoop/hbase/util/ClassSize.java
A         hbase-common/src/main/java/org/apache/hadoop/hbase/util/VersionInfo.java
A         hbase-common/src/main/java/org/apache/hadoop/hbase/util/Bytes.java
A         hbase-common/pom.xml
A         .arcconfig
A         pom.xml
A         README.txt
A         examples
A         examples/thrift
A         examples/thrift/DemoClient.java
A         examples/thrift/DemoClient.cpp
A         examples/thrift/DemoClient.rb
A         examples/thrift/DemoClient.php
A         examples/thrift/DemoClient.py
A         examples/thrift/README.txt
A         examples/thrift/DemoClient.pl
A         examples/thrift/Makefile
A         examples/thrift2
A         examples/thrift2/DemoClient.java
A         examples/thrift2/DemoClient.py
A         examples/mapreduce
A         examples/mapreduce/org
A         examples/mapreduce/org/apache
A         examples/mapreduce/org/apache/hadoop
A         examples/mapreduce/org/apache/hadoop/hbase
A         examples/mapreduce/org/apache/hadoop/hbase/mapreduce
A         examples/mapreduce/org/apache/hadoop/hbase/mapreduce/SampleUploader.java
A         examples/mapreduce/org/apache/hadoop/hbase/mapreduce/IndexBuilder.java
A         examples/mapreduce/index-builder-setup.rb
A         examples/README.txt
 U        .
At revision 1353058
[HBase-TRUNK] $ /bin/bash -xe /tmp/hudson7124758560850905735.sh
+ ulimit -a
core file size          (blocks, -c) 0
data seg size           (kbytes, -d) unlimited
scheduling priority             (-e) 0
file size               (blocks, -f) unlimited
pending signals                 (-i) 63880
max locked memory       (kbytes, -l) 64
max memory size         (kbytes, -m) unlimited
open files                      (-n) 4096
pipe size            (512 bytes, -p) 8
POSIX message queues     (bytes, -q) 819200
real-time priority              (-r) 0
stack size              (kbytes, -s) 8192
cpu time               (seconds, -t) unlimited
max user processes              (-u) 63880
virtual memory          (kbytes, -v) unlimited
file locks                      (-x) unlimited
+ java -version
java version "1.6.0_27"
Java(TM) SE Runtime Environment (build 1.6.0_27-b07)
Java HotSpot(TM) Server VM (build 20.2-b06, mixed mode)
[trunk] $ /home/hudson/tools/maven/latest3/bin/mvn -PrunAllTests -Dmaven.test.redirectTestOutputToFile=true
site package assembly:assembly -Prelease
[INFO] Scanning for projects...
[INFO] ------------------------------------------------------------------------
[INFO] Reactor Build Order:
[INFO] 
[INFO] HBase
[INFO] HBase - Common
[INFO] HBase - Server
[INFO]                                                                         
[INFO] ------------------------------------------------------------------------
[INFO] Building HBase 0.95-SNAPSHOT
[INFO] ------------------------------------------------------------------------
[INFO] 
[INFO] >>> maven-javadoc-plugin:2.8.1:aggregate (javadoc) @ hbase >>>
[INFO]                                                                         
[INFO] >>>>>>>>>>>>>>>>>>>>>>>>>>>>>>>>>>>>>>>>>>>>>>>>>>>>>>>>>>>>>>>>>>>>>>>>
[INFO] Forking HBase - Server 0.95-SNAPSHOT
[INFO] >>>>>>>>>>>>>>>>>>>>>>>>>>>>>>>>>>>>>>>>>>>>>>>>>>>>>>>>>>>>>>>>>>>>>>>>
Downloading: http://people.apache.org/~garyh/mvn/org/apache/hbase/hbase-common/0.95-SNAPSHOT/maven-metadata.xml
Downloading: http://repository.apache.org/snapshots/org/apache/hbase/hbase-common/0.95-SNAPSHOT/maven-metadata.xml
Downloading: http://repository-netty.forge.cloudbees.com/snapshot/org/apache/hbase/hbase-common/0.95-SNAPSHOT/maven-metadata.xml
Downloading: https://repository.apache.org/content/repositories/releases/org/apache/hbase/hbase-common/0.95-SNAPSHOT/maven-metadata.xml




Downloading: https://repository.apache.org/content/repositories/releases/io/netty/netty/3.5.0.Final-SNAPSHOT/maven-metadata.xml
Downloading: http://repository-netty.forge.cloudbees.com/snapshot/io/netty/netty/3.5.0.Final-SNAPSHOT/maven-metadata.xml
Downloading: http://repository.apache.org/snapshots/io/netty/netty/3.5.0.Final-SNAPSHOT/maven-metadata.xml
Downloading: http://people.apache.org/~garyh/mvn/io/netty/netty/3.5.0.Final-SNAPSHOT/maven-metadata.xml



1005 B   
         
Downloaded: http://repository-netty.forge.cloudbees.com/snapshot/io/netty/netty/3.5.0.Final-SNAPSHOT/maven-metadata.xml
(1005 B at 3.2 KB/sec)
Downloading: http://people.apache.org/~stack/m2/repository/org/hbase/asynchbase/maven-metadata.xml
Downloading: https://repository.apache.org/content/repositories/releases/org/hbase/asynchbase/maven-metadata.xml
Downloading: http://repository-netty.forge.cloudbees.com/snapshot/org/hbase/asynchbase/maven-metadata.xml
Downloading: http://download.java.net/maven/2/org/hbase/asynchbase/maven-metadata.xml
         
Downloading: http://repository.codehaus.org/org/hbase/asynchbase/maven-metadata.xml
         
Downloading: http://repository.jboss.org/nexus/content/groups/public-jboss/org/hbase/asynchbase/maven-metadata.xml
         
Downloading: http://people.apache.org/~garyh/mvn/org/hbase/asynchbase/maven-metadata.xml
         
Downloading: http://repository.apache.org/snapshots/org/hbase/asynchbase/maven-metadata.xml
         
Downloading: http://repo1.maven.org/maven2/org/hbase/asynchbase/maven-metadata.xml
         
         
419 B    
        
Downloaded: http://repo1.maven.org/maven2/org/hbase/asynchbase/maven-metadata.xml (419 B at
1.4 KB/sec)
        
Downloading: http://repository-netty.forge.cloudbees.com/snapshot/io/netty/netty/maven-metadata.xml
Downloading: https://repository.apache.org/content/repositories/releases/io/netty/netty/maven-metadata.xml
Downloading: http://download.java.net/maven/2/io/netty/netty/maven-metadata.xml
Downloading: http://people.apache.org/~stack/m2/repository/io/netty/netty/maven-metadata.xml
        
Downloading: http://repository.codehaus.org/io/netty/netty/maven-metadata.xml
        
        
Downloading: http://repository.jboss.org/nexus/content/groups/public-jboss/io/netty/netty/maven-metadata.xml
Downloading: http://people.apache.org/~garyh/mvn/io/netty/netty/maven-metadata.xml
510 B   
        
Downloading: http://repository.apache.org/snapshots/io/netty/netty/maven-metadata.xml
368 B   510 B   
                
Downloading: http://repo1.maven.org/maven2/io/netty/netty/maven-metadata.xml
                
Downloaded: http://repository.jboss.org/nexus/content/groups/public-jboss/io/netty/netty/maven-metadata.xml
(368 B at 3.0 KB/sec)
Downloading: https://oss.sonatype.org/content/repositories/snapshots/io/netty/netty/maven-metadata.xml
                
                
Downloaded: http://repository-netty.forge.cloudbees.com/snapshot/io/netty/netty/maven-metadata.xml
(510 B at 2.0 KB/sec)
821 B           
        
Downloaded: http://repo1.maven.org/maven2/io/netty/netty/maven-metadata.xml (821 B at 3.9
KB/sec)
347 B   
        
Downloaded: https://oss.sonatype.org/content/repositories/snapshots/io/netty/netty/maven-metadata.xml
(347 B at 0.5 KB/sec)
Downloading: http://people.apache.org/~garyh/mvn/io/netty/netty/3.5.1.Final-SNAPSHOT/maven-metadata.xml
Downloading: http://repository-netty.forge.cloudbees.com/snapshot/io/netty/netty/3.5.1.Final-SNAPSHOT/maven-metadata.xml
Downloading: http://repository.apache.org/snapshots/io/netty/netty/3.5.1.Final-SNAPSHOT/maven-metadata.xml
Downloading: https://repository.apache.org/content/repositories/releases/io/netty/netty/3.5.1.Final-SNAPSHOT/maven-metadata.xml
        
Downloading: https://oss.sonatype.org/content/repositories/snapshots/io/netty/netty/3.5.1.Final-SNAPSHOT/maven-metadata.xml
        
        
1001 B   
         
Downloaded: http://repository-netty.forge.cloudbees.com/snapshot/io/netty/netty/3.5.1.Final-SNAPSHOT/maven-metadata.xml
(1001 B at 3.6 KB/sec)
         
Downloading: http://repository-netty.forge.cloudbees.com/snapshot/io/netty/netty/4.0.0.Alpha1-SNAPSHOT/maven-metadata.xml
Downloading: http://people.apache.org/~garyh/mvn/io/netty/netty/4.0.0.Alpha1-SNAPSHOT/maven-metadata.xml
Downloading: https://repository.apache.org/content/repositories/releases/io/netty/netty/4.0.0.Alpha1-SNAPSHOT/maven-metadata.xml
Downloading: http://repository.apache.org/snapshots/io/netty/netty/4.0.0.Alpha1-SNAPSHOT/maven-metadata.xml
         
Downloading: https://oss.sonatype.org/content/repositories/snapshots/io/netty/netty/4.0.0.Alpha1-SNAPSHOT/maven-metadata.xml
         
2 KB     
       
       
Downloaded: http://repository-netty.forge.cloudbees.com/snapshot/io/netty/netty/4.0.0.Alpha1-SNAPSHOT/maven-metadata.xml
(2 KB at 6.1 KB/sec)
1005 B   
         
Downloaded: https://oss.sonatype.org/content/repositories/snapshots/io/netty/netty/4.0.0.Alpha1-SNAPSHOT/maven-metadata.xml
(1005 B at 1.5 KB/sec)
Downloading: http://repository-netty.forge.cloudbees.com/snapshot/io/netty/netty-parent/4.0.0.Alpha1-SNAPSHOT/maven-metadata.xml
Downloading: https://repository.apache.org/content/repositories/releases/io/netty/netty-parent/4.0.0.Alpha1-SNAPSHOT/maven-metadata.xml
Downloading: http://people.apache.org/~garyh/mvn/io/netty/netty-parent/4.0.0.Alpha1-SNAPSHOT/maven-metadata.xml
Downloading: http://repository.apache.org/snapshots/io/netty/netty-parent/4.0.0.Alpha1-SNAPSHOT/maven-metadata.xml
         
Downloading: https://oss.sonatype.org/content/repositories/snapshots/io/netty/netty-parent/4.0.0.Alpha1-SNAPSHOT/maven-metadata.xml
         
613 B    
        
        
Downloaded: http://repository-netty.forge.cloudbees.com/snapshot/io/netty/netty-parent/4.0.0.Alpha1-SNAPSHOT/maven-metadata.xml
(613 B at 3.1 KB/sec)
611 B   
        
Downloaded: https://oss.sonatype.org/content/repositories/snapshots/io/netty/netty-parent/4.0.0.Alpha1-SNAPSHOT/maven-metadata.xml
(611 B at 0.9 KB/sec)
Downloading: http://people.apache.org/~stack/m2/repository/com/stumbleupon/async/maven-metadata.xml
Downloading: http://repository-netty.forge.cloudbees.com/snapshot/com/stumbleupon/async/maven-metadata.xml
Downloading: http://download.java.net/maven/2/com/stumbleupon/async/maven-metadata.xml
Downloading: https://repository.apache.org/content/repositories/releases/com/stumbleupon/async/maven-metadata.xml
        
Downloading: http://repository.codehaus.org/com/stumbleupon/async/maven-metadata.xml
        
Downloading: http://repository.jboss.org/nexus/content/groups/public-jboss/com/stumbleupon/async/maven-metadata.xml
        
        
Downloading: http://people.apache.org/~garyh/mvn/com/stumbleupon/async/maven-metadata.xml
Downloading: http://repository.apache.org/snapshots/com/stumbleupon/async/maven-metadata.xml
        
Downloading: http://repo1.maven.org/maven2/com/stumbleupon/async/maven-metadata.xml
358 B   
        
Downloading: https://oss.sonatype.org/content/repositories/snapshots/com/stumbleupon/async/maven-metadata.xml
        
        
Downloaded: http://repo1.maven.org/maven2/com/stumbleupon/async/maven-metadata.xml (358 B
at 10.3 KB/sec)
        
361 B   
        
Downloaded: https://oss.sonatype.org/content/repositories/snapshots/com/stumbleupon/async/maven-metadata.xml
(361 B at 0.5 KB/sec)
Downloading: http://repository-netty.forge.cloudbees.com/snapshot/org/apache/hbase/hbase-common/0.95-SNAPSHOT/hbase-common-0.95-SNAPSHOT.jar
        
Downloading: https://repository.apache.org/content/repositories/releases/org/apache/hbase/hbase-common/0.95-SNAPSHOT/hbase-common-0.95-SNAPSHOT.jar
        
Downloading: http://people.apache.org/~garyh/mvn/org/apache/hbase/hbase-common/0.95-SNAPSHOT/hbase-common-0.95-SNAPSHOT.jar
        
Downloading: http://repository.apache.org/snapshots/org/apache/hbase/hbase-common/0.95-SNAPSHOT/hbase-common-0.95-SNAPSHOT.jar
        
[INFO]                                                                         
[INFO] ------------------------------------------------------------------------
[INFO] Skipping HBase
[INFO] This project has been banned from the build due to previous failures.
[INFO] ------------------------------------------------------------------------
[INFO] ------------------------------------------------------------------------
[INFO] Reactor Summary:
[INFO] 
[INFO] HBase ............................................. FAILURE [8.974s]
[INFO] HBase - Common .................................... SKIPPED
[INFO] HBase - Server .................................... SKIPPED
[INFO] ------------------------------------------------------------------------
[INFO] BUILD FAILURE
[INFO] ------------------------------------------------------------------------
[INFO] Total time: 9.476s
[INFO] Finished at: Sat Jun 23 01:07:35 UTC 2012
[INFO] Final Memory: 14M/110M
[INFO] ------------------------------------------------------------------------
[ERROR] Failed to execute goal on project hbase-server: Could not resolve dependencies for
project org.apache.hbase:hbase-server:jar:0.95-SNAPSHOT: Could not find artifact org.apache.hbase:hbase-common:jar:0.95-SNAPSHOT
in cloudbees netty (http://repository-netty.forge.cloudbees.com/snapshot/) -> [Help 1]
[ERROR] 
[ERROR] To see the full stack trace of the errors, re-run Maven with the -e switch.
[ERROR] Re-run Maven using the -X switch to enable full debug logging.
[ERROR] 
[ERROR] For more information about the errors and possible solutions, please read the following
articles:
[ERROR] [Help 1] http://cwiki.apache.org/confluence/display/MAVEN/DependencyResolutionException
[ERROR] 
[ERROR] After correcting the problems, you can resume the build with the command
[ERROR]   mvn <goals> -rf :hbase-server
Build step 'Invoke top-level Maven targets' marked build as failure
Archiving artifacts
Recording test results
Updating HBASE-6224
Updating HBASE-5630

Mime
View raw message