hbase-dev mailing list archives

Site index · List index
Message view « Date » · « Thread »
Top « Date » · « Thread »
From Apache Jenkins Server <jenk...@builds.apache.org>
Subject Build failed in Jenkins: HBase-TRUNK #2984
Date Mon, 04 Jun 2012 17:09:49 GMT
See <https://builds.apache.org/job/HBase-TRUNK/2984/>

------------------------------------------
[...truncated 2055 lines...]
13 KB   
14 KB   
14 KB   
15 KB   
15 KB   
16 KB   
17 KB   
17 KB   
17 KB   
17 KB   
18 KB   
18 KB   
19 KB   
19 KB   
20 KB   
20 KB   
21 KB   
21 KB   
22 KB   
22 KB   
23 KB   
23 KB   
23 KB   
24 KB   
24 KB   
25 KB   
25 KB   
26 KB   
27 KB   
27 KB   
28 KB   
28 KB   
29 KB   
29 KB   
30 KB   
30 KB   
31 KB   
31 KB   
32 KB   
32 KB   
33 KB   
33 KB   
34 KB   
34 KB   
35 KB   
35 KB   
36 KB   
36 KB   
36 KB   
37 KB   
37 KB   
38 KB   
38 KB   
39 KB   
39 KB   
40 KB   
40 KB   
41 KB   
41 KB   
42 KB   
42 KB   
43 KB   
43 KB   
44 KB   
44 KB   
45 KB   
45 KB   
46 KB   
46 KB   
47 KB   
48 KB   
48 KB   
49 KB   
49 KB   
50 KB   
50 KB   
50 KB   
51 KB   
51 KB   
51 KB   
52 KB   
52 KB   
53 KB   
53 KB   
54 KB   
54 KB   
55 KB   
55 KB   
56 KB   
57 KB   
57 KB   
58 KB   
58 KB   
59 KB   
59 KB   
60 KB   
60 KB   
61 KB   
61 KB   
62 KB   
62 KB   
63 KB   
63 KB   
64 KB   
64 KB   
65 KB   
65 KB   
66 KB   
66 KB   
67 KB   
67 KB   
67 KB   
68 KB   
68 KB   
69 KB   
69 KB   
70 KB   
71 KB   
71 KB   
72 KB   
72 KB   
73 KB   
73 KB   
74 KB   
74 KB   
75 KB   
75 KB   
76 KB   
76 KB   
77 KB   
77 KB   
78 KB   
78 KB   
79 KB   
79 KB   
80 KB   
80 KB   
81 KB   
82 KB   
82 KB   
83 KB   
83 KB   
83 KB   
83 KB   
84 KB   
84 KB   
85 KB   
86 KB   
86 KB   
87 KB   
87 KB   
88 KB   
88 KB   
89 KB   
89 KB   
90 KB   
90 KB   
91 KB   
91 KB   
92 KB   
92 KB   
93 KB   
93 KB   
94 KB   
94 KB   
95 KB   
96 KB   
96 KB   
97 KB   
97 KB   
98 KB   
98 KB   
99 KB   
99 KB   
100 KB   
101 KB   
101 KB   
102 KB   
102 KB   
102 KB   
103 KB   
104 KB   
104 KB   
105 KB   
105 KB   
106 KB   
107 KB   
107 KB   
108 KB   
108 KB   
109 KB   
109 KB   
110 KB   
110 KB   
111 KB   
113 KB   
115 KB   
117 KB   
         
Downloaded: http://repo1.maven.org/maven2/org/apache/maven/plugins/maven-site-plugin/3.1/maven-site-plugin-3.1.jar
(117 KB at 176.9 KB/sec)
[INFO] 
[INFO] >>> maven-javadoc-plugin:2.8.1:aggregate (javadoc) @ hbase >>>
[INFO]                                                                         
[INFO] >>>>>>>>>>>>>>>>>>>>>>>>>>>>>>>>>>>>>>>>>>>>>>>>>>>>>>>>>>>>>>>>>>>>>>>>
[INFO] Forking HBase - Server 0.95-SNAPSHOT
[INFO] >>>>>>>>>>>>>>>>>>>>>>>>>>>>>>>>>>>>>>>>>>>>>>>>>>>>>>>>>>>>>>>>>>>>>>>>
Downloading: http://people.apache.org/~garyh/mvn/org/apache/hbase/hbase-common/0.95-SNAPSHOT/maven-metadata.xml
Downloading: http://repository.apache.org/snapshots/org/apache/hbase/hbase-common/0.95-SNAPSHOT/maven-metadata.xml
Downloading: https://repository.apache.org/content/repositories/releases/org/apache/hbase/hbase-common/0.95-SNAPSHOT/maven-metadata.xml
         
         
         
Downloading: https://repository.apache.org/content/repositories/releases/org/apache/hbase/hbase-common/0.95-SNAPSHOT/hbase-common-0.95-SNAPSHOT.jar
         
Downloading: http://people.apache.org/~garyh/mvn/org/apache/hbase/hbase-common/0.95-SNAPSHOT/hbase-common-0.95-SNAPSHOT.jar
         
Downloading: http://repository.apache.org/snapshots/org/apache/hbase/hbase-common/0.95-SNAPSHOT/hbase-common-0.95-SNAPSHOT.jar
         
[INFO]                                                                         
[INFO] ------------------------------------------------------------------------
[INFO] Skipping HBase
[INFO] This project has been banned from the build due to previous failures.
[INFO] ------------------------------------------------------------------------
[INFO] ------------------------------------------------------------------------
[INFO] Reactor Summary:
[INFO] 
[INFO] HBase ............................................. FAILURE [3.875s]
[INFO] HBase - Common .................................... SKIPPED
[INFO] HBase - Server .................................... SKIPPED
[INFO] ------------------------------------------------------------------------
[INFO] BUILD FAILURE
[INFO] ------------------------------------------------------------------------
[INFO] Total time: 5.861s
[INFO] Finished at: Mon Jun 04 17:09:47 UTC 2012
[INFO] Final Memory: 14M/112M
[INFO] ------------------------------------------------------------------------
[ERROR] Failed to execute goal on project hbase-server: Could not resolve dependencies for
project org.apache.hbase:hbase-server:jar:0.95-SNAPSHOT: Could not find artifact org.apache.hbase:hbase-common:jar:0.95-SNAPSHOT
in apache release (https://repository.apache.org/content/repositories/releases/) -> [Help
1]
[ERROR] 
[ERROR] To see the full stack trace of the errors, re-run Maven with the -e switch.
[ERROR] Re-run Maven using the -X switch to enable full debug logging.
[ERROR] 
[ERROR] For more information about the errors and possible solutions, please read the following
articles:
[ERROR] [Help 1] http://cwiki.apache.org/confluence/display/MAVEN/DependencyResolutionException
[ERROR] 
[ERROR] After correcting the problems, you can resume the build with the command
[ERROR]   mvn <goals> -rf :hbase-server
Build step 'Invoke top-level Maven targets' marked build as failure
Archiving artifacts
Recording test results

Mime
View raw message