hbase-dev mailing list archives

Site index · List index
Message view « Date » · « Thread »
Top « Date » · « Thread »
From Apache Jenkins Server <jenk...@builds.apache.org>
Subject Build failed in Jenkins: HBase-TRUNK #2994
Date Wed, 06 Jun 2012 07:06:04 GMT
See <https://builds.apache.org/job/HBase-TRUNK/2994/>

------------------------------------------
Started by an SCM change
Building remotely on ubuntu3 in workspace <https://builds.apache.org/job/HBase-TRUNK/ws/>
hudson.util.IOException2: remote file operation failed: <https://builds.apache.org/job/HBase-TRUNK/ws/>
at hudson.remoting.Channel@1560a293:ubuntu3
	at hudson.FilePath.act(FilePath.java:835)
	at hudson.FilePath.act(FilePath.java:821)
	at hudson.scm.SubversionSCM.checkout(SubversionSCM.java:743)
	at hudson.scm.SubversionSCM.checkout(SubversionSCM.java:685)
	at hudson.model.AbstractProject.checkout(AbstractProject.java:1218)
	at hudson.model.AbstractBuild$AbstractRunner.checkout(AbstractBuild.java:586)
	at hudson.model.AbstractBuild$AbstractRunner.run(AbstractBuild.java:475)
	at hudson.model.Run.run(Run.java:1434)
	at hudson.model.FreeStyleBuild.run(FreeStyleBuild.java:46)
	at hudson.model.ResourceController.execute(ResourceController.java:88)
	at hudson.model.Executor.run(Executor.java:239)
Caused by: java.io.IOException: Remote call on ubuntu3 failed
	at hudson.remoting.Channel.call(Channel.java:655)
	at hudson.FilePath.act(FilePath.java:828)
	... 10 more
Caused by: java.lang.NoClassDefFoundError: Could not initialize class hudson.model.Hudson
	at hudson.scm.SubversionWorkspaceSelector.syncWorkspaceFormatFromMaster(SubversionWorkspaceSelector.java:85)
	at hudson.scm.SubversionSCM.createSvnClientManager(SubversionSCM.java:823)
	at hudson.scm.SubversionSCM$CheckOutTask.invoke(SubversionSCM.java:766)
	at hudson.scm.SubversionSCM$CheckOutTask.invoke(SubversionSCM.java:753)
	at hudson.FilePath$FileCallableWrapper.call(FilePath.java:2177)
	at hudson.remoting.UserRequest.perform(UserRequest.java:118)
	at hudson.remoting.UserRequest.perform(UserRequest.java:48)
	at hudson.remoting.Request$2.run(Request.java:287)
	at hudson.remoting.InterceptingExecutorService$1.call(InterceptingExecutorService.java:72)
	at java.util.concurrent.FutureTask$Sync.innerRun(FutureTask.java:303)
	at java.util.concurrent.FutureTask.run(FutureTask.java:138)
	at java.util.concurrent.ThreadPoolExecutor$Worker.runTask(ThreadPoolExecutor.java:886)
	at java.util.concurrent.ThreadPoolExecutor$Worker.run(ThreadPoolExecutor.java:908)
	at java.lang.Thread.run(Thread.java:662)
Retrying after 10 seconds
hudson.util.IOException2: remote file operation failed: <https://builds.apache.org/job/HBase-TRUNK/ws/>
at hudson.remoting.Channel@1560a293:ubuntu3
	at hudson.FilePath.act(FilePath.java:835)
	at hudson.FilePath.act(FilePath.java:821)
	at hudson.scm.SubversionSCM.checkout(SubversionSCM.java:743)
	at hudson.scm.SubversionSCM.checkout(SubversionSCM.java:685)
	at hudson.model.AbstractProject.checkout(AbstractProject.java:1218)
	at hudson.model.AbstractBuild$AbstractRunner.checkout(AbstractBuild.java:586)
	at hudson.model.AbstractBuild$AbstractRunner.run(AbstractBuild.java:475)
	at hudson.model.Run.run(Run.java:1434)
	at hudson.model.FreeStyleBuild.run(FreeStyleBuild.java:46)
	at hudson.model.ResourceController.execute(ResourceController.java:88)
	at hudson.model.Executor.run(Executor.java:239)
Caused by: java.io.IOException: Remote call on ubuntu3 failed
	at hudson.remoting.Channel.call(Channel.java:655)
	at hudson.FilePath.act(FilePath.java:828)
	... 10 more
Caused by: java.lang.NoClassDefFoundError: Could not initialize class hudson.model.Hudson
	at hudson.scm.SubversionWorkspaceSelector.syncWorkspaceFormatFromMaster(SubversionWorkspaceSelector.java:85)
	at hudson.scm.SubversionSCM.createSvnClientManager(SubversionSCM.java:823)
	at hudson.scm.SubversionSCM$CheckOutTask.invoke(SubversionSCM.java:766)
	at hudson.scm.SubversionSCM$CheckOutTask.invoke(SubversionSCM.java:753)
	at hudson.FilePath$FileCallableWrapper.call(FilePath.java:2177)
	at hudson.remoting.UserRequest.perform(UserRequest.java:118)
	at hudson.remoting.UserRequest.perform(UserRequest.java:48)
	at hudson.remoting.Request$2.run(Request.java:287)
	at hudson.remoting.InterceptingExecutorService$1.call(InterceptingExecutorService.java:72)
	at java.util.concurrent.FutureTask$Sync.innerRun(FutureTask.java:303)
	at java.util.concurrent.FutureTask.run(FutureTask.java:138)
	at java.util.concurrent.ThreadPoolExecutor$Worker.runTask(ThreadPoolExecutor.java:886)
	at java.util.concurrent.ThreadPoolExecutor$Worker.run(ThreadPoolExecutor.java:908)
	at java.lang.Thread.run(Thread.java:662)
Retrying after 10 seconds
hudson.util.IOException2: remote file operation failed: <https://builds.apache.org/job/HBase-TRUNK/ws/>
at hudson.remoting.Channel@1560a293:ubuntu3
	at hudson.FilePath.act(FilePath.java:835)
	at hudson.FilePath.act(FilePath.java:821)
	at hudson.scm.SubversionSCM.checkout(SubversionSCM.java:743)
	at hudson.scm.SubversionSCM.checkout(SubversionSCM.java:685)
	at hudson.model.AbstractProject.checkout(AbstractProject.java:1218)
	at hudson.model.AbstractBuild$AbstractRunner.checkout(AbstractBuild.java:586)
	at hudson.model.AbstractBuild$AbstractRunner.run(AbstractBuild.java:475)
	at hudson.model.Run.run(Run.java:1434)
	at hudson.model.FreeStyleBuild.run(FreeStyleBuild.java:46)
	at hudson.model.ResourceController.execute(ResourceController.java:88)
	at hudson.model.Executor.run(Executor.java:239)
Caused by: java.io.IOException: Remote call on ubuntu3 failed
	at hudson.remoting.Channel.call(Channel.java:655)
	at hudson.FilePath.act(FilePath.java:828)
	... 10 more
Caused by: java.lang.NoClassDefFoundError: Could not initialize class hudson.model.Hudson
	at hudson.scm.SubversionWorkspaceSelector.syncWorkspaceFormatFromMaster(SubversionWorkspaceSelector.java:85)
	at hudson.scm.SubversionSCM.createSvnClientManager(SubversionSCM.java:823)
	at hudson.scm.SubversionSCM$CheckOutTask.invoke(SubversionSCM.java:766)
	at hudson.scm.SubversionSCM$CheckOutTask.invoke(SubversionSCM.java:753)
	at hudson.FilePath$FileCallableWrapper.call(FilePath.java:2177)
	at hudson.remoting.UserRequest.perform(UserRequest.java:118)
	at hudson.remoting.UserRequest.perform(UserRequest.java:48)
	at hudson.remoting.Request$2.run(Request.java:287)
	at hudson.remoting.InterceptingExecutorService$1.call(InterceptingExecutorService.java:72)
	at java.util.concurrent.FutureTask$Sync.innerRun(FutureTask.java:303)
	at java.util.concurrent.FutureTask.run(FutureTask.java:138)
	at java.util.concurrent.ThreadPoolExecutor$Worker.runTask(ThreadPoolExecutor.java:886)
	at java.util.concurrent.ThreadPoolExecutor$Worker.run(ThreadPoolExecutor.java:908)
	at java.lang.Thread.run(Thread.java:662)
Archiving artifacts
ERROR: Failed to archive artifacts: **/surefire-reports/*,**/site/*,**/*.tar.gz,**/*.txt
hudson.util.IOException2: java.lang.UnsupportedOperationException
	at hudson.FilePath.copyRecursiveTo(FilePath.java:1768)
	at hudson.tasks.ArtifactArchiver.perform(ArtifactArchiver.java:116)
	at hudson.tasks.BuildStepMonitor$1.perform(BuildStepMonitor.java:19)
	at hudson.model.AbstractBuild$AbstractRunner.perform(AbstractBuild.java:710)
	at hudson.model.AbstractBuild$AbstractRunner.performAllBuildSteps(AbstractBuild.java:685)
	at hudson.model.Build$RunnerImpl.post2(Build.java:162)
	at hudson.model.AbstractBuild$AbstractRunner.post(AbstractBuild.java:632)
	at hudson.model.Run.run(Run.java:1459)
	at hudson.model.FreeStyleBuild.run(FreeStyleBuild.java:46)
	at hudson.model.ResourceController.execute(ResourceController.java:88)
	at hudson.model.Executor.run(Executor.java:239)
Caused by: java.util.concurrent.ExecutionException: java.lang.UnsupportedOperationException
	at hudson.remoting.Channel$3.adapt(Channel.java:679)
	at hudson.remoting.Channel$3.adapt(Channel.java:674)
	at hudson.remoting.FutureAdapter.get(FutureAdapter.java:55)
	at hudson.FilePath.copyRecursiveTo(FilePath.java:1766)
	... 10 more
Caused by: java.lang.UnsupportedOperationException
	at hudson.os.PosixAPI$1.getCurrentWorkingDirectory(PosixAPI.java:59)
	at org.jruby.ext.posix.util.ExecIt.run(ExecIt.java:59)
	at org.jruby.ext.posix.util.ExecIt.runAndWait(ExecIt.java:51)
	at org.jruby.ext.posix.JavaLibCHelper.readlink(JavaLibCHelper.java:196)
	at org.jruby.ext.posix.JavaPOSIX.readlink(JavaPOSIX.java:160)
	at hudson.Util.resolveSymlink(Util.java:1067)
	at hudson.Util.resolveSymlink(Util.java:1030)
	at hudson.util.DirScanner$Glob.scan(DirScanner.java:115)
	at hudson.FilePath.writeToTar(FilePath.java:1804)
	at hudson.FilePath.access$1000(FilePath.java:166)
	at hudson.FilePath$36.invoke(FilePath.java:1745)
	at hudson.FilePath$36.invoke(FilePath.java:1742)
	at hudson.FilePath$FileCallableWrapper.call(FilePath.java:2177)
	at hudson.remoting.UserRequest.perform(UserRequest.java:118)
	at hudson.remoting.UserRequest.perform(UserRequest.java:48)
	at hudson.remoting.Request$2.run(Request.java:287)
	at hudson.remoting.InterceptingExecutorService$1.call(InterceptingExecutorService.java:72)
	at java.util.concurrent.FutureTask$Sync.innerRun(FutureTask.java:303)
	at java.util.concurrent.FutureTask.run(FutureTask.java:138)
	at java.util.concurrent.ThreadPoolExecutor$Worker.runTask(ThreadPoolExecutor.java:886)
	at java.util.concurrent.ThreadPoolExecutor$Worker.run(ThreadPoolExecutor.java:908)
	at java.lang.Thread.run(Thread.java:662)
Recording test results
ERROR: Failed to archive test reports
hudson.util.IOException2: remote file operation failed: <https://builds.apache.org/job/HBase-TRUNK/ws/>
at hudson.remoting.Channel@1560a293:ubuntu3
	at hudson.FilePath.act(FilePath.java:835)
	at hudson.FilePath.act(FilePath.java:821)
	at hudson.tasks.junit.JUnitParser.parse(JUnitParser.java:83)
	at hudson.tasks.junit.JUnitResultArchiver.parse(JUnitResultArchiver.java:122)
	at hudson.tasks.junit.JUnitResultArchiver.perform(JUnitResultArchiver.java:134)
	at hudson.tasks.BuildStepMonitor$1.perform(BuildStepMonitor.java:19)
	at hudson.model.AbstractBuild$AbstractRunner.perform(AbstractBuild.java:710)
	at hudson.model.AbstractBuild$AbstractRunner.performAllBuildSteps(AbstractBuild.java:685)
	at hudson.model.Build$RunnerImpl.post2(Build.java:162)
	at hudson.model.AbstractBuild$AbstractRunner.post(AbstractBuild.java:632)
	at hudson.model.Run.run(Run.java:1459)
	at hudson.model.FreeStyleBuild.run(FreeStyleBuild.java:46)
	at hudson.model.ResourceController.execute(ResourceController.java:88)
	at hudson.model.Executor.run(Executor.java:239)
Caused by: java.io.IOException: Remote call on ubuntu3 failed
	at hudson.remoting.Channel.call(Channel.java:655)
	at hudson.FilePath.act(FilePath.java:828)
	... 13 more
Caused by: java.lang.Error: Unable to load resource hudson/Messages.properties
	at hudson.remoting.RemoteClassLoader.findResource(RemoteClassLoader.java:202)
	at java.lang.ClassLoader.getResource(ClassLoader.java:1002)
	at java.lang.Class.getResource(Class.java:2074)
	at org.jvnet.localizer.ResourceBundleHolder.get(ResourceBundleHolder.java:83)
	at org.jvnet.localizer.ResourceBundleHolder.get(ResourceBundleHolder.java:102)
	at org.jvnet.localizer.ResourceBundleHolder.get(ResourceBundleHolder.java:102)
	at org.jvnet.localizer.ResourceBundleHolder.format(ResourceBundleHolder.java:139)
	at hudson.Messages.Util_day(Messages.java:21)
	at hudson.Util.getTimeSpanString(Util.java:588)
	at hudson.tasks.junit.TestResult.parse(TestResult.java:179)
	at hudson.tasks.junit.TestResult.parse(TestResult.java:140)
	at hudson.tasks.junit.TestResult.<init>(TestResult.java:116)
	at hudson.tasks.junit.JUnitParser$ParseResultCallable.invoke(JUnitParser.java:114)
	at hudson.tasks.junit.JUnitParser$ParseResultCallable.invoke(JUnitParser.java:87)
	at hudson.FilePath$FileCallableWrapper.call(FilePath.java:2177)
	at hudson.remoting.UserRequest.perform(UserRequest.java:118)
	at hudson.remoting.UserRequest.perform(UserRequest.java:48)
	at hudson.remoting.Request$2.run(Request.java:287)
	at hudson.remoting.InterceptingExecutorService$1.call(InterceptingExecutorService.java:72)
	at java.util.concurrent.FutureTask$Sync.innerRun(FutureTask.java:303)
	at java.util.concurrent.FutureTask.run(FutureTask.java:138)
	at java.util.concurrent.ThreadPoolExecutor$Worker.runTask(ThreadPoolExecutor.java:886)
	at java.util.concurrent.ThreadPoolExecutor$Worker.run(ThreadPoolExecutor.java:908)
	at java.lang.Thread.run(Thread.java:662)
Caused by: java.io.FileNotFoundException: /tmp/hudson-remoting3632579339362980366/hudson/Messages.properties
(No such file or directory)
	at java.io.FileOutputStream.open(Native Method)
	at java.io.FileOutputStream.<init>(FileOutputStream.java:194)
	at java.io.FileOutputStream.<init>(FileOutputStream.java:145)
	at hudson.remoting.RemoteClassLoader.makeResource(RemoteClassLoader.java:270)
	at hudson.remoting.RemoteClassLoader.findResource(RemoteClassLoader.java:198)
	... 23 more

Mime
View raw message