hbase-dev mailing list archives

Site index · List index
Message view « Date » · « Thread »
Top « Date » · « Thread »
From Apache Jenkins Server <jenk...@builds.apache.org>
Subject Build failed in Jenkins: HBase-TRUNK #2997
Date Thu, 07 Jun 2012 05:10:21 GMT
See <https://builds.apache.org/job/HBase-TRUNK/2997/changes>

Changes:

[stack] HBASE-6182 TestStoreFile fails with jdk1.7

[stack] HBASE-6168 [replication] Add replication zookeeper state documentation to replication.html

[stack] Enable unique disqus id per page

------------------------------------------
[...truncated 8308 lines...]
[INFO] >>>>>>>>>>>>>>>>>>>>>>>>>>>>>>>>>>>>>>>>>>>>>>>>>>>>>>>>>>>>>>>>>>>>>>>>
[INFO] 
[INFO] --- avro-maven-plugin:1.5.3:schema (generate-avro-sources) @ hbase-server ---
[INFO] 
[INFO] --- avro-maven-plugin:1.5.3:protocol (generate-avro-sources) @ hbase-server ---
[INFO] 
[INFO] --- maven-antrun-plugin:1.6:run (generate) @ hbase-server ---
[INFO] Executing tasks

main:
12/06/07 05:09:47 INFO mortbay.log: Logging to org.slf4j.impl.Log4jLoggerAdapter(org.mortbay.log)
via org.mortbay.log.Slf4jLog
[INFO] Executed tasks
[INFO] 
[INFO] --- build-helper-maven-plugin:1.5:add-source (jspcSource-packageInfo-Avro-source) @
hbase-server ---
[INFO] Source directory: <https://builds.apache.org/job/HBase-TRUNK/ws/trunk/hbase-server/target/generated-jamon>
added.
[INFO] Source directory: <https://builds.apache.org/job/HBase-TRUNK/ws/trunk/hbase-server/target/generated-sources/java>
added.
[INFO] 
[INFO] --- jamon-maven-plugin:2.3.4:translate (default) @ hbase-server ---
[INFO] 
[INFO] <<< maven-javadoc-plugin:2.8.1:aggregate (javadoc) @ hbase-common <<<
[INFO] 
[INFO] --- maven-javadoc-plugin:2.8.1:aggregate (javadoc) @ hbase-common ---
[INFO] 
[INFO] --- maven-site-plugin:2.0.1:site (default-site) @ hbase-common ---
[INFO] Parent project loaded from repository.
[INFO] 
[INFO] --- maven-remote-resources-plugin:1.1:process (default) @ hbase-common ---
[INFO] 
[INFO] --- maven-resources-plugin:2.5:resources (default-resources) @ hbase-common ---
[debug] execute contextualize
[INFO] Using 'UTF-8' encoding to copy filtered resources.
[INFO] skip non existing resourceDirectory <https://builds.apache.org/job/HBase-TRUNK/ws/trunk/hbase-common/src/main/resources>
[INFO] Copying 3 resources
[INFO] 
[INFO] --- maven-compiler-plugin:2.0.2:compile (default-compile) @ hbase-common ---
[INFO] Compiling 6 source files to <https://builds.apache.org/job/HBase-TRUNK/ws/trunk/hbase-common/target/classes>
[WARNING] <https://builds.apache.org/job/HBase-TRUNK/ws/trunk/hbase-common/src/main/java/org/apache/hadoop/hbase/util/Bytes.java>:[44,15]
sun.misc.Unsafe is Sun proprietary API and may be removed in a future release

[WARNING] <https://builds.apache.org/job/HBase-TRUNK/ws/trunk/hbase-common/src/main/java/org/apache/hadoop/hbase/util/Bytes.java>:[1040,19]
sun.misc.Unsafe is Sun proprietary API and may be removed in a future release

[WARNING] <https://builds.apache.org/job/HBase-TRUNK/ws/trunk/hbase-common/src/main/java/org/apache/hadoop/hbase/util/Bytes.java>:[1046,21]
sun.misc.Unsafe is Sun proprietary API and may be removed in a future release

[WARNING] <https://builds.apache.org/job/HBase-TRUNK/ws/trunk/hbase-common/src/main/java/org/apache/hadoop/hbase/util/Bytes.java>:[1051,28]
sun.misc.Unsafe is Sun proprietary API and may be removed in a future release

[INFO] 
[INFO] --- maven-resources-plugin:2.5:testResources (default-testResources) @ hbase-common
---
[debug] execute contextualize
[INFO] Using 'UTF-8' encoding to copy filtered resources.
[INFO] skip non existing resourceDirectory <https://builds.apache.org/job/HBase-TRUNK/ws/trunk/hbase-common/src/test/resources>
[INFO] Copying 3 resources
[INFO] 
[INFO] --- maven-compiler-plugin:2.0.2:testCompile (default-testCompile) @ hbase-common ---
[INFO] Compiling 1 source file to <https://builds.apache.org/job/HBase-TRUNK/ws/trunk/hbase-common/target/test-classes>
[INFO] 
[INFO] --- maven-surefire-plugin:2.12-TRUNK-HBASE-2:test (default-test) @ hbase-common ---
[INFO] Surefire report directory: <https://builds.apache.org/job/HBase-TRUNK/ws/trunk/hbase-common/target/surefire-reports>
[INFO] Using configured provider org.apache.maven.surefire.junitcore.JUnitCoreProvider

-------------------------------------------------------
 T E S T S
-------------------------------------------------------
Running org.apache.hadoop.hbase.util.TestBytes
Tests run: 13, Failures: 0, Errors: 0, Skipped: 0, Time elapsed: 0.053 sec

Results :

Tests run: 13, Failures: 0, Errors: 0, Skipped: 0

[INFO] 
[INFO] --- maven-surefire-plugin:2.12-TRUNK-HBASE-2:test (secondPartTestsExecution) @ hbase-common
---
[INFO] Tests are skipped.
[INFO] 
[INFO] --- maven-jar-plugin:2.3:test-jar (default) @ hbase-common ---
[INFO] Building jar: <https://builds.apache.org/job/HBase-TRUNK/ws/trunk/hbase-common/target/hbase-common-0.95-SNAPSHOT-tests.jar>
[INFO] 
[INFO] --- maven-jar-plugin:2.3:jar (default-jar) @ hbase-common ---
[INFO] Building jar: <https://builds.apache.org/job/HBase-TRUNK/ws/trunk/hbase-common/target/hbase-common-0.95-SNAPSHOT.jar>
[INFO] 
[INFO] --- apache-rat-plugin:0.8:check (default) @ hbase-common ---
[INFO] Exclude: **/.*
[INFO] Exclude: **/*.tgz
[INFO] Exclude: **/*.orig
[INFO] Exclude: **/test/**
[INFO] Exclude: **/8e8ab58dcf39412da19833fcd8f687ac
[INFO] Exclude: **/.git/**
[INFO] Exclude: **/.idea/**
[INFO] Exclude: **/target/**
[INFO] Exclude: **/CHANGES.txt
[INFO] Exclude: **/generated/**
[INFO] Exclude: **/conf/*
[INFO] Exclude: **/*.avpr
[INFO] Exclude: **/*.svg
[INFO] Exclude: **/*.vm
[INFO] Exclude: **/control
[INFO] Exclude: **/conffile
[INFO] Exclude: docs/*
[INFO] Exclude: **/src/site/resources/css/freebsd_docbook.css
[INFO]                                                                         
[INFO] ------------------------------------------------------------------------
[INFO] Building HBase - Server 0.95-SNAPSHOT
[INFO] ------------------------------------------------------------------------
[INFO] 
[INFO] >>> maven-javadoc-plugin:2.8.1:aggregate (javadoc) @ hbase-server >>>
[INFO]                                                                         
[INFO] >>>>>>>>>>>>>>>>>>>>>>>>>>>>>>>>>>>>>>>>>>>>>>>>>>>>>>>>>>>>>>>>>>>>>>>>
[INFO] Forking HBase - Server 0.95-SNAPSHOT
[INFO] >>>>>>>>>>>>>>>>>>>>>>>>>>>>>>>>>>>>>>>>>>>>>>>>>>>>>>>>>>>>>>>>>>>>>>>>
[INFO] 
[INFO] --- avro-maven-plugin:1.5.3:schema (generate-avro-sources) @ hbase-server ---
[INFO] 
[INFO] --- avro-maven-plugin:1.5.3:protocol (generate-avro-sources) @ hbase-server ---
[INFO] 
[INFO] --- maven-antrun-plugin:1.6:run (generate) @ hbase-server ---
[INFO] Executing tasks

main:
12/06/07 05:09:52 INFO mortbay.log: Logging to org.slf4j.impl.Log4jLoggerAdapter(org.mortbay.log)
via org.mortbay.log.Slf4jLog
[INFO] Executed tasks
[INFO] 
[INFO] --- build-helper-maven-plugin:1.5:add-source (jspcSource-packageInfo-Avro-source) @
hbase-server ---
[INFO] Source directory: <https://builds.apache.org/job/HBase-TRUNK/ws/trunk/hbase-server/target/generated-jamon>
added.
[INFO] Source directory: <https://builds.apache.org/job/HBase-TRUNK/ws/trunk/hbase-server/target/generated-sources/java>
added.
[INFO] 
[INFO] --- jamon-maven-plugin:2.3.4:translate (default) @ hbase-server ---
[INFO] 
[INFO] <<< maven-javadoc-plugin:2.8.1:aggregate (javadoc) @ hbase-server <<<
[INFO] 
[INFO] --- maven-javadoc-plugin:2.8.1:aggregate (javadoc) @ hbase-server ---
[INFO] 
[INFO] --- maven-site-plugin:2.0.1:site (default-site) @ hbase-server ---
[INFO] Parent project loaded from repository.
[INFO] 
[INFO] --- avro-maven-plugin:1.5.3:schema (generate-avro-sources) @ hbase-server ---
[INFO] 
[INFO] --- avro-maven-plugin:1.5.3:protocol (generate-avro-sources) @ hbase-server ---
[INFO] 
[INFO] --- maven-antrun-plugin:1.6:run (generate) @ hbase-server ---
[INFO] Executing tasks

main:
12/06/07 05:09:53 INFO mortbay.log: Logging to org.slf4j.impl.Log4jLoggerAdapter(org.mortbay.log)
via org.mortbay.log.Slf4jLog
[INFO] Executed tasks
[INFO] 
[INFO] --- build-helper-maven-plugin:1.5:add-source (jspcSource-packageInfo-Avro-source) @
hbase-server ---
[INFO] Source directory: <https://builds.apache.org/job/HBase-TRUNK/ws/trunk/hbase-server/target/generated-jamon>
added.
[INFO] Source directory: <https://builds.apache.org/job/HBase-TRUNK/ws/trunk/hbase-server/target/generated-sources/java>
added.
[INFO] 
[INFO] --- jamon-maven-plugin:2.3.4:translate (default) @ hbase-server ---
[INFO] 
[INFO] --- maven-remote-resources-plugin:1.1:process (default) @ hbase-server ---
[INFO] 
[INFO] --- maven-resources-plugin:2.5:resources (default-resources) @ hbase-server ---
[debug] execute contextualize
[INFO] Using 'UTF-8' encoding to copy filtered resources.
[INFO] Copying 6 resources
[INFO] Copying 1 resource
[INFO] Copying 3 resources
[INFO] 
[INFO] --- maven-compiler-plugin:2.0.2:compile (default-compile) @ hbase-server ---
[INFO] Compiling 762 source files to <https://builds.apache.org/job/HBase-TRUNK/ws/trunk/hbase-server/target/classes>
[INFO]                                                                         
[INFO] ------------------------------------------------------------------------
[INFO] Skipping HBase
[INFO] This project has been banned from the build due to previous failures.
[INFO] ------------------------------------------------------------------------
[INFO] ------------------------------------------------------------------------
[INFO] Reactor Summary:
[INFO] 
[INFO] HBase ............................................. SUCCESS [3:25.435s]
[INFO] HBase - Common .................................... SUCCESS [4.900s]
[INFO] HBase - Server .................................... FAILURE [16.583s]
[INFO] ------------------------------------------------------------------------
[INFO] BUILD FAILURE
[INFO] ------------------------------------------------------------------------
[INFO] Total time: 3:48.874s
[INFO] Finished at: Thu Jun 07 05:10:08 UTC 2012
[INFO] Final Memory: 60M/624M
[INFO] ------------------------------------------------------------------------
[ERROR] Failed to execute goal org.apache.maven.plugins:maven-compiler-plugin:2.0.2:compile
(default-compile) on project hbase-server: Compilation failure: Compilation failure:
[ERROR] <https://builds.apache.org/job/HBase-TRUNK/ws/trunk/hbase-server/src/main/java/org/apache/hadoop/hbase/KeyValue.java>:[2290,21]
cannot find symbol
[ERROR] symbol  : variable DELIMITER
[ERROR] location: class org.apache.hadoop.hbase.HRegionInfo
[ERROR] 
[ERROR] <https://builds.apache.org/job/HBase-TRUNK/ws/trunk/hbase-server/src/main/java/org/apache/hadoop/hbase/KeyValue.java>:[2292,21]
cannot find symbol
[ERROR] symbol  : variable DELIMITER
[ERROR] location: class org.apache.hadoop.hbase.HRegionInfo
[ERROR] 
[ERROR] <https://builds.apache.org/job/HBase-TRUNK/ws/trunk/hbase-server/src/main/java/org/apache/hadoop/hbase/KeyValue.java>:[2312,58]
cannot find symbol
[ERROR] symbol  : variable DELIMITER
[ERROR] location: class org.apache.hadoop.hbase.HRegionInfo
[ERROR] 
[ERROR] <https://builds.apache.org/job/HBase-TRUNK/ws/trunk/hbase-server/src/main/java/org/apache/hadoop/hbase/KeyValue.java>:[2315,21]
cannot find symbol
[ERROR] symbol  : variable DELIMITER
[ERROR] location: class org.apache.hadoop.hbase.HRegionInfo
[ERROR] 
[ERROR] <https://builds.apache.org/job/HBase-TRUNK/ws/trunk/hbase-server/src/main/java/org/apache/hadoop/hbase/KeyValue.java>:[2235,43]
cannot find symbol
[ERROR] symbol  : variable DELIMITER
[ERROR] location: class org.apache.hadoop.hbase.HRegionInfo
[ERROR] 
[ERROR] <https://builds.apache.org/job/HBase-TRUNK/ws/trunk/hbase-server/src/main/java/org/apache/hadoop/hbase/KeyValue.java>:[2239,21]
cannot find symbol
[ERROR] symbol  : variable DELIMITER
[ERROR] location: class org.apache.hadoop.hbase.HRegionInfo
[ERROR] 
[ERROR] <https://builds.apache.org/job/HBase-TRUNK/ws/trunk/hbase-server/src/main/java/org/apache/hadoop/hbase/HRegionInfo.java>:[363,28]
cannot find symbol
[ERROR] symbol  : variable REGIONINFO_DELIMITER
[ERROR] location: class org.apache.hadoop.hbase.HConstants
[ERROR] 
[ERROR] <https://builds.apache.org/job/HBase-TRUNK/ws/trunk/hbase-server/src/main/java/org/apache/hadoop/hbase/HRegionInfo.java>:[368,28]
cannot find symbol
[ERROR] symbol  : variable REGIONINFO_DELIMITER
[ERROR] location: class org.apache.hadoop.hbase.HConstants
[ERROR] 
[ERROR] <https://builds.apache.org/job/HBase-TRUNK/ws/trunk/hbase-server/src/main/java/org/apache/hadoop/hbase/HRegionInfo.java>:[406,37]
cannot find symbol
[ERROR] symbol  : variable REGIONINFO_DELIMITER
[ERROR] location: class org.apache.hadoop.hbase.HConstants
[ERROR] 
[ERROR] <https://builds.apache.org/job/HBase-TRUNK/ws/trunk/hbase-server/src/main/java/org/apache/hadoop/hbase/HRegionInfo.java>:[426,37]
cannot find symbol
[ERROR] symbol  : variable REGIONINFO_DELIMITER
[ERROR] location: class org.apache.hadoop.hbase.HConstants
[ERROR] 
[ERROR] <https://builds.apache.org/job/HBase-TRUNK/ws/trunk/hbase-server/src/main/java/org/apache/hadoop/hbase/HRegionInfo.java>:[436,36]
cannot find symbol
[ERROR] symbol  : variable REGIONINFO_DELIMITER
[ERROR] location: class org.apache.hadoop.hbase.HConstants
[ERROR] 
[ERROR] <https://builds.apache.org/job/HBase-TRUNK/ws/trunk/hbase-server/src/main/java/org/apache/hadoop/hbase/regionserver/GetClosestRowBeforeTracker.java>:[74,13]
cannot find symbol
[ERROR] symbol  : variable REGIONINFO_DELIMITER
[ERROR] location: class org.apache.hadoop.hbase.HConstants
[ERROR] 
[ERROR] <https://builds.apache.org/job/HBase-TRUNK/ws/trunk/hbase-server/src/main/java/org/apache/hadoop/hbase/catalog/MetaReader.java>:[457,46]
cannot find symbol
[ERROR] symbol  : variable REGIONINFO_DELIMITER
[ERROR] location: class org.apache.hadoop.hbase.HConstants
[ERROR] 
[ERROR] <https://builds.apache.org/job/HBase-TRUNK/ws/trunk/hbase-server/src/main/java/org/apache/hadoop/hbase/catalog/MetaReader.java>:[458,46]
cannot find symbol
[ERROR] symbol  : variable REGIONINFO_DELIMITER
[ERROR] location: class org.apache.hadoop.hbase.HConstants
[ERROR] -> [Help 1]
[ERROR] 
[ERROR] To see the full stack trace of the errors, re-run Maven with the -e switch.
[ERROR] Re-run Maven using the -X switch to enable full debug logging.
[ERROR] 
[ERROR] For more information about the errors and possible solutions, please read the following
articles:
[ERROR] [Help 1] http://cwiki.apache.org/confluence/display/MAVEN/MojoFailureException
[ERROR] 
[ERROR] After correcting the problems, you can resume the build with the command
[ERROR]   mvn <goals> -rf :hbase-server
Build step 'Invoke top-level Maven targets' marked build as failure
Archiving artifacts
Recording test results
Updating HBASE-6182
Updating HBASE-6168

Mime
View raw message