hbase-dev mailing list archives

Site index · List index
Message view « Date » · « Thread »
Top « Date » · « Thread »
From Jesse Yates <jesse.k.ya...@gmail.com>
Subject Re: Build failed in Jenkins: HBase-TRUNK #2927
Date Sat, 26 May 2012 23:00:16 GMT
Yeah, it looks like its the site running that was breaking it.
Specifically, building the javadocs it seems. I'm working on it. Thanks for
the hack stack.
-------------------
Jesse Yates
@jesse_yates
jyates.github.com


On Sat, May 26, 2012 at 3:54 PM, Stack <stack@duboce.net> wrote:

> I removed the assembly goal up on jenkins until we've fixed it.
> Removed call to clean and site.  Seems to at least run tests.  Lets
> see how it does (its running now).
> St.Ack
>
> On Sat, May 26, 2012 at 3:34 PM, Apache Jenkins Server
> <jenkins@builds.apache.org> wrote:
> > See <https://builds.apache.org/job/HBase-TRUNK/2927/>
> >
> > ------------------------------------------
> > [...truncated 3785 lines...]
> > not part of the command.
> > [INFO] Executed tasks
> > [INFO]
> > [INFO] --- build-helper-maven-plugin:1.5:add-source
> (jspcSource-packageInfo-Avro-source) @ hbase-server ---
> > [DEBUG] org.codehaus.mojo:build-helper-maven-plugin:jar:1.5:
> > [DEBUG]    org.apache.maven:maven-model:jar:2.0.2:compile
> > [DEBUG]    org.apache.maven:maven-project:jar:2.0.2:compile
> > [DEBUG]       org.apache.maven:maven-profile:jar:2.0.2:compile
> > [DEBUG]       org.apache.maven:maven-artifact-manager:jar:2.0.2:compile
> > [DEBUG]
> org.codehaus.plexus:plexus-container-default:jar:1.0-alpha-9:compile
> > [DEBUG]          junit:junit:jar:3.8.2:test (scope managed from compile)
> (version managed from 3.8.1)
> > [DEBUG]    org.apache.maven:maven-core:jar:2.0.2:compile
> > [DEBUG]       org.apache.maven:maven-settings:jar:2.0.2:compile
> > [DEBUG]
> org.apache.maven:maven-plugin-parameter-documenter:jar:2.0.2:compile
> > [DEBUG]
> org.apache.maven.reporting:maven-reporting-api:jar:2.0.2:compile
> > [DEBUG]
>  org.apache.maven.doxia:doxia-sink-api:jar:1.0-alpha-7:compile
> > [DEBUG]
> org.apache.maven:maven-repository-metadata:jar:2.0.2:compile
> > [DEBUG]       org.apache.maven:maven-error-diagnostics:jar:2.0.2:compile
> > [DEBUG]       org.apache.maven:maven-plugin-registry:jar:2.0.2:compile
> > [DEBUG]       commons-cli:commons-cli:jar:1.0:compile
> > [DEBUG]       org.apache.maven:maven-plugin-descriptor:jar:2.0.2:compile
> > [DEBUG]
> org.codehaus.plexus:plexus-interactivity-api:jar:1.0-alpha-4:compile
> > [DEBUG]       org.apache.maven:maven-monitor:jar:2.0.2:compile
> > [DEBUG]       classworlds:classworlds:jar:1.1:compile
> > [DEBUG]    org.apache.maven:maven-plugin-api:jar:2.0.2:compile
> > [DEBUG]    org.apache.maven:maven-artifact:jar:2.0.2:compile
> > [DEBUG]    org.codehaus.plexus:plexus-utils:jar:1.5.8:compile
> > [DEBUG] Created new class realm
> plugin>org.codehaus.mojo:build-helper-maven-plugin:1.5
> > [DEBUG] Importing foreign packages into class realm
> plugin>org.codehaus.mojo:build-helper-maven-plugin:1.5
> > [DEBUG]   Imported:  < maven.api
> > [DEBUG] Populating class realm
> plugin>org.codehaus.mojo:build-helper-maven-plugin:1.5
> > [DEBUG]   Included: org.codehaus.mojo:build-helper-maven-plugin:jar:1.5
> > [DEBUG]   Included:
> org.apache.maven.reporting:maven-reporting-api:jar:2.0.2
> > [DEBUG]   Included: org.apache.maven.doxia:doxia-sink-api:jar:1.0-alpha-7
> > [DEBUG]   Included: commons-cli:commons-cli:jar:1.0
> > [DEBUG]   Included:
> org.codehaus.plexus:plexus-interactivity-api:jar:1.0-alpha-4
> > [DEBUG]   Included: org.codehaus.plexus:plexus-utils:jar:1.5.8
> > [DEBUG]   Excluded: org.apache.maven:maven-model:jar:2.0.2
> > [DEBUG]   Excluded: org.apache.maven:maven-project:jar:2.0.2
> > [DEBUG]   Excluded: org.apache.maven:maven-profile:jar:2.0.2
> > [DEBUG]   Excluded: org.apache.maven:maven-artifact-manager:jar:2.0.2
> > [DEBUG]   Excluded:
> org.codehaus.plexus:plexus-container-default:jar:1.0-alpha-9
> > [DEBUG]   Excluded: junit:junit:jar:3.8.2
> > [DEBUG]   Excluded: org.apache.maven:maven-core:jar:2.0.2
> > [DEBUG]   Excluded: org.apache.maven:maven-settings:jar:2.0.2
> > [DEBUG]   Excluded:
> org.apache.maven:maven-plugin-parameter-documenter:jar:2.0.2
> > [DEBUG]   Excluded: org.apache.maven:maven-repository-metadata:jar:2.0.2
> > [DEBUG]   Excluded: org.apache.maven:maven-error-diagnostics:jar:2.0.2
> > [DEBUG]   Excluded: org.apache.maven:maven-plugin-registry:jar:2.0.2
> > [DEBUG]   Excluded: org.apache.maven:maven-plugin-descriptor:jar:2.0.2
> > [DEBUG]   Excluded: org.apache.maven:maven-monitor:jar:2.0.2
> > [DEBUG]   Excluded: classworlds:classworlds:jar:1.1
> > [DEBUG]   Excluded: org.apache.maven:maven-plugin-api:jar:2.0.2
> > [DEBUG]   Excluded: org.apache.maven:maven-artifact:jar:2.0.2
> > [DEBUG] Configuring mojo
> org.codehaus.mojo:build-helper-maven-plugin:1.5:add-source from plugin
> realm ClassRealm[plugin>org.codehaus.mojo:build-helper-maven-plugin:1.5,
> parent: sun.misc.Launcher$AppClassLoader@192d342]
> > [DEBUG] Configuring mojo
> 'org.codehaus.mojo:build-helper-maven-plugin:1.5:add-source' with basic
> configurator -->
> > [DEBUG]   (f) project = MavenProject:
> org.apache.hbase:hbase-server:0.95-SNAPSHOT @ <
> https://builds.apache.org/job/HBase-TRUNK/ws/trunk/hbase-server/pom.xml>
> > [DEBUG]   (f) sources = [<
> https://builds.apache.org/job/HBase-TRUNK/ws/trunk/hbase-server/target/generated-jamon,>
> <
> https://builds.apache.org/job/HBase-TRUNK/ws/trunk/hbase-server/target/generated-sources/java
> ]>
> > [DEBUG] -- end configuration --
> > [INFO] Source directory: <
> https://builds.apache.org/job/HBase-TRUNK/ws/trunk/hbase-server/target/generated-jamon>
> added.
> > [INFO] Source directory: <
> https://builds.apache.org/job/HBase-TRUNK/ws/trunk/hbase-server/target/generated-sources/java>
> added.
> > [INFO]
> > [INFO] --- jamon-maven-plugin:2.3.4:translate (default) @ hbase-server
> ---
> > [DEBUG] org.jamon:jamon-maven-plugin:jar:2.3.4:
> > [DEBUG]    org.jamon:jamon-processor:jar:2.3.4:compile
> > [DEBUG]       org.jamon:jamon-runtime:jar:2.3.1:compile
> > [DEBUG]       org.jamon:jamon-api:jar:2.3.0:compile
> > [DEBUG]    org.codehaus.plexus:plexus-compiler-api:jar:1.8.1:compile
> > [DEBUG]       org.codehaus.plexus:plexus-utils:jar:1.5.5:compile
> > [DEBUG]    org.apache.maven:maven-plugin-api:jar:2.0:compile
> > [DEBUG]    org.apache.maven:maven-project:jar:2.0:compile
> > [DEBUG]       org.apache.maven:maven-profile:jar:2.0:compile
> > [DEBUG]       org.apache.maven:maven-model:jar:2.0:compile
> > [DEBUG]       org.apache.maven:maven-artifact-manager:jar:2.0:compile
> > [DEBUG]
>  org.apache.maven:maven-repository-metadata:jar:2.0:compile
> > [DEBUG]       org.apache.maven:maven-artifact:jar:2.0:compile
> > [DEBUG]
> org.codehaus.plexus:plexus-container-default:jar:1.0-alpha-8:compile
> > [DEBUG]          junit:junit:jar:3.8.1:compile
> > [DEBUG]          classworlds:classworlds:jar:1.1-alpha-2:compile
> > [DEBUG] Created new class realm plugin>org.jamon:jamon-maven-plugin:2.3.4
> > [DEBUG] Importing foreign packages into class realm
> plugin>org.jamon:jamon-maven-plugin:2.3.4
> > [DEBUG]   Imported:  < maven.api
> > [DEBUG] Populating class realm plugin>org.jamon:jamon-maven-plugin:2.3.4
> > [DEBUG]   Included: org.jamon:jamon-maven-plugin:jar:2.3.4
> > [DEBUG]   Included: org.jamon:jamon-processor:jar:2.3.4
> > [DEBUG]   Included: org.jamon:jamon-runtime:jar:2.3.1
> > [DEBUG]   Included: org.jamon:jamon-api:jar:2.3.0
> > [DEBUG]   Included: org.codehaus.plexus:plexus-compiler-api:jar:1.8.1
> > [DEBUG]   Included: org.codehaus.plexus:plexus-utils:jar:1.5.5
> > [DEBUG]   Included: junit:junit:jar:3.8.1
> > [DEBUG]   Excluded: org.apache.maven:maven-plugin-api:jar:2.0
> > [DEBUG]   Excluded: org.apache.maven:maven-project:jar:2.0
> > [DEBUG]   Excluded: org.apache.maven:maven-profile:jar:2.0
> > [DEBUG]   Excluded: org.apache.maven:maven-model:jar:2.0
> > [DEBUG]   Excluded: org.apache.maven:maven-artifact-manager:jar:2.0
> > [DEBUG]   Excluded: org.apache.maven:maven-repository-metadata:jar:2.0
> > [DEBUG]   Excluded: org.apache.maven:maven-artifact:jar:2.0
> > [DEBUG]   Excluded:
> org.codehaus.plexus:plexus-container-default:jar:1.0-alpha-8
> > [DEBUG]   Excluded: classworlds:classworlds:jar:1.1-alpha-2
> > [DEBUG] Configuring mojo org.jamon:jamon-maven-plugin:2.3.4:translate
> from plugin realm ClassRealm[plugin>org.jamon:jamon-maven-plugin:2.3.4,
> parent: sun.misc.Launcher$AppClassLoader@192d342]
> > [DEBUG] Configuring mojo 'org.jamon:jamon-maven-plugin:2.3.4:translate'
> with basic configurator -->
> > [DEBUG]   (f) project = MavenProject:
> org.apache.hbase:hbase-server:0.95-SNAPSHOT @ <
> https://builds.apache.org/job/HBase-TRUNK/ws/trunk/hbase-server/pom.xml>
> > [DEBUG]   (f) staleMillis = 0
> > [DEBUG]   (f) templateOutputDir = <
> https://builds.apache.org/job/HBase-TRUNK/ws/trunk/hbase-server/target/generated-jamon
> >
> > [DEBUG]   (f) templateSourceDir = <
> https://builds.apache.org/job/HBase-TRUNK/ws/trunk/hbase-server/src/main/jamon
> >
> > [DEBUG] -- end configuration --
> > [INFO] Translating 4 templates from <
> https://builds.apache.org/job/HBase-TRUNK/ws/trunk/hbase-server/src/main/jamon>
> to <
> https://builds.apache.org/job/HBase-TRUNK/ws/trunk/hbase-server/target/generated-jamon
> >
> > [DEBUG] URLs are: [<
> https://builds.apache.org/job/HBase-TRUNK/ws/trunk/hbase-server/target/test-classes/,>
> <
> https://builds.apache.org/job/HBase-TRUNK/ws/trunk/hbase-server/target/classes/,>
> file:/home/jenkins/.m2/repository/com/google/guava/guava/11.0.2/guava-11.0.2.jar,
> file:/home/jenkins/.m2/repository/com/google/code/findbugs/jsr305/1.3.9/jsr305-1.3.9.jar,
> file:/home/jenkins/.m2/repository/commons-cli/commons-cli/1.2/commons-cli-1.2.jar,
> file:/home/jenkins/.m2/repository/commons-configuration/commons-configuration/1.6/commons-configuration-1.6.jar,
> file:/home/jenkins/.m2/repository/commons-collections/commons-collections/3.2.1/commons-collections-3.2.1.jar,
> file:/home/jenkins/.m2/repository/commons-digester/commons-digester/1.8/commons-digester-1.8.jar,
> file:/home/jenkins/.m2/repository/commons-beanutils/commons-beanutils/1.7.0/commons-beanutils-1.7.0.jar,
> file:/home/jenkins/.m2/repository/commons-beanutils/commons-beanutils-core/1.8.0/commons-beanutils-core-1.8.0.jar,
> file:/home/jenkins/.m2/repository/com/github/stephenc/high-scale-lib/high-scale-lib/1.1.1/high-scale-lib-1.1.1.jar,
> file:/home/jenkins/.m2/repository/commons-codec/commons-codec/1.4/commons-codec-1.4.jar,
> file:/home/jenkins/.m2/repository/commons-httpclient/commons-httpclient/3.1/commons-httpclient-3.1.jar,
> file:/home/jenkins/.m2/repository/commons-io/commons-io/2.1/commons-io-2.1.jar,
> file:/home/jenkins/.m2/repository/commons-lang/commons-lang/2.5/commons-lang-2.5.jar,
> file:/home/jenkins/.m2/repository/commons-logging/commons-logging/1.1.1/commons-logging-1.1.1.jar,
> file:/home/jenkins/.m2/repository/log4j/log4j/1.2.16/log4j-1.2.16.jar,
> file:/home/jenkins/.m2/repository/org/apache/avro/avro/1.5.3/avro-1.5.3.jar,
> file:/home/jenkins/.m2/repository/org/xerial/snappy/snappy-java/
> 1.0.3.2/snappy-java-1.0.3.2.jar,
> file:/home/jenkins/.m2/repository/org/apache/avro/avro-ipc/1.5.3/avro-ipc-1.5.3.jar,
> file:/home/jenkins/.m2/repository/org/jboss/netty/netty/3.2.4.Final/netty-3.2.4.Final.jar,
> file:/home/jenkins/.m2/repository/org/apache/velocity/velocity/1.7/velocity-1.7.jar,
> file:/home/jenkins/.m2/repository/org/apache/zookeeper/zookeeper/3.4.3/zookeeper-3.4.3.jar,
> file:/home/jenkins/.m2/repository/org/apache/thrift/libthrift/0.8.0/libthrift-0.8.0.jar,
> file:/home/jenkins/.m2/repository/org/apache/httpcomponents/httpclient/4.1.2/httpclient-4.1.2.jar,
> file:/home/jenkins/.m2/repository/org/apache/httpcomponents/httpcore/4.1.3/httpcore-4.1.3.jar,
> file:/home/jenkins/.m2/repository/org/jruby/jruby-complete/1.6.5/jruby-complete-1.6.5.jar,
> file:/home/jenkins/.m2/repository/org/mortbay/jetty/jetty/6.1.26/jetty-6.1.26.jar,
> file:/home/jenkins/.m2/repository/org/mortbay/jetty/jetty-util/6.1.26/jetty-util-6.1.26.jar,
> file:/home/jenkins/.m2/repository/org/mortbay/jetty/jsp-2.1/6.1.14/jsp-2.1-6.1.14.jar,
> file:/home/jenkins/.m2/repository/org/eclipse/jdt/core/3.1.1/core-3.1.1.jar,
> file:/home/jenkins/.m2/repository/org/mortbay/jetty/jsp-api-2.1/6.1.14/jsp-api-2.1-6.1.14.jar,
> file:/home/jenkins/.m2/repository/org/mortbay/jetty/servlet-api-2.5/6.1.14/servlet-api-2.5-6.1.14.jar,
> file:/home/jenkins/.m2/repository/org/codehaus/jackson/jackson-core-asl/1.8.8/jackson-core-asl-1.8.8.jar,
> file:/home/jenkins/.m2/repository/org/codehaus/jackson/jackson-mapper-asl/1.8.8/jackson-mapper-asl-1.8.8.jar,
> file:/home/jenkins/.m2/repository/org/codehaus/jackson/jackson-jaxrs/1.8.8/jackson-jaxrs-1.8.8.jar,
> file:/home/jenkins/.m2/repository/org/codehaus/jackson/jackson-xc/1.8.8/jackson-xc-1.8.8.jar,
> file:/home/jenkins/.m2/repository/org/slf4j/slf4j-api/1.4.3/slf4j-api-1.4.3.jar,
> file:/home/jenkins/.m2/repository/org/slf4j/slf4j-log4j12/1.4.3/slf4j-log4j12-1.4.3.jar,
> file:/home/jenkins/.m2/repository/tomcat/jasper-compiler/5.5.23/jasper-compiler-5.5.23.jar,
> file:/home/jenkins/.m2/repository/tomcat/jasper-runtime/5.5.23/jasper-runtime-5.5.23.jar,
> file:/home/jenkins/.m2/repository/commons-el/commons-el/1.0/commons-el-1.0.jar,
> file:/home/jenkins/.m2/repository/org/jamon/jamon-runtime/2.3.1/jamon-runtime-2.3.1.jar,
> file:/home/jenkins/.m2/repository/com/google/protobuf/protobuf-java/2.4.0a/protobuf-java-2.4.0a.jar,
> file:/home/jenkins/.m2/repository/com/sun/jersey/jersey-core/1.4/jersey-core-1.4.jar,
> file:/home/jenkins/.m2/repository/com/sun/jersey/jersey-json/1.4/jersey-json-1.4.jar,
> file:/home/jenkins/.m2/repository/org/codehaus/jettison/jettison/1.1/jettison-1.1.jar,
> file:/home/jenkins/.m2/repository/com/sun/xml/bind/jaxb-impl/2.1.12/jaxb-impl-2.1.12.jar,
> file:/home/jenkins/.m2/repository/com/sun/jersey/jersey-server/1.4/jersey-server-1.4.jar,
> file:/home/jenkins/.m2/repository/asm/asm/3.1/asm-3.1.jar,
> file:/home/jenkins/.m2/repository/javax/xml/bind/jaxb-api/2.1/jaxb-api-2.1.jar,
> file:/home/jenkins/.m2/repository/javax/activation/activation/1.1/activation-1.1.jar,
> file:/home/jenkins/.m2/repository/stax/stax-api/1.0.1/stax-api-1.0.1.jar,
> file:/home/jenkins/.m2/repository/org/apache/hadoop/hadoop-core/1.0.3/hadoop-core-1.0.3.jar,
> file:/home/jenkins/.m2/repository/xmlenc/xmlenc/0.52/xmlenc-0.52.jar,
> file:/home/jenkins/.m2/repository/commons-net/commons-net/1.4.1/commons-net-1.4.1.jar]
> > [INFO]
> > [INFO]
> >>>>>>>>>>>>>>>>>>>>>>>>>>>>>>>>>>>>>>>>>>>>>>>>>>>>>>>>>>>>>>>>>>>>>>>>
> > [INFO] Forking HBase - Assembly 0.95-SNAPSHOT
> > [INFO]
> >>>>>>>>>>>>>>>>>>>>>>>>>>>>>>>>>>>>>>>>>>>>>>>>>>>>>>>>>>>>>>>>>>>>>>>>
> > [DEBUG] Could not find metadata
> org.apache.hbase:hbase-server:0.95-SNAPSHOT/maven-metadata.xml in local
> (/home/jenkins/.m2/repository)
> > [DEBUG] Failure to find
> org.apache.hbase:hbase-server:0.95-SNAPSHOT/maven-metadata.xml in
> https://repository.apache.org/content/repositories/releases/ was cached
> in the local repository, resolution will not be reattempted until the
> update interval of apache release has elapsed or updates are forced
> > [DEBUG] Failure to find
> org.apache.hbase:hbase-server:0.95-SNAPSHOT/maven-metadata.xml in
> http://people.apache.org/~garyh/mvn/ was cached in the local repository,
> resolution will not be reattempted until the update interval of
> ghelmling.testing has elapsed or updates are forced
> > [DEBUG] Failure to find
> org.apache.hbase:hbase-server:0.95-SNAPSHOT/maven-metadata.xml in
> http://repository.apache.org/snapshots was cached in the local
> repository, resolution will not be reattempted until the update interval of
> Nexus has elapsed or updates are forced
> > [DEBUG] org.apache.hbase:hbase-assembly:jar:0.95-SNAPSHOT
> > [DEBUG]    org.apache.hbase:hbase-server:jar:0.95-SNAPSHOT:compile
> > [DEBUG]       com.google.guava:guava:jar:11.0.2:compile
> > [DEBUG]          com.google.code.findbugs:jsr305:jar:1.3.9:compile
> > [DEBUG]       commons-cli:commons-cli:jar:1.2:compile
> > [DEBUG]       commons-configuration:commons-configuration:jar:1.6:compile
> > [DEBUG]
>  commons-collections:commons-collections:jar:3.2.1:compile
> > [DEBUG]          commons-digester:commons-digester:jar:1.8:compile
> > [DEBUG]             commons-beanutils:commons-beanutils:jar:1.7.0:compile
> > [DEBUG]
>  commons-beanutils:commons-beanutils-core:jar:1.8.0:compile
> > [DEBUG]
> com.github.stephenc.high-scale-lib:high-scale-lib:jar:1.1.1:compile
> > [DEBUG]       commons-codec:commons-codec:jar:1.4:compile
> > [DEBUG]       commons-httpclient:commons-httpclient:jar:3.1:compile
> > [DEBUG]       commons-io:commons-io:jar:2.1:compile
> > [DEBUG]       commons-lang:commons-lang:jar:2.5:compile
> > [DEBUG]       commons-logging:commons-logging:jar:1.1.1:compile
> > [DEBUG]       log4j:log4j:jar:1.2.16:compile
> > [DEBUG]       org.apache.avro:avro:jar:1.5.3:compile
> > [DEBUG]          org.xerial.snappy:snappy-java:jar:1.0.3.2:compile
> > [DEBUG]       org.apache.avro:avro-ipc:jar:1.5.3:compile
> > [DEBUG]          org.jboss.netty:netty:jar:3.2.4.Final:compile
> > [DEBUG]          org.apache.velocity:velocity:jar:1.7:compile
> > [DEBUG]       org.apache.zookeeper:zookeeper:jar:3.4.3:compile
> > [DEBUG]       org.apache.thrift:libthrift:jar:0.8.0:compile
> > [DEBUG]          org.apache.httpcomponents:httpclient:jar:4.1.2:compile
> > [DEBUG]          org.apache.httpcomponents:httpcore:jar:4.1.3:compile
> > [DEBUG]       org.jruby:jruby-complete:jar:1.6.5:compile
> > [DEBUG]       org.mortbay.jetty:jetty:jar:6.1.26:compile
> > [DEBUG]       org.mortbay.jetty:jetty-util:jar:6.1.26:compile
> > [DEBUG]       org.mortbay.jetty:jsp-2.1:jar:6.1.14:compile
> > [DEBUG]          org.eclipse.jdt:core:jar:3.1.1:compile
> > [DEBUG]       org.mortbay.jetty:jsp-api-2.1:jar:6.1.14:compile
> > [DEBUG]       org.mortbay.jetty:servlet-api-2.5:jar:6.1.14:compile
> > [DEBUG]       org.codehaus.jackson:jackson-core-asl:jar:1.8.8:compile
> > [DEBUG]       org.codehaus.jackson:jackson-mapper-asl:jar:1.8.8:compile
> > [DEBUG]       org.codehaus.jackson:jackson-jaxrs:jar:1.8.8:compile
> > [DEBUG]       org.codehaus.jackson:jackson-xc:jar:1.8.8:compile
> > [DEBUG]       org.slf4j:slf4j-api:jar:1.4.3:compile
> > [DEBUG]       org.slf4j:slf4j-log4j12:jar:1.4.3:compile
> > [DEBUG]       tomcat:jasper-compiler:jar:5.5.23:runtime
> > [DEBUG]       tomcat:jasper-runtime:jar:5.5.23:runtime
> > [DEBUG]          commons-el:commons-el:jar:1.0:compile
> > [DEBUG]       org.jamon:jamon-runtime:jar:2.3.1:compile
> > [DEBUG]       com.google.protobuf:protobuf-java:jar:2.4.0a:compile
> > [DEBUG]       com.sun.jersey:jersey-core:jar:1.4:compile
> > [DEBUG]       com.sun.jersey:jersey-json:jar:1.4:compile
> > [DEBUG]          org.codehaus.jettison:jettison:jar:1.1:compile
> > [DEBUG]          com.sun.xml.bind:jaxb-impl:jar:2.1.12:compile
> > [DEBUG]       com.sun.jersey:jersey-server:jar:1.4:compile
> > [DEBUG]          asm:asm:jar:3.1:compile
> > [DEBUG]       javax.xml.bind:jaxb-api:jar:2.1:compile
> > [DEBUG]          javax.activation:activation:jar:1.1:compile
> > [DEBUG]       stax:stax-api:jar:1.0.1:compile
> > [DEBUG]       org.apache.hadoop:hadoop-core:jar:1.0.3:compile
> > [DEBUG]          xmlenc:xmlenc:jar:0.52:compile
> > [DEBUG]          org.apache.commons:commons-math:jar:2.1:test (scope
> managed from compile by org.apache.hbase:hbase:0.95-SNAPSHOT)
> > [DEBUG]          commons-net:commons-net:jar:1.4.1:compile
> > [DEBUG]    junit:junit:jar:4.10-HBASE-1:test
> > [DEBUG]    org.mockito:mockito-all:jar:1.8.5:test
> > [DEBUG] Could not find metadata
> org.apache.hbase:hbase-server:0.95-SNAPSHOT/maven-metadata.xml in local
> (/home/jenkins/.m2/repository)
> > [DEBUG] Failure to find
> org.apache.hbase:hbase-server:0.95-SNAPSHOT/maven-metadata.xml in
> https://repository.apache.org/content/repositories/releases/ was cached
> in the local repository, resolution will not be reattempted until the
> update interval of apache release has elapsed or updates are forced
> > [DEBUG] Failure to find
> org.apache.hbase:hbase-server:0.95-SNAPSHOT/maven-metadata.xml in
> http://people.apache.org/~garyh/mvn/ was cached in the local repository,
> resolution will not be reattempted until the update interval of
> ghelmling.testing has elapsed or updates are forced
> > [DEBUG] Failure to find
> org.apache.hbase:hbase-server:0.95-SNAPSHOT/maven-metadata.xml in
> http://repository.apache.org/snapshots was cached in the local
> repository, resolution will not be reattempted until the update interval of
> Nexus has elapsed or updates are forced
> > [INFO]
> ------------------------------------------------------------------------
> > [INFO] Reactor Summary:
> > [INFO]
> > [INFO] HBase ............................................. FAILURE
> [6.407s]
> > [INFO] HBase - Server .................................... SKIPPED
> > [INFO] HBase - Assembly .................................. SKIPPED
> > [INFO] HBase - Site ...................................... SKIPPED
> > [INFO]
> ------------------------------------------------------------------------
> > [INFO] BUILD FAILURE
> > [INFO]
> ------------------------------------------------------------------------
> > [INFO] Total time: 7.625s
> > [INFO] Finished at: Sat May 26 22:34:16 UTC 2012
> > [INFO] Final Memory: 17M/147M
> > [INFO]
> ------------------------------------------------------------------------
> > [ERROR] Failed to execute goal on project hbase-assembly: Could not
> resolve dependencies for project
> org.apache.hbase:hbase-assembly:jar:0.95-SNAPSHOT: Failure to find
> org.apache.hbase:hbase-server:jar:0.95-SNAPSHOT in
> https://repository.apache.org/content/repositories/releases/ was cached
> in the local repository, resolution will not be reattempted until the
> update interval of apache release has elapsed or updates are forced ->
> [Help 1]
> > org.apache.maven.lifecycle.LifecycleExecutionException: Failed to
> execute goal on project hbase-assembly: Could not resolve dependencies for
> project org.apache.hbase:hbase-assembly:jar:0.95-SNAPSHOT: Failure to find
> org.apache.hbase:hbase-server:jar:0.95-SNAPSHOT in
> https://repository.apache.org/content/repositories/releases/ was cached
> in the local repository, resolution will not be reattempted until the
> update interval of apache release has elapsed or updates are forced
> >        at
> org.apache.maven.lifecycle.internal.LifecycleDependencyResolver.getDependencies(LifecycleDependencyResolver.java:196)
> >        at
> org.apache.maven.lifecycle.internal.LifecycleDependencyResolver.resolveProjectDependencies(LifecycleDependencyResolver.java:108)
> >        at
> org.apache.maven.lifecycle.internal.MojoExecutor.ensureDependenciesAreResolved(MojoExecutor.java:258)
> >        at
> org.apache.maven.lifecycle.internal.MojoExecutor.execute(MojoExecutor.java:201)
> >        at
> org.apache.maven.lifecycle.internal.MojoExecutor.execute(MojoExecutor.java:153)
> >        at
> org.apache.maven.lifecycle.internal.MojoExecutor.execute(MojoExecutor.java:145)
> >        at
> org.apache.maven.lifecycle.internal.MojoExecutor.executeForkedExecutions(MojoExecutor.java:365)
> >        at
> org.apache.maven.lifecycle.internal.MojoExecutor.execute(MojoExecutor.java:199)
> >        at
> org.apache.maven.lifecycle.internal.MojoExecutor.execute(MojoExecutor.java:153)
> >        at
> org.apache.maven.lifecycle.internal.MojoExecutor.execute(MojoExecutor.java:145)
> >        at
> org.apache.maven.lifecycle.internal.LifecycleModuleBuilder.buildProject(LifecycleModuleBuilder.java:84)
> >        at
> org.apache.maven.lifecycle.internal.LifecycleModuleBuilder.buildProject(LifecycleModuleBuilder.java:59)
> >        at
> org.apache.maven.lifecycle.internal.LifecycleStarter.singleThreadedBuild(LifecycleStarter.java:183)
> >        at
> org.apache.maven.lifecycle.internal.LifecycleStarter.execute(LifecycleStarter.java:161)
> >        at org.apache.maven.DefaultMaven.doExecute(DefaultMaven.java:319)
> >        at org.apache.maven.DefaultMaven.execute(DefaultMaven.java:156)
> >        at org.apache.maven.cli.MavenCli.execute(MavenCli.java:537)
> >        at org.apache.maven.cli.MavenCli.doMain(MavenCli.java:196)
> >        at org.apache.maven.cli.MavenCli.main(MavenCli.java:141)
> >        at sun.reflect.NativeMethodAccessorImpl.invoke0(Native Method)
> >        at
> sun.reflect.NativeMethodAccessorImpl.invoke(NativeMethodAccessorImpl.java:39)
> >        at
> sun.reflect.DelegatingMethodAccessorImpl.invoke(DelegatingMethodAccessorImpl.java:25)
> >        at java.lang.reflect.Method.invoke(Method.java:597)
> >        at
> org.codehaus.plexus.classworlds.launcher.Launcher.launchEnhanced(Launcher.java:290)
> >        at
> org.codehaus.plexus.classworlds.launcher.Launcher.launch(Launcher.java:230)
> >        at
> org.codehaus.plexus.classworlds.launcher.Launcher.mainWithExitCode(Launcher.java:409)
> >        at
> org.codehaus.plexus.classworlds.launcher.Launcher.main(Launcher.java:352)
> > Caused by: org.apache.maven.project.DependencyResolutionException: Could
> not resolve dependencies for project
> org.apache.hbase:hbase-assembly:jar:0.95-SNAPSHOT: Failure to find
> org.apache.hbase:hbase-server:jar:0.95-SNAPSHOT in
> https://repository.apache.org/content/repositories/releases/ was cached
> in the local repository, resolution will not be reattempted until the
> update interval of apache release has elapsed or updates are forced
> >        at
> org.apache.maven.project.DefaultProjectDependenciesResolver.resolve(DefaultProjectDependenciesResolver.java:170)
> >        at
> org.apache.maven.lifecycle.internal.LifecycleDependencyResolver.getDependencies(LifecycleDependencyResolver.java:171)
> >        ... 26 more
> > Caused by: org.sonatype.aether.resolution.DependencyResolutionException:
> Failure to find org.apache.hbase:hbase-server:jar:0.95-SNAPSHOT in
> https://repository.apache.org/content/repositories/releases/ was cached
> in the local repository, resolution will not be reattempted until the
> update interval of apache release has elapsed or updates are forced
> >        at
> org.sonatype.aether.impl.internal.DefaultRepositorySystem.resolveDependencies(DefaultRepositorySystem.java:412)
> >        at
> org.apache.maven.project.DefaultProjectDependenciesResolver.resolve(DefaultProjectDependenciesResolver.java:164)
> >        ... 27 more
> > Caused by: org.sonatype.aether.resolution.ArtifactResolutionException:
> Failure to find org.apache.hbase:hbase-server:jar:0.95-SNAPSHOT in
> https://repository.apache.org/content/repositories/releases/ was cached
> in the local repository, resolution will not be reattempted until the
> update interval of apache release has elapsed or updates are forced
> >        at
> org.sonatype.aether.impl.internal.DefaultArtifactResolver.resolve(DefaultArtifactResolver.java:541)
> >        at
> org.sonatype.aether.impl.internal.DefaultArtifactResolver.resolveArtifacts(DefaultArtifactResolver.java:220)
> >        at
> org.sonatype.aether.impl.internal.DefaultRepositorySystem.resolveDependencies(DefaultRepositorySystem.java:395)
> >        ... 28 more
> > Caused by: org.sonatype.aether.transfer.ArtifactNotFoundException:
> Failure to find org.apache.hbase:hbase-server:jar:0.95-SNAPSHOT in
> https://repository.apache.org/content/repositories/releases/ was cached
> in the local repository, resolution will not be reattempted until the
> update interval of apache release has elapsed or updates are forced
> >        at
> org.sonatype.aether.impl.internal.DefaultUpdateCheckManager.checkArtifact(DefaultUpdateCheckManager.java:190)
> >        at
> org.sonatype.aether.impl.internal.DefaultArtifactResolver.resolve(DefaultArtifactResolver.java:430)
> >        ... 30 more
> > [ERROR]
> > [ERROR]
> > [ERROR] For more information about the errors and possible solutions,
> please read the following articles:
> > [ERROR] [Help 1]
> http://cwiki.apache.org/confluence/display/MAVEN/DependencyResolutionException
> > [ERROR]
> > [ERROR] After correcting the problems, you can resume the build with the
> command
> > [ERROR]   mvn <goals> -rf :hbase-assembly
> > Build step 'Invoke top-level Maven targets' marked build as failure
> > Archiving artifacts
> > Recording test results
>

Mime
  • Unnamed multipart/alternative (inline, None, 0 bytes)
View raw message