hbase-dev mailing list archives

Site index · List index
Message view « Date » · « Thread »
Top « Date » · « Thread »
From Apache Jenkins Server <jenk...@builds.apache.org>
Subject Build failed in Jenkins: HBase-0.92 #396
Date Thu, 03 May 2012 19:20:53 GMT
See <https://builds.apache.org/job/HBase-0.92/396/changes>

Changes:

[tedyu] HBASE-5883  Backup master is going down due to connection refused exception (Jieshan)

------------------------------------------
[...truncated 1772 lines...]
Tests run: 9, Failures: 0, Errors: 0, Skipped: 0, Time elapsed: 64.384 sec
Running org.apache.hadoop.hbase.regionserver.wal.TestLogRollAbort
Tests run: 1, Failures: 0, Errors: 0, Skipped: 0, Time elapsed: 167.455 sec
Running org.apache.hadoop.hbase.regionserver.wal.TestWALReplay
Tests run: 5, Failures: 0, Errors: 0, Skipped: 0, Time elapsed: 32.637 sec
Running org.apache.hadoop.hbase.regionserver.wal.TestWALActionsListener
Tests run: 1, Failures: 0, Errors: 0, Skipped: 0, Time elapsed: 0.695 sec
Running org.apache.hadoop.hbase.regionserver.wal.TestHLogMethods
Tests run: 3, Failures: 0, Errors: 0, Skipped: 0, Time elapsed: 0.863 sec
Running org.apache.hadoop.hbase.regionserver.wal.TestLogRolling
Tests run: 3, Failures: 0, Errors: 0, Skipped: 0, Time elapsed: 337.632 sec
Running org.apache.hadoop.hbase.regionserver.wal.TestHLogSplit
Tests run: 30, Failures: 0, Errors: 0, Skipped: 1, Time elapsed: 238.123 sec
Running org.apache.hadoop.hbase.regionserver.TestStore
Tests run: 11, Failures: 0, Errors: 0, Skipped: 0, Time elapsed: 2.016 sec
Running org.apache.hadoop.hbase.regionserver.TestRpcMetrics
Tests run: 1, Failures: 0, Errors: 0, Skipped: 0, Time elapsed: 2.068 sec
Running org.apache.hadoop.hbase.regionserver.TestCompoundBloomFilter
Tests run: 3, Failures: 0, Errors: 0, Skipped: 0, Time elapsed: 21.013 sec
Running org.apache.hadoop.hbase.regionserver.TestBlocksRead
Tests run: 3, Failures: 0, Errors: 0, Skipped: 0, Time elapsed: 1.051 sec
Running org.apache.hadoop.hbase.regionserver.TestKeyValueScanFixture
Tests run: 1, Failures: 0, Errors: 0, Skipped: 0, Time elapsed: 0.119 sec
Running org.apache.hadoop.hbase.regionserver.TestExplicitColumnTracker
Tests run: 4, Failures: 0, Errors: 0, Skipped: 0, Time elapsed: 0.893 sec
Running org.apache.hadoop.hbase.regionserver.TestStoreFile
Tests run: 8, Failures: 0, Errors: 0, Skipped: 0, Time elapsed: 1.703 sec
Running org.apache.hadoop.hbase.regionserver.TestWideScanner
Tests run: 1, Failures: 0, Errors: 0, Skipped: 0, Time elapsed: 1.926 sec
Running org.apache.hadoop.hbase.regionserver.TestQueryMatcher
Tests run: 4, Failures: 0, Errors: 0, Skipped: 0, Time elapsed: 0.541 sec
Running org.apache.hadoop.hbase.regionserver.TestReadWriteConsistencyControl
Tests run: 1, Failures: 0, Errors: 0, Skipped: 0, Time elapsed: 10.118 sec
Running org.apache.hadoop.hbase.regionserver.TestResettingCounters
Tests run: 1, Failures: 0, Errors: 0, Skipped: 0, Time elapsed: 0.792 sec
Running org.apache.hadoop.hbase.regionserver.TestStoreScanner
Tests run: 14, Failures: 0, Errors: 0, Skipped: 0, Time elapsed: 0.144 sec
Running org.apache.hadoop.hbase.regionserver.TestMinVersions
Tests run: 6, Failures: 0, Errors: 0, Skipped: 0, Time elapsed: 1.232 sec
Running org.apache.hadoop.hbase.regionserver.TestMemStoreLAB
Tests run: 3, Failures: 0, Errors: 0, Skipped: 0, Time elapsed: 1.337 sec
Running org.apache.hadoop.hbase.regionserver.TestSplitTransactionOnCluster
Tests run: 4, Failures: 0, Errors: 0, Skipped: 0, Time elapsed: 47.298 sec
Running org.apache.hadoop.hbase.regionserver.TestSplitTransaction
Tests run: 7, Failures: 0, Errors: 0, Skipped: 0, Time elapsed: 4.008 sec
Running org.apache.hadoop.hbase.regionserver.TestScanDeleteTracker
Tests run: 6, Failures: 0, Errors: 0, Skipped: 0, Time elapsed: 0.61 sec
Running org.apache.hadoop.hbase.regionserver.TestCompactSelection
Tests run: 1, Failures: 0, Errors: 0, Skipped: 0, Time elapsed: 0.712 sec
Running org.apache.hadoop.hbase.regionserver.TestStoreFileBlockCacheSummary
Tests run: 1, Failures: 0, Errors: 0, Skipped: 0, Time elapsed: 18.34 sec
Running org.apache.hadoop.hbase.regionserver.TestMemStore
Tests run: 21, Failures: 0, Errors: 0, Skipped: 0, Time elapsed: 28.853 sec
Running org.apache.hadoop.hbase.regionserver.TestGetClosestAtOrBefore
Tests run: 3, Failures: 0, Errors: 0, Skipped: 0, Time elapsed: 1.266 sec
Running org.apache.hadoop.hbase.regionserver.TestScanWithBloomError
Tests run: 3, Failures: 0, Errors: 0, Skipped: 0, Time elapsed: 1.106 sec
Running org.apache.hadoop.hbase.regionserver.TestKeyValueSkipListSet
Tests run: 4, Failures: 0, Errors: 0, Skipped: 0, Time elapsed: 0.123 sec
Running org.apache.hadoop.hbase.regionserver.TestKeyValueHeap
Tests run: 3, Failures: 0, Errors: 0, Skipped: 0, Time elapsed: 0.514 sec
Running org.apache.hadoop.hbase.regionserver.TestMXBean
Tests run: 1, Failures: 0, Errors: 0, Skipped: 0, Time elapsed: 16.864 sec
Running org.apache.hadoop.hbase.regionserver.TestScanner
Tests run: 7, Failures: 0, Errors: 0, Skipped: 0, Time elapsed: 4.957 sec
Running org.apache.hadoop.hbase.regionserver.TestRegionSplitPolicy
Tests run: 3, Failures: 0, Errors: 0, Skipped: 0, Time elapsed: 0.703 sec
Running org.apache.hadoop.hbase.regionserver.TestMultiColumnScanner
Tests run: 6, Failures: 0, Errors: 0, Skipped: 0, Time elapsed: 18.646 sec
Running org.apache.hadoop.hbase.regionserver.TestHRegionInfo
Tests run: 6, Failures: 0, Errors: 0, Skipped: 0, Time elapsed: 0.645 sec
Running org.apache.hadoop.hbase.regionserver.handler.TestCloseRegionHandler
Tests run: 3, Failures: 0, Errors: 0, Skipped: 0, Time elapsed: 1.168 sec
Running org.apache.hadoop.hbase.regionserver.handler.TestOpenRegionHandler
Tests run: 3, Failures: 0, Errors: 0, Skipped: 0, Time elapsed: 0.946 sec
Running org.apache.hadoop.hbase.regionserver.TestHRegionServerBulkLoad
Tests run: 1, Failures: 0, Errors: 0, Skipped: 0, Time elapsed: 49.526 sec
Running org.apache.hadoop.hbase.regionserver.TestRSKilledWhenMasterInitializing
Tests run: 1, Failures: 0, Errors: 0, Skipped: 0, Time elapsed: 49.751 sec
Running org.apache.hadoop.hbase.regionserver.TestMasterAddressManager
Tests run: 1, Failures: 0, Errors: 0, Skipped: 0, Time elapsed: 0.565 sec
Running org.apache.hadoop.hbase.regionserver.TestSplitLogWorker
Tests run: 5, Failures: 0, Errors: 0, Skipped: 0, Time elapsed: 2.062 sec
Running org.apache.hadoop.hbase.regionserver.TestFSErrorsExposed
Tests run: 3, Failures: 0, Errors: 0, Skipped: 0, Time elapsed: 33.331 sec
Running org.apache.hadoop.hbase.TestHServerAddress
Tests run: 6, Failures: 0, Errors: 0, Skipped: 0, Time elapsed: 0.068 sec
Running org.apache.hadoop.hbase.filter.TestColumnRangeFilter
Tests run: 1, Failures: 0, Errors: 0, Skipped: 0, Time elapsed: 22.726 sec
Running org.apache.hadoop.hbase.filter.TestColumnPaginationFilter
Tests run: 1, Failures: 0, Errors: 0, Skipped: 0, Time elapsed: 0.117 sec
Running org.apache.hadoop.hbase.filter.TestPageFilter
Tests run: 2, Failures: 0, Errors: 0, Skipped: 0, Time elapsed: 0.03 sec
Running org.apache.hadoop.hbase.filter.TestParseFilter
Tests run: 33, Failures: 0, Errors: 0, Skipped: 0, Time elapsed: 0.325 sec
Running org.apache.hadoop.hbase.filter.TestRandomRowFilter
Tests run: 2, Failures: 0, Errors: 0, Skipped: 0, Time elapsed: 0.574 sec
Running org.apache.hadoop.hbase.filter.TestPrefixFilter
Tests run: 3, Failures: 0, Errors: 0, Skipped: 0, Time elapsed: 0.11 sec
Running org.apache.hadoop.hbase.filter.TestBitComparator
Tests run: 3, Failures: 0, Errors: 0, Skipped: 0, Time elapsed: 0.032 sec
Running org.apache.hadoop.hbase.filter.TestDependentColumnFilter
Tests run: 2, Failures: 0, Errors: 0, Skipped: 0, Time elapsed: 0.803 sec
Running org.apache.hadoop.hbase.filter.TestSingleColumnValueFilter
Tests run: 2, Failures: 0, Errors: 0, Skipped: 0, Time elapsed: 0.158 sec
Running org.apache.hadoop.hbase.filter.TestInclusiveStopFilter
Tests run: 2, Failures: 0, Errors: 0, Skipped: 0, Time elapsed: 0.109 sec
Running org.apache.hadoop.hbase.filter.TestFilterList
Tests run: 5, Failures: 0, Errors: 0, Skipped: 0, Time elapsed: 0.256 sec
Running org.apache.hadoop.hbase.filter.TestFilter
Tests run: 18, Failures: 0, Errors: 0, Skipped: 0, Time elapsed: 2.447 sec
Running org.apache.hadoop.hbase.filter.TestMultipleColumnPrefixFilter
Tests run: 3, Failures: 0, Errors: 0, Skipped: 0, Time elapsed: 4.053 sec
Running org.apache.hadoop.hbase.filter.TestColumnPrefixFilter
Tests run: 2, Failures: 0, Errors: 0, Skipped: 0, Time elapsed: 3.102 sec
Running org.apache.hadoop.hbase.filter.TestSingleColumnValueExcludeFilter
Tests run: 1, Failures: 0, Errors: 0, Skipped: 0, Time elapsed: 0.118 sec
Running org.apache.hadoop.hbase.TestGlobalMemStoreSize
Tests run: 1, Failures: 0, Errors: 0, Skipped: 0, Time elapsed: 20.472 sec
Running org.apache.hadoop.hbase.TestHBaseTestingUtility
Tests run: 7, Failures: 0, Errors: 0, Skipped: 0, Time elapsed: 94.239 sec
Running org.apache.hadoop.hbase.security.TestUser
Tests run: 3, Failures: 0, Errors: 0, Skipped: 0, Time elapsed: 0.455 sec
Running org.apache.hadoop.hbase.TestMultiVersions
Tests run: 3, Failures: 0, Errors: 0, Skipped: 0, Time elapsed: 35.646 sec
Running org.apache.hadoop.hbase.TestRegionRebalancing
Tests run: 1, Failures: 0, Errors: 0, Skipped: 0, Time elapsed: 57.447 sec
Running org.apache.hadoop.hbase.replication.TestReplication
Tests run: 8, Failures: 0, Errors: 0, Skipped: 0, Time elapsed: 111.127 sec
Running org.apache.hadoop.hbase.replication.TestMasterReplication
Tests run: 2, Failures: 0, Errors: 0, Skipped: 0, Time elapsed: 92.264 sec
Running org.apache.hadoop.hbase.replication.TestReplicationZookeeper
Tests run: 1, Failures: 0, Errors: 0, Skipped: 0, Time elapsed: 0.568 sec
Running org.apache.hadoop.hbase.replication.regionserver.TestReplicationSourceManager
Tests run: 1, Failures: 0, Errors: 0, Skipped: 0, Time elapsed: 0.907 sec
Running org.apache.hadoop.hbase.replication.regionserver.TestReplicationSink
Tests run: 5, Failures: 0, Errors: 0, Skipped: 0, Time elapsed: 21.061 sec
Running org.apache.hadoop.hbase.replication.TestReplicationPeer
Tests run: 1, Failures: 0, Errors: 0, Skipped: 0, Time elapsed: 25.548 sec
Running org.apache.hadoop.hbase.replication.TestMultiSlaveReplication
Tests run: 1, Failures: 0, Errors: 0, Skipped: 0, Time elapsed: 57.711 sec
Running org.apache.hadoop.hbase.replication.TestReplicationSource
Tests run: 1, Failures: 0, Errors: 0, Skipped: 0, Time elapsed: 2.422 sec
Running org.apache.hadoop.hbase.avro.TestAvroServer
Tests run: 3, Failures: 0, Errors: 0, Skipped: 0, Time elapsed: 32.186 sec
Running org.apache.hadoop.hbase.avro.TestAvroUtil
Tests run: 1, Failures: 0, Errors: 0, Skipped: 0, Time elapsed: 0.636 sec
Running org.apache.hadoop.hbase.TestAcidGuarantees
Tests run: 3, Failures: 0, Errors: 0, Skipped: 0, Time elapsed: 115.729 sec
Running org.apache.hadoop.hbase.TestKeyValue
Tests run: 13, Failures: 0, Errors: 0, Skipped: 0, Time elapsed: 0.137 sec
Running org.apache.hadoop.hbase.coprocessor.TestRegionServerCoprocessorExceptionWithRemove
Tests run: 1, Failures: 0, Errors: 0, Skipped: 0, Time elapsed: 21.238 sec
Running org.apache.hadoop.hbase.coprocessor.TestRegionObserverInterface
Tests run: 5, Failures: 0, Errors: 0, Skipped: 0, Time elapsed: 34.191 sec
Running org.apache.hadoop.hbase.coprocessor.TestCoprocessorInterface
Tests run: 1, Failures: 0, Errors: 0, Skipped: 0, Time elapsed: 4.091 sec
Running org.apache.hadoop.hbase.coprocessor.TestMasterObserver
Tests run: 3, Failures: 0, Errors: 0, Skipped: 0, Time elapsed: 33.615 sec
Running org.apache.hadoop.hbase.coprocessor.TestCoprocessorEndpoint
Tests run: 3, Failures: 0, Errors: 0, Skipped: 0, Time elapsed: 35.74 sec
Running org.apache.hadoop.hbase.coprocessor.TestWALObserver
Tests run: 3, Failures: 0, Errors: 0, Skipped: 0, Time elapsed: 23.177 sec
Running org.apache.hadoop.hbase.coprocessor.TestRegionObserverBypass
Tests run: 2, Failures: 0, Errors: 0, Skipped: 0, Time elapsed: 19.673 sec
Running org.apache.hadoop.hbase.coprocessor.TestMasterCoprocessorExceptionWithAbort
Tests run: 1, Failures: 0, Errors: 0, Skipped: 0, Time elapsed: 17.246 sec
Running org.apache.hadoop.hbase.coprocessor.TestRegionServerCoprocessorExceptionWithAbort
Tests run: 1, Failures: 0, Errors: 0, Skipped: 0, Time elapsed: 21.568 sec
Running org.apache.hadoop.hbase.coprocessor.TestAggregateProtocol
Tests run: 44, Failures: 0, Errors: 0, Skipped: 0, Time elapsed: 20.5 sec
Running org.apache.hadoop.hbase.coprocessor.TestMasterCoprocessorExceptionWithRemove
Tests run: 1, Failures: 0, Errors: 0, Skipped: 0, Time elapsed: 20.44 sec
Running org.apache.hadoop.hbase.coprocessor.TestRegionObserverStacking
Tests run: 1, Failures: 0, Errors: 0, Skipped: 0, Time elapsed: 0.719 sec
Running org.apache.hadoop.hbase.coprocessor.TestClassLoading
Tests run: 6, Failures: 0, Errors: 0, Skipped: 0, Time elapsed: 36.861 sec
Running org.apache.hadoop.hbase.mapred.TestTableMapReduce
Tests run: 1, Failures: 0, Errors: 0, Skipped: 0, Time elapsed: 72.004 sec
Running org.apache.hadoop.hbase.mapred.TestTableInputFormat
Tests run: 6, Failures: 0, Errors: 0, Skipped: 0, Time elapsed: 25.958 sec
Running org.apache.hadoop.hbase.TestServerName
Tests run: 4, Failures: 0, Errors: 0, Skipped: 0, Time elapsed: 0.142 sec
Running org.apache.hadoop.hbase.master.TestOpenedRegionHandler
Tests run: 2, Failures: 0, Errors: 0, Skipped: 0, Time elapsed: 24.687 sec
Running org.apache.hadoop.hbase.master.TestActiveMasterManager
Tests run: 2, Failures: 0, Errors: 0, Skipped: 0, Time elapsed: 0.79 sec
Running org.apache.hadoop.hbase.master.TestMasterFailover
Tests run: 4, Failures: 0, Errors: 0, Skipped: 0, Time elapsed: 93.772 sec
Running org.apache.hadoop.hbase.master.TestMasterRestartAfterDisablingTable
Tests run: 1, Failures: 0, Errors: 0, Skipped: 0, Time elapsed: 26.177 sec
Running org.apache.hadoop.hbase.master.TestCatalogJanitor
Tests run: 4, Failures: 0, Errors: 0, Skipped: 0, Time elapsed: 7.371 sec
Running org.apache.hadoop.hbase.master.TestRollingRestart
Tests run: 1, Failures: 0, Errors: 0, Skipped: 0, Time elapsed: 71.855 sec
Running org.apache.hadoop.hbase.master.TestMasterTransitions
Tests run: 3, Failures: 0, Errors: 0, Skipped: 3, Time elapsed: 24.138 sec
Running org.apache.hadoop.hbase.master.TestRestartCluster
Tests run: 2, Failures: 0, Errors: 0, Skipped: 0, Time elapsed: 50.182 sec
Running org.apache.hadoop.hbase.master.TestMasterStatusServlet
Tests run: 5, Failures: 0, Errors: 0, Skipped: 0, Time elapsed: 0.967 sec
Running org.apache.hadoop.hbase.master.TestClockSkewDetection
Tests run: 1, Failures: 0, Errors: 0, Skipped: 0, Time elapsed: 0.245 sec
Running org.apache.hadoop.hbase.master.TestDefaultLoadBalancer
Tests run: 4, Failures: 0, Errors: 0, Skipped: 0, Time elapsed: 1.417 sec
Running org.apache.hadoop.hbase.master.TestHMasterRPCException
Tests run: 1, Failures: 0, Errors: 0, Skipped: 0, Time elapsed: 1.23 sec
Running org.apache.hadoop.hbase.master.TestDistributedLogSplitting
Tests run: 4, Failures: 0, Errors: 0, Skipped: 0, Time elapsed: 115.387 sec
Running org.apache.hadoop.hbase.master.TestMXBean
Tests run: 1, Failures: 0, Errors: 0, Skipped: 0, Time elapsed: 19.935 sec
Running org.apache.hadoop.hbase.master.TestMaster
Tests run: 1, Failures: 0, Errors: 0, Skipped: 0, Time elapsed: 20.006 sec
Running org.apache.hadoop.hbase.master.TestMasterShutdown
Tests run: 1, Failures: 0, Errors: 0, Skipped: 0, Time elapsed: 19.118 sec
Running org.apache.hadoop.hbase.master.TestSplitLogManager
Tests run: 12, Failures: 0, Errors: 0, Skipped: 0, Time elapsed: 14.375 sec
Running org.apache.hadoop.hbase.master.TestDeadServer
Tests run: 1, Failures: 0, Errors: 0, Skipped: 0, Time elapsed: 0.149 sec
Running org.apache.hadoop.hbase.master.TestLogsCleaner
Tests run: 1, Failures: 0, Errors: 0, Skipped: 0, Time elapsed: 3.115 sec
Running org.apache.hadoop.hbase.master.TestMasterZKSessionRecovery
Tests run: 2, Failures: 0, Errors: 0, Skipped: 0, Time elapsed: 31.203 sec
Running org.apache.hadoop.hbase.master.TestZKBasedOpenCloseRegion
Tests run: 4, Failures: 0, Errors: 0, Skipped: 0, Time elapsed: 25.411 sec

Results :

Tests run: 1107, Failures: 0, Errors: 0, Skipped: 8

[INFO] ------------------------------------------------------------------------
[INFO] BUILD FAILURE
[INFO] ------------------------------------------------------------------------
[INFO] Total time: 2:04:07.147s
[INFO] Finished at: Thu May 03 19:20:33 UTC 2012
[INFO] Final Memory: 55M/612M
[INFO] ------------------------------------------------------------------------
[WARNING] The requested profile "runAllTests" could not be activated because it does not exist.
[ERROR] Failed to execute goal org.apache.maven.plugins:maven-surefire-plugin:2.10:test (default-test)
on project hbase: Failure or timeout -> [Help 1]
[ERROR] 
[ERROR] To see the full stack trace of the errors, re-run Maven with the -e switch.
[ERROR] Re-run Maven using the -X switch to enable full debug logging.
[ERROR] 
[ERROR] For more information about the errors and possible solutions, please read the following
articles:
[ERROR] [Help 1] http://cwiki.apache.org/confluence/display/MAVEN/MojoExecutionException
Build step 'Invoke top-level Maven targets' marked build as failure
Archiving artifacts
Recording test results
Updating HBASE-5883

Mime
View raw message