hbase-dev mailing list archives

Site index · List index
Message view « Date » · « Thread »
Top « Date » · « Thread »
From Apache Jenkins Server <jenk...@builds.apache.org>
Subject Build failed in Jenkins: HBase-TRUNK #2888
Date Wed, 16 May 2012 16:54:58 GMT
See <https://builds.apache.org/job/HBase-TRUNK/2888/changes>

Changes:

[dmeil] hbase-6019.  porting pseudo-dist html page to RefGuide Config chapter.

------------------------------------------
[...truncated 8458 lines...]
Running org.apache.hadoop.hbase.mapreduce.TestWALPlayer
Tests run: 1, Failures: 0, Errors: 0, Skipped: 0, Time elapsed: 42.88 sec
Running org.apache.hadoop.hbase.mapreduce.TestTimeRangeMapRed
Tests run: 1, Failures: 0, Errors: 0, Skipped: 0, Time elapsed: 41.457 sec
Running org.apache.hadoop.hbase.mapreduce.TestMultithreadedTableMapper
Tests run: 1, Failures: 0, Errors: 0, Skipped: 0, Time elapsed: 117.679 sec
Running org.apache.hadoop.hbase.mapreduce.TestTableMapReduce
Tests run: 1, Failures: 0, Errors: 0, Skipped: 0, Time elapsed: 115.48 sec
Running org.apache.hadoop.hbase.mapreduce.TestHLogRecordReader
Tests run: 2, Failures: 0, Errors: 0, Skipped: 0, Time elapsed: 5.359 sec
Running org.apache.hadoop.hbase.mapreduce.TestImportTsv
Tests run: 9, Failures: 0, Errors: 0, Skipped: 0, Time elapsed: 134.286 sec
Running org.apache.hadoop.hbase.regionserver.TestStore
Tests run: 12, Failures: 0, Errors: 0, Skipped: 0, Time elapsed: 9.333 sec
Running org.apache.hadoop.hbase.regionserver.TestSplitTransactionOnCluster
Tests run: 6, Failures: 1, Errors: 0, Skipped: 0, Time elapsed: 36.018 sec <<< FAILURE!
Running org.apache.hadoop.hbase.regionserver.wal.TestLogRollAbort
Tests run: 1, Failures: 0, Errors: 0, Skipped: 0, Time elapsed: 17.279 sec
Running org.apache.hadoop.hbase.regionserver.wal.TestLogRollingNoCluster
Tests run: 1, Failures: 0, Errors: 0, Skipped: 0, Time elapsed: 2.209 sec
Running org.apache.hadoop.hbase.regionserver.wal.TestHLog
Tests run: 10, Failures: 0, Errors: 0, Skipped: 0, Time elapsed: 65.968 sec
Running org.apache.hadoop.hbase.regionserver.wal.TestWALReplay
Tests run: 5, Failures: 0, Errors: 0, Skipped: 0, Time elapsed: 30.477 sec
Running org.apache.hadoop.hbase.mapreduce.TestHFileOutputFormat
Tests run: 9, Failures: 0, Errors: 0, Skipped: 0, Time elapsed: 229.607 sec
Running org.apache.hadoop.hbase.regionserver.wal.TestWALReplayCompressed
Tests run: 5, Failures: 0, Errors: 0, Skipped: 0, Time elapsed: 33.448 sec
Running org.apache.hadoop.hbase.regionserver.wal.TestHLogSplit
Tests run: 30, Failures: 0, Errors: 0, Skipped: 1, Time elapsed: 245.127 sec
Running org.apache.hadoop.hbase.regionserver.TestRegionServerMetrics
Tests run: 4, Failures: 0, Errors: 0, Skipped: 0, Time elapsed: 66.078 sec
Running org.apache.hadoop.hbase.mapreduce.TestTableInputFormatScan
Tests run: 12, Failures: 0, Errors: 0, Skipped: 0, Time elapsed: 493.647 sec
Running org.apache.hadoop.hbase.regionserver.TestMXBean
Tests run: 1, Failures: 0, Errors: 0, Skipped: 0, Time elapsed: 10.966 sec
Running org.apache.hadoop.hbase.regionserver.TestAtomicOperation
Tests run: 5, Failures: 0, Errors: 0, Skipped: 0, Time elapsed: 20.37 sec
Running org.apache.hadoop.hbase.regionserver.TestRSKilledWhenMasterInitializing
Tests run: 1, Failures: 0, Errors: 0, Skipped: 0, Time elapsed: 61.984 sec
Running org.apache.hadoop.hbase.regionserver.TestFSErrorsExposed
Tests run: 3, Failures: 0, Errors: 0, Skipped: 0, Time elapsed: 26.861 sec
Running org.apache.hadoop.hbase.regionserver.TestParallelPut
Tests run: 2, Failures: 0, Errors: 0, Skipped: 0, Time elapsed: 3.292 sec
Running org.apache.hadoop.hbase.regionserver.TestRpcMetrics
Tests run: 1, Failures: 0, Errors: 0, Skipped: 0, Time elapsed: 1.796 sec
Running org.apache.hadoop.hbase.regionserver.TestHRegionOnCluster
Tests run: 1, Failures: 0, Errors: 0, Skipped: 0, Time elapsed: 19.724 sec
Running org.apache.hadoop.hbase.regionserver.handler.TestCloseRegionHandler
Tests run: 3, Failures: 0, Errors: 0, Skipped: 0, Time elapsed: 1.167 sec
Running org.apache.hadoop.hbase.regionserver.handler.TestOpenRegionHandler
Tests run: 3, Failures: 0, Errors: 0, Skipped: 0, Time elapsed: 0.937 sec
Running org.apache.hadoop.hbase.regionserver.TestSeekOptimizations
Tests run: 6, Failures: 0, Errors: 0, Skipped: 0, Time elapsed: 2.581 sec
Running org.apache.hadoop.hbase.regionserver.TestServerCustomProtocol
Tests run: 7, Failures: 0, Errors: 0, Skipped: 0, Time elapsed: 15.518 sec
Running org.apache.hadoop.hbase.regionserver.TestBlocksRead
Tests run: 4, Failures: 0, Errors: 0, Skipped: 0, Time elapsed: 1.193 sec
Running org.apache.hadoop.hbase.regionserver.TestStoreScanner
Tests run: 16, Failures: 0, Errors: 0, Skipped: 0, Time elapsed: 0.046 sec
Running org.apache.hadoop.hbase.regionserver.TestSplitLogWorker
Tests run: 5, Failures: 0, Errors: 0, Skipped: 0, Time elapsed: 2.156 sec
Running org.apache.hadoop.hbase.regionserver.wal.TestLogRolling
Tests run: 2, Failures: 0, Errors: 0, Skipped: 0, Time elapsed: 238.916 sec
Running org.apache.hadoop.hbase.regionserver.metrics.TestSchemaMetrics
Tests run: 6, Failures: 0, Errors: 0, Skipped: 0, Time elapsed: 11.303 sec
Running org.apache.hadoop.hbase.regionserver.TestStoreFileBlockCacheSummary
Tests run: 1, Failures: 0, Errors: 0, Skipped: 0, Time elapsed: 13.156 sec
Running org.apache.hadoop.hbase.regionserver.TestMasterAddressManager
Tests run: 1, Failures: 0, Errors: 0, Skipped: 0, Time elapsed: 0.584 sec
Running org.apache.hadoop.hbase.regionserver.TestMultiColumnScanner
Tests run: 12, Failures: 0, Errors: 0, Skipped: 0, Time elapsed: 30.232 sec
Running org.apache.hadoop.hbase.regionserver.TestHRegionServerBulkLoad
Tests run: 1, Failures: 0, Errors: 0, Skipped: 0, Time elapsed: 44.556 sec
Running org.apache.hadoop.hbase.regionserver.TestHRegion
Tests run: 62, Failures: 0, Errors: 0, Skipped: 0, Time elapsed: 31.697 sec
Running org.apache.hadoop.hbase.regionserver.TestEndToEndSplitTransaction
Tests run: 1, Failures: 0, Errors: 0, Skipped: 0, Time elapsed: 41.627 sec
Running org.apache.hadoop.hbase.security.token.TestTokenAuthentication
Tests run: 1, Failures: 0, Errors: 0, Skipped: 0, Time elapsed: 9.38 sec
Running org.apache.hadoop.hbase.security.access.TestZKPermissionsWatcher
Tests run: 1, Failures: 0, Errors: 0, Skipped: 0, Time elapsed: 9.041 sec
Running org.apache.hadoop.hbase.security.token.TestZKSecretWatcher
Tests run: 1, Failures: 0, Errors: 0, Skipped: 0, Time elapsed: 15.332 sec
Running org.apache.hadoop.hbase.security.access.TestAccessControlFilter
Tests run: 1, Failures: 0, Errors: 0, Skipped: 0, Time elapsed: 13.65 sec
Running org.apache.hadoop.hbase.ipc.TestDelayedRpc
Tests run: 4, Failures: 0, Errors: 0, Skipped: 0, Time elapsed: 2.31 sec
Running org.apache.hadoop.hbase.ipc.TestPBOnWritableRpc
Tests run: 1, Failures: 0, Errors: 0, Skipped: 0, Time elapsed: 0.749 sec
Running org.apache.hadoop.hbase.security.access.TestTablePermissions
Tests run: 5, Failures: 0, Errors: 0, Skipped: 0, Time elapsed: 25.791 sec
Running org.apache.hadoop.hbase.TestGlobalMemStoreSize
Tests run: 1, Failures: 0, Errors: 0, Skipped: 0, Time elapsed: 14.834 sec
Running org.apache.hadoop.hbase.security.access.TestAccessController
Tests run: 21, Failures: 0, Errors: 0, Skipped: 0, Time elapsed: 27.527 sec
Running org.apache.hadoop.hbase.rest.TestSchemaResource
Tests run: 2, Failures: 0, Errors: 0, Skipped: 0, Time elapsed: 18.754 sec
Running org.apache.hadoop.hbase.rest.client.TestRemoteAdmin
Tests run: 1, Failures: 0, Errors: 0, Skipped: 0, Time elapsed: 15.957 sec
Running org.apache.hadoop.hbase.TestFullLogReconstruction
Tests run: 1, Failures: 0, Errors: 0, Skipped: 0, Time elapsed: 44.797 sec
Running org.apache.hadoop.hbase.constraint.TestConstraint
Tests run: 5, Failures: 0, Errors: 0, Skipped: 0, Time elapsed: 27.956 sec
Running org.apache.hadoop.hbase.rest.client.TestRemoteTable
Tests run: 3, Failures: 0, Errors: 0, Skipped: 0, Time elapsed: 14.702 sec
Running org.apache.hadoop.hbase.rest.TestMultiRowResource
Tests run: 3, Failures: 0, Errors: 0, Skipped: 0, Time elapsed: 12.793 sec
Running org.apache.hadoop.hbase.rest.TestGzipFilter
Tests run: 3, Failures: 0, Errors: 0, Skipped: 0, Time elapsed: 13.527 sec
Running org.apache.hadoop.hbase.rest.TestTableResource
Tests run: 8, Failures: 0, Errors: 0, Skipped: 0, Time elapsed: 23.586 sec
Running org.apache.hadoop.hbase.rest.TestVersionResource
Running org.apache.hadoop.hbase.rest.TestRowResource
Tests run: 7, Failures: 0, Errors: 0, Skipped: 0, Time elapsed: 10.966 sec
Tests run: 11, Failures: 0, Errors: 0, Skipped: 0, Time elapsed: 16.163 sec
Running org.apache.hadoop.hbase.metrics.TestMetricsMBeanBase
Tests run: 2, Failures: 0, Errors: 0, Skipped: 0, Time elapsed: 1.154 sec
Running org.apache.hadoop.hbase.rest.TestStatusResource
Tests run: 2, Failures: 0, Errors: 0, Skipped: 0, Time elapsed: 11.049 sec
Running org.apache.hadoop.hbase.io.hfile.TestHFileBlockIndex
Tests run: 10, Failures: 0, Errors: 0, Skipped: 0, Time elapsed: 7.232 sec
Running org.apache.hadoop.hbase.io.hfile.TestLruBlockCache
Tests run: 16, Failures: 0, Errors: 0, Skipped: 0, Time elapsed: 0.681 sec
Running org.apache.hadoop.hbase.io.hfile.TestHFileSeek
Tests run: 1, Failures: 0, Errors: 0, Skipped: 0, Time elapsed: 6.65 sec
Running org.apache.hadoop.hbase.io.hfile.TestFixedFileTrailer
Tests run: 2, Failures: 0, Errors: 0, Skipped: 0, Time elapsed: 0.541 sec
Running org.apache.hadoop.hbase.rest.TestScannersWithFilters
Tests run: 10, Failures: 0, Errors: 0, Skipped: 0, Time elapsed: 15.827 sec
Running org.apache.hadoop.hbase.rest.TestScannerResource
Tests run: 5, Failures: 0, Errors: 0, Skipped: 0, Time elapsed: 30.443 sec
Running org.apache.hadoop.hbase.io.hfile.TestHFileBlockCompatibility
Tests run: 10, Failures: 0, Errors: 0, Skipped: 0, Time elapsed: 0.885 sec
Running org.apache.hadoop.hbase.io.hfile.TestChecksum
Tests run: 3, Failures: 0, Errors: 0, Skipped: 0, Time elapsed: 0.701 sec
Running org.apache.hadoop.hbase.io.hfile.TestHFilePerformance
Tests run: 1, Failures: 0, Errors: 0, Skipped: 0, Time elapsed: 4.386 sec
Running org.apache.hadoop.hbase.io.hfile.TestCacheOnWrite
Tests run: 36, Failures: 0, Errors: 0, Skipped: 0, Time elapsed: 29.615 sec
Running org.apache.hadoop.hbase.io.hfile.TestForceCacheImportantBlocks
Tests run: 4, Failures: 0, Errors: 0, Skipped: 0, Time elapsed: 43.582 sec
Running org.apache.hadoop.hbase.io.hfile.slab.TestSlabCache
Tests run: 7, Failures: 0, Errors: 0, Skipped: 0, Time elapsed: 11.637 sec
Running org.apache.hadoop.hbase.io.hfile.TestHFileBlock
Tests run: 16, Failures: 0, Errors: 0, Skipped: 0, Time elapsed: 45.505 sec
Running org.apache.hadoop.hbase.io.hfile.slab.TestSingleSizeCache
Tests run: 5, Failures: 0, Errors: 0, Skipped: 0, Time elapsed: 17.377 sec
Running org.apache.hadoop.hbase.io.hfile.TestScannerSelectionUsingTTL
Tests run: 6, Failures: 0, Errors: 0, Skipped: 0, Time elapsed: 61.265 sec
Running org.apache.hadoop.hbase.io.encoding.TestLoadAndSwitchEncodeOnDisk
Tests run: 1, Failures: 0, Errors: 0, Skipped: 0, Time elapsed: 24.231 sec
Running org.apache.hadoop.hbase.TestRegionRebalancing
Tests run: 1, Failures: 0, Errors: 0, Skipped: 0, Time elapsed: 18.009 sec
Running org.apache.hadoop.hbase.io.encoding.TestUpgradeFromHFileV1ToEncoding
Tests run: 1, Failures: 0, Errors: 0, Skipped: 0, Time elapsed: 84.506 sec
Running org.apache.hadoop.hbase.mapred.TestTableInputFormat
Tests run: 6, Failures: 0, Errors: 0, Skipped: 0, Time elapsed: 20.184 sec
Running org.apache.hadoop.hbase.replication.TestReplicationZookeeper
Tests run: 1, Failures: 0, Errors: 0, Skipped: 0, Time elapsed: 0.527 sec
Running org.apache.hadoop.hbase.io.encoding.TestDataBlockEncoders
Tests run: 12, Failures: 0, Errors: 0, Skipped: 0, Time elapsed: 80.827 sec
Running org.apache.hadoop.hbase.replication.regionserver.TestReplicationSourceManager
Tests run: 1, Failures: 0, Errors: 0, Skipped: 0, Time elapsed: 0.996 sec
Running org.apache.hadoop.hbase.replication.TestReplicationSource
Tests run: 1, Failures: 0, Errors: 0, Skipped: 0, Time elapsed: 2.717 sec
Running org.apache.hadoop.hbase.replication.regionserver.TestReplicationSink
Tests run: 5, Failures: 0, Errors: 0, Skipped: 0, Time elapsed: 28.971 sec
Running org.apache.hadoop.hbase.replication.TestReplicationPeer
Tests run: 1, Failures: 0, Errors: 0, Skipped: 0, Time elapsed: 1.203 sec
Running org.apache.hadoop.hbase.mapred.TestTableMapReduce
Tests run: 1, Failures: 0, Errors: 0, Skipped: 0, Time elapsed: 90.443 sec
Running org.apache.hadoop.hbase.replication.TestMultiSlaveReplication
Tests run: 1, Failures: 0, Errors: 0, Skipped: 0, Time elapsed: 64.276 sec
Running org.apache.hadoop.hbase.util.TestMergeTool
Tests run: 1, Failures: 0, Errors: 0, Skipped: 0, Time elapsed: 23.807 sec
Running org.apache.hadoop.hbase.util.TestFSTableDescriptors
Tests run: 10, Failures: 0, Errors: 0, Skipped: 0, Time elapsed: 0.887 sec
Running org.apache.hadoop.hbase.util.TestIdLock
Tests run: 1, Failures: 0, Errors: 0, Skipped: 0, Time elapsed: 15.283 sec
Running org.apache.hadoop.hbase.replication.TestMasterReplication
Tests run: 2, Failures: 0, Errors: 0, Skipped: 0, Time elapsed: 58.799 sec
Running org.apache.hadoop.hbase.util.TestEnvironmentEdgeManager
Tests run: 2, Failures: 0, Errors: 0, Skipped: 0, Time elapsed: 0.345 sec
Running org.apache.hadoop.hbase.io.encoding.TestChangingEncoding
Tests run: 4, Failures: 0, Errors: 0, Skipped: 0, Time elapsed: 251.169 sec
Running org.apache.hadoop.hbase.util.TestMergeTable
Tests run: 1, Failures: 0, Errors: 0, Skipped: 0, Time elapsed: 26.206 sec
Running org.apache.hadoop.hbase.replication.TestReplication
Tests run: 10, Failures: 1, Errors: 0, Skipped: 0, Time elapsed: 187.556 sec <<<
FAILURE!
Running org.apache.hadoop.hbase.util.TestFSUtils
Tests run: 4, Failures: 0, Errors: 0, Skipped: 0, Time elapsed: 19.528 sec
Running org.apache.hadoop.hbase.util.TestPoolMap$TestRoundRobinPoolType
Tests run: 3, Failures: 0, Errors: 0, Skipped: 0, Time elapsed: 0.009 sec
Running org.apache.hadoop.hbase.util.TestPoolMap$TestThreadLocalPoolType
Tests run: 3, Failures: 0, Errors: 0, Skipped: 0, Time elapsed: 0.006 sec
Running org.apache.hadoop.hbase.util.TestPoolMap$TestReusablePoolType
Tests run: 3, Failures: 0, Errors: 0, Skipped: 0, Time elapsed: 0.034 sec
Running org.apache.hadoop.hbase.util.TestMiniClusterLoadSequential
Tests run: 4, Failures: 0, Errors: 0, Skipped: 0, Time elapsed: 85.943 sec
Running org.apache.hadoop.hbase.util.TestProcessBasedCluster
Tests run: 1, Failures: 0, Errors: 0, Skipped: 0, Time elapsed: 0.374 sec
Running org.apache.hadoop.hbase.util.TestRegionSplitter
Tests run: 5, Failures: 0, Errors: 0, Skipped: 0, Time elapsed: 16.283 sec
Running org.apache.hadoop.hbase.util.TestMiniClusterLoadParallel
Tests run: 4, Failures: 0, Errors: 0, Skipped: 0, Time elapsed: 80.076 sec
Running org.apache.hadoop.hbase.util.hbck.TestOfflineMetaRebuildBase
Tests run: 1, Failures: 0, Errors: 0, Skipped: 0, Time elapsed: 19.012 sec
Running org.apache.hadoop.hbase.util.hbck.TestOfflineMetaRebuildOverlap
Tests run: 1, Failures: 0, Errors: 0, Skipped: 0, Time elapsed: 19.369 sec
Running org.apache.hadoop.hbase.util.TestDefaultEnvironmentEdge
Tests run: 1, Failures: 0, Errors: 0, Skipped: 0, Time elapsed: 0.239 sec
Running org.apache.hadoop.hbase.util.hbck.TestOfflineMetaRebuildHole
Tests run: 1, Failures: 0, Errors: 0, Skipped: 0, Time elapsed: 18.677 sec
Running org.apache.hadoop.hbase.util.TestMiniClusterLoadEncoded
Tests run: 4, Failures: 0, Errors: 0, Skipped: 0, Time elapsed: 56.556 sec
Running org.apache.hadoop.hbase.TestInfoServers
Tests run: 2, Failures: 0, Errors: 0, Skipped: 0, Time elapsed: 11.057 sec
Running org.apache.hadoop.hbase.util.TestHBaseFsck
Tests run: 16, Failures: 0, Errors: 0, Skipped: 0, Time elapsed: 131.541 sec

Results :

Failed tests:   testShutdownFixupWhenDaughterHasSplit(org.apache.hadoop.hbase.regionserver.TestSplitTransactionOnCluster)
  queueFailover(org.apache.hadoop.hbase.replication.TestReplication): Waited too much time
for queueFailover replication. Waited 46695ms.

Tests run: 982, Failures: 2, Errors: 0, Skipped: 9

[INFO] ------------------------------------------------------------------------
[INFO] BUILD FAILURE
[INFO] ------------------------------------------------------------------------
[INFO] Total time: 34:17.077s
[INFO] Finished at: Wed May 16 16:54:47 UTC 2012
[INFO] Final Memory: 58M/738M
[INFO] ------------------------------------------------------------------------
[ERROR] Failed to execute goal org.apache.maven.plugins:maven-surefire-plugin:2.12-TRUNK-HBASE-2:test
(secondPartTestsExecution) on project hbase: There are test failures.
[ERROR] 
[ERROR] Please refer to /x1/jenkins/jenkins-slave/workspace/HBase-TRUNK/trunk/target/surefire-reports
for the individual test results.
[ERROR] -> [Help 1]
[ERROR] 
[ERROR] To see the full stack trace of the errors, re-run Maven with the -e switch.
[ERROR] Re-run Maven using the -X switch to enable full debug logging.
[ERROR] 
[ERROR] For more information about the errors and possible solutions, please read the following
articles:
[ERROR] [Help 1] http://cwiki.apache.org/confluence/display/MAVEN/MojoFailureException
Build step 'Invoke top-level Maven targets' marked build as failure
Archiving artifacts
Recording test results
Updating HBASE-6019

Mime
View raw message