hbase-dev mailing list archives

Site index · List index
Message view « Date » · « Thread »
Top « Date » · « Thread »
From Apache Jenkins Server <jenk...@builds.apache.org>
Subject Build failed in Jenkins: HBase-TRUNK #2966
Date Thu, 31 May 2012 18:05:49 GMT
See <https://builds.apache.org/job/HBase-TRUNK/2966/changes>

Changes:

[tedyu] HBASE-6109 Improve RIT performances during assignment on large clusters (N Keywal)

------------------------------------------
[...truncated 7271 lines...]
Running org.apache.hadoop.hbase.regionserver.TestGetClosestAtOrBefore
Tests run: 3, Failures: 0, Errors: 0, Skipped: 0, Time elapsed: 0.999 sec
Forking command line: /bin/sh -c cd <https://builds.apache.org/job/HBase-TRUNK/ws/trunk/hbase-server>
&& /home/hudson/tools/java/jdk1.6.0_27-32/jre/bin/java -enableassertions -Xmx1900m
-Djava.security.egd=file:/dev/./urandom -jar <https://builds.apache.org/job/HBase-TRUNK/ws/trunk/hbase-server/target/surefire/surefirebooter436190846751161909.jar>
<https://builds.apache.org/job/HBase-TRUNK/ws/trunk/hbase-server/target/surefire/surefire5603232823246670566tmp>
<https://builds.apache.org/job/HBase-TRUNK/ws/trunk/hbase-server/target/surefire/surefire_1251368642593218394529tmp>
Running org.apache.hadoop.hbase.regionserver.TestStoreScanner
Tests run: 16, Failures: 0, Errors: 0, Skipped: 0, Time elapsed: 0.063 sec
Forking command line: /bin/sh -c cd <https://builds.apache.org/job/HBase-TRUNK/ws/trunk/hbase-server>
&& /home/hudson/tools/java/jdk1.6.0_27-32/jre/bin/java -enableassertions -Xmx1900m
-Djava.security.egd=file:/dev/./urandom -jar <https://builds.apache.org/job/HBase-TRUNK/ws/trunk/hbase-server/target/surefire/surefirebooter6181330811183992537.jar>
<https://builds.apache.org/job/HBase-TRUNK/ws/trunk/hbase-server/target/surefire/surefire4094606453222654473tmp>
<https://builds.apache.org/job/HBase-TRUNK/ws/trunk/hbase-server/target/surefire/surefire_1266679075158189514054tmp>
Running org.apache.hadoop.hbase.regionserver.TestCacheOnWriteInSchema
Tests run: 3, Failures: 0, Errors: 0, Skipped: 0, Time elapsed: 1.698 sec
Forking command line: /bin/sh -c cd <https://builds.apache.org/job/HBase-TRUNK/ws/trunk/hbase-server>
&& /home/hudson/tools/java/jdk1.6.0_27-32/jre/bin/java -enableassertions -Xmx1900m
-Djava.security.egd=file:/dev/./urandom -jar <https://builds.apache.org/job/HBase-TRUNK/ws/trunk/hbase-server/target/surefire/surefirebooter7853775004284917153.jar>
<https://builds.apache.org/job/HBase-TRUNK/ws/trunk/hbase-server/target/surefire/surefire6809742781112335446tmp>
<https://builds.apache.org/job/HBase-TRUNK/ws/trunk/hbase-server/target/surefire/surefire_1272200291590693242380tmp>
Running org.apache.hadoop.hbase.regionserver.TestSeekOptimizations
Tests run: 6, Failures: 0, Errors: 0, Skipped: 0, Time elapsed: 2.871 sec
Forking command line: /bin/sh -c cd <https://builds.apache.org/job/HBase-TRUNK/ws/trunk/hbase-server>
&& /home/hudson/tools/java/jdk1.6.0_27-32/jre/bin/java -enableassertions -Xmx1900m
-Djava.security.egd=file:/dev/./urandom -jar <https://builds.apache.org/job/HBase-TRUNK/ws/trunk/hbase-server/target/surefire/surefirebooter30403334625871503.jar>
<https://builds.apache.org/job/HBase-TRUNK/ws/trunk/hbase-server/target/surefire/surefire1271372562943728827tmp>
<https://builds.apache.org/job/HBase-TRUNK/ws/trunk/hbase-server/target/surefire/surefire_1283562713276203851525tmp>
Running org.apache.hadoop.hbase.regionserver.wal.TestLogRollAbort
Tests run: 1, Failures: 0, Errors: 0, Skipped: 0, Time elapsed: 166.817 sec
Forking command line: /bin/sh -c cd <https://builds.apache.org/job/HBase-TRUNK/ws/trunk/hbase-server>
&& /home/hudson/tools/java/jdk1.6.0_27-32/jre/bin/java -enableassertions -Xmx1900m
-Djava.security.egd=file:/dev/./urandom -jar <https://builds.apache.org/job/HBase-TRUNK/ws/trunk/hbase-server/target/surefire/surefirebooter4670761756738907734.jar>
<https://builds.apache.org/job/HBase-TRUNK/ws/trunk/hbase-server/target/surefire/surefire6384690790032589611tmp>
<https://builds.apache.org/job/HBase-TRUNK/ws/trunk/hbase-server/target/surefire/surefire_1291468849561755456468tmp>
Running org.apache.hadoop.hbase.regionserver.wal.TestLogRolling
Tests run: 2, Failures: 0, Errors: 0, Skipped: 0, Time elapsed: 239.509 sec
Forking command line: /bin/sh -c cd <https://builds.apache.org/job/HBase-TRUNK/ws/trunk/hbase-server>
&& /home/hudson/tools/java/jdk1.6.0_27-32/jre/bin/java -enableassertions -Xmx1900m
-Djava.security.egd=file:/dev/./urandom -jar <https://builds.apache.org/job/HBase-TRUNK/ws/trunk/hbase-server/target/surefire/surefirebooter5683260381304265696.jar>
<https://builds.apache.org/job/HBase-TRUNK/ws/trunk/hbase-server/target/surefire/surefire474604567031295962tmp>
<https://builds.apache.org/job/HBase-TRUNK/ws/trunk/hbase-server/target/surefire/surefire_1306239948805967751761tmp>
Running org.apache.hadoop.hbase.regionserver.TestSplitLogWorker
Tests run: 5, Failures: 0, Errors: 0, Skipped: 0, Time elapsed: 4.28 sec
Forking command line: /bin/sh -c cd <https://builds.apache.org/job/HBase-TRUNK/ws/trunk/hbase-server>
&& /home/hudson/tools/java/jdk1.6.0_27-32/jre/bin/java -enableassertions -Xmx1900m
-Djava.security.egd=file:/dev/./urandom -jar <https://builds.apache.org/job/HBase-TRUNK/ws/trunk/hbase-server/target/surefire/surefirebooter2361043726761802965.jar>
<https://builds.apache.org/job/HBase-TRUNK/ws/trunk/hbase-server/target/surefire/surefire3502512391733043194tmp>
<https://builds.apache.org/job/HBase-TRUNK/ws/trunk/hbase-server/target/surefire/surefire_131591949000408250125tmp>
Running org.apache.hadoop.hbase.regionserver.TestFSErrorsExposed
Tests run: 3, Failures: 0, Errors: 0, Skipped: 0, Time elapsed: 35.814 sec
Forking command line: /bin/sh -c cd <https://builds.apache.org/job/HBase-TRUNK/ws/trunk/hbase-server>
&& /home/hudson/tools/java/jdk1.6.0_27-32/jre/bin/java -enableassertions -Xmx1900m
-Djava.security.egd=file:/dev/./urandom -jar <https://builds.apache.org/job/HBase-TRUNK/ws/trunk/hbase-server/target/surefire/surefirebooter7594913461122646797.jar>
<https://builds.apache.org/job/HBase-TRUNK/ws/trunk/hbase-server/target/surefire/surefire5450720029615915756tmp>
<https://builds.apache.org/job/HBase-TRUNK/ws/trunk/hbase-server/target/surefire/surefire_1325049646801620758734tmp>
Running org.apache.hadoop.hbase.regionserver.TestCompoundBloomFilter
Tests run: 3, Failures: 0, Errors: 0, Skipped: 0, Time elapsed: 28.298 sec
Forking command line: /bin/sh -c cd <https://builds.apache.org/job/HBase-TRUNK/ws/trunk/hbase-server>
&& /home/hudson/tools/java/jdk1.6.0_27-32/jre/bin/java -enableassertions -Xmx1900m
-Djava.security.egd=file:/dev/./urandom -jar <https://builds.apache.org/job/HBase-TRUNK/ws/trunk/hbase-server/target/surefire/surefirebooter6223610549918585449.jar>
<https://builds.apache.org/job/HBase-TRUNK/ws/trunk/hbase-server/target/surefire/surefire6794030902214879404tmp>
<https://builds.apache.org/job/HBase-TRUNK/ws/trunk/hbase-server/target/surefire/surefire_1331920528160474993141tmp>
Running org.apache.hadoop.hbase.regionserver.TestHRegionServerBulkLoad
Tests run: 1, Failures: 0, Errors: 0, Skipped: 0, Time elapsed: 55.864 sec
Forking command line: /bin/sh -c cd <https://builds.apache.org/job/HBase-TRUNK/ws/trunk/hbase-server>
&& /home/hudson/tools/java/jdk1.6.0_27-32/jre/bin/java -enableassertions -Xmx1900m
-Djava.security.egd=file:/dev/./urandom -jar <https://builds.apache.org/job/HBase-TRUNK/ws/trunk/hbase-server/target/surefire/surefirebooter6962118728086969998.jar>
<https://builds.apache.org/job/HBase-TRUNK/ws/trunk/hbase-server/target/surefire/surefire5183891555222304659tmp>
<https://builds.apache.org/job/HBase-TRUNK/ws/trunk/hbase-server/target/surefire/surefire_1346490619106020078931tmp>
Running org.apache.hadoop.hbase.regionserver.TestMultiColumnScanner
Tests run: 12, Failures: 0, Errors: 0, Skipped: 0, Time elapsed: 44.475 sec
Forking command line: /bin/sh -c cd <https://builds.apache.org/job/HBase-TRUNK/ws/trunk/hbase-server>
&& /home/hudson/tools/java/jdk1.6.0_27-32/jre/bin/java -enableassertions -Xmx1900m
-Djava.security.egd=file:/dev/./urandom -jar <https://builds.apache.org/job/HBase-TRUNK/ws/trunk/hbase-server/target/surefire/surefirebooter2157031005643297812.jar>
<https://builds.apache.org/job/HBase-TRUNK/ws/trunk/hbase-server/target/surefire/surefire2777942531868498772tmp>
<https://builds.apache.org/job/HBase-TRUNK/ws/trunk/hbase-server/target/surefire/surefire_1351919986504255968198tmp>
Running org.apache.hadoop.hbase.regionserver.TestHRegion
Tests run: 62, Failures: 0, Errors: 0, Skipped: 0, Time elapsed: 46.619 sec
Forking command line: /bin/sh -c cd <https://builds.apache.org/job/HBase-TRUNK/ws/trunk/hbase-server>
&& /home/hudson/tools/java/jdk1.6.0_27-32/jre/bin/java -enableassertions -Xmx1900m
-Djava.security.egd=file:/dev/./urandom -jar <https://builds.apache.org/job/HBase-TRUNK/ws/trunk/hbase-server/target/surefire/surefirebooter2956689437802710989.jar>
<https://builds.apache.org/job/HBase-TRUNK/ws/trunk/hbase-server/target/surefire/surefire5239018270024113939tmp>
<https://builds.apache.org/job/HBase-TRUNK/ws/trunk/hbase-server/target/surefire/surefire_1365077222783049777437tmp>
Running org.apache.hadoop.hbase.client.replication.TestReplicationAdmin
Tests run: 1, Failures: 0, Errors: 0, Skipped: 0, Time elapsed: 3.169 sec
Forking command line: /bin/sh -c cd <https://builds.apache.org/job/HBase-TRUNK/ws/trunk/hbase-server>
&& /home/hudson/tools/java/jdk1.6.0_27-32/jre/bin/java -enableassertions -Xmx1900m
-Djava.security.egd=file:/dev/./urandom -jar <https://builds.apache.org/job/HBase-TRUNK/ws/trunk/hbase-server/target/surefire/surefirebooter4029540355466930839.jar>
<https://builds.apache.org/job/HBase-TRUNK/ws/trunk/hbase-server/target/surefire/surefire7385510604737754529tmp>
<https://builds.apache.org/job/HBase-TRUNK/ws/trunk/hbase-server/target/surefire/surefire_1376936291727612793020tmp>
Running org.apache.hadoop.hbase.regionserver.TestCompactionState
Tests run: 2, Failures: 0, Errors: 0, Skipped: 0, Time elapsed: 54.057 sec
Forking command line: /bin/sh -c cd <https://builds.apache.org/job/HBase-TRUNK/ws/trunk/hbase-server>
&& /home/hudson/tools/java/jdk1.6.0_27-32/jre/bin/java -enableassertions -Xmx1900m
-Djava.security.egd=file:/dev/./urandom -jar <https://builds.apache.org/job/HBase-TRUNK/ws/trunk/hbase-server/target/surefire/surefirebooter3007822959126856078.jar>
<https://builds.apache.org/job/HBase-TRUNK/ws/trunk/hbase-server/target/surefire/surefire5145321637308308008tmp>
<https://builds.apache.org/job/HBase-TRUNK/ws/trunk/hbase-server/target/surefire/surefire_1387110877094200146626tmp>
Running org.apache.hadoop.hbase.regionserver.TestEndToEndSplitTransaction
Tests run: 2, Failures: 0, Errors: 0, Skipped: 0, Time elapsed: 77.118 sec
Forking command line: /bin/sh -c cd <https://builds.apache.org/job/HBase-TRUNK/ws/trunk/hbase-server>
&& /home/hudson/tools/java/jdk1.6.0_27-32/jre/bin/java -enableassertions -Xmx1900m
-Djava.security.egd=file:/dev/./urandom -jar <https://builds.apache.org/job/HBase-TRUNK/ws/trunk/hbase-server/target/surefire/surefirebooter6054880662732990927.jar>
<https://builds.apache.org/job/HBase-TRUNK/ws/trunk/hbase-server/target/surefire/surefire8302633558767824315tmp>
<https://builds.apache.org/job/HBase-TRUNK/ws/trunk/hbase-server/target/surefire/surefire_1396763632950972529625tmp>
Running org.apache.hadoop.hbase.client.TestTimestampsFilter
Tests run: 3, Failures: 0, Errors: 0, Skipped: 0, Time elapsed: 30.369 sec
Forking command line: /bin/sh -c cd <https://builds.apache.org/job/HBase-TRUNK/ws/trunk/hbase-server>
&& /home/hudson/tools/java/jdk1.6.0_27-32/jre/bin/java -enableassertions -Xmx1900m
-Djava.security.egd=file:/dev/./urandom -jar <https://builds.apache.org/job/HBase-TRUNK/ws/trunk/hbase-server/target/surefire/surefirebooter50487695238901307.jar>
<https://builds.apache.org/job/HBase-TRUNK/ws/trunk/hbase-server/target/surefire/surefire7052460701221652009tmp>
<https://builds.apache.org/job/HBase-TRUNK/ws/trunk/hbase-server/target/surefire/surefire_1403846035004629928535tmp>
Running org.apache.hadoop.hbase.client.TestMultipleTimestamps
Tests run: 8, Failures: 0, Errors: 0, Skipped: 0, Time elapsed: 49.074 sec
Forking command line: /bin/sh -c cd <https://builds.apache.org/job/HBase-TRUNK/ws/trunk/hbase-server>
&& /home/hudson/tools/java/jdk1.6.0_27-32/jre/bin/java -enableassertions -Xmx1900m
-Djava.security.egd=file:/dev/./urandom -jar <https://builds.apache.org/job/HBase-TRUNK/ws/trunk/hbase-server/target/surefire/surefirebooter3399026505626459493.jar>
<https://builds.apache.org/job/HBase-TRUNK/ws/trunk/hbase-server/target/surefire/surefire3721827943453886770tmp>
<https://builds.apache.org/job/HBase-TRUNK/ws/trunk/hbase-server/target/surefire/surefire_1414085640426625188666tmp>
Running org.apache.hadoop.hbase.client.TestHCM
Tests run: 7, Failures: 0, Errors: 0, Skipped: 0, Time elapsed: 37.866 sec
Forking command line: /bin/sh -c cd <https://builds.apache.org/job/HBase-TRUNK/ws/trunk/hbase-server>
&& /home/hudson/tools/java/jdk1.6.0_27-32/jre/bin/java -enableassertions -Xmx1900m
-Djava.security.egd=file:/dev/./urandom -jar <https://builds.apache.org/job/HBase-TRUNK/ws/trunk/hbase-server/target/surefire/surefirebooter4827501787476000897.jar>
<https://builds.apache.org/job/HBase-TRUNK/ws/trunk/hbase-server/target/surefire/surefire2543312089861349359tmp>
<https://builds.apache.org/job/HBase-TRUNK/ws/trunk/hbase-server/target/surefire/surefire_1426897921315291640754tmp>
Running org.apache.hadoop.hbase.regionserver.wal.TestHLogSplit
Tests run: 30, Failures: 0, Errors: 0, Skipped: 1, Time elapsed: 288.343 sec
Forking command line: /bin/sh -c cd <https://builds.apache.org/job/HBase-TRUNK/ws/trunk/hbase-server>
&& /home/hudson/tools/java/jdk1.6.0_27-32/jre/bin/java -enableassertions -Xmx1900m
-Djava.security.egd=file:/dev/./urandom -jar <https://builds.apache.org/job/HBase-TRUNK/ws/trunk/hbase-server/target/surefire/surefirebooter5238511936506998522.jar>
<https://builds.apache.org/job/HBase-TRUNK/ws/trunk/hbase-server/target/surefire/surefire529647982975219794tmp>
<https://builds.apache.org/job/HBase-TRUNK/ws/trunk/hbase-server/target/surefire/surefire_1436475628506079056414tmp>
Running org.apache.hadoop.hbase.client.TestHTablePool$TestHTableReusablePool
Tests run: 9, Failures: 0, Errors: 0, Skipped: 0, Time elapsed: 5.267 sec
Running org.apache.hadoop.hbase.client.TestHTablePool$TestHTableThreadLocalPool
Tests run: 9, Failures: 0, Errors: 0, Skipped: 0, Time elapsed: 34.344 sec
Forking command line: /bin/sh -c cd <https://builds.apache.org/job/HBase-TRUNK/ws/trunk/hbase-server>
&& /home/hudson/tools/java/jdk1.6.0_27-32/jre/bin/java -enableassertions -Xmx1900m
-Djava.security.egd=file:/dev/./urandom -jar <https://builds.apache.org/job/HBase-TRUNK/ws/trunk/hbase-server/target/surefire/surefirebooter8460363114755633900.jar>
<https://builds.apache.org/job/HBase-TRUNK/ws/trunk/hbase-server/target/surefire/surefire7957756701176257381tmp>
<https://builds.apache.org/job/HBase-TRUNK/ws/trunk/hbase-server/target/surefire/surefire_1448636072151724107373tmp>
Running org.apache.hadoop.hbase.client.TestHTableUtil
Tests run: 2, Failures: 0, Errors: 0, Skipped: 0, Time elapsed: 21.799 sec
Forking command line: /bin/sh -c cd <https://builds.apache.org/job/HBase-TRUNK/ws/trunk/hbase-server>
&& /home/hudson/tools/java/jdk1.6.0_27-32/jre/bin/java -enableassertions -Xmx1900m
-Djava.security.egd=file:/dev/./urandom -jar <https://builds.apache.org/job/HBase-TRUNK/ws/trunk/hbase-server/target/surefire/surefirebooter7929463400147027936.jar>
<https://builds.apache.org/job/HBase-TRUNK/ws/trunk/hbase-server/target/surefire/surefire582287556894861851tmp>
<https://builds.apache.org/job/HBase-TRUNK/ws/trunk/hbase-server/target/surefire/surefire_1458884769590261755155tmp>
Running org.apache.hadoop.hbase.client.TestFromClientSide3
Tests run: 1, Failures: 0, Errors: 0, Skipped: 0, Time elapsed: 36.76 sec
Forking command line: /bin/sh -c cd <https://builds.apache.org/job/HBase-TRUNK/ws/trunk/hbase-server>
&& /home/hudson/tools/java/jdk1.6.0_27-32/jre/bin/java -enableassertions -Xmx1900m
-Djava.security.egd=file:/dev/./urandom -jar <https://builds.apache.org/job/HBase-TRUNK/ws/trunk/hbase-server/target/surefire/surefirebooter1289940005441324414.jar>
<https://builds.apache.org/job/HBase-TRUNK/ws/trunk/hbase-server/target/surefire/surefire1234008618457188978tmp>
<https://builds.apache.org/job/HBase-TRUNK/ws/trunk/hbase-server/target/surefire/surefire_1467766359181238155587tmp>
Running org.apache.hadoop.hbase.client.TestMetaScanner
Tests run: 1, Failures: 0, Errors: 0, Skipped: 0, Time elapsed: 23.177 sec
Forking command line: /bin/sh -c cd <https://builds.apache.org/job/HBase-TRUNK/ws/trunk/hbase-server>
&& /home/hudson/tools/java/jdk1.6.0_27-32/jre/bin/java -enableassertions -Xmx1900m
-Djava.security.egd=file:/dev/./urandom -jar <https://builds.apache.org/job/HBase-TRUNK/ws/trunk/hbase-server/target/surefire/surefirebooter8512444646364609582.jar>
<https://builds.apache.org/job/HBase-TRUNK/ws/trunk/hbase-server/target/surefire/surefire7663199595961873093tmp>
<https://builds.apache.org/job/HBase-TRUNK/ws/trunk/hbase-server/target/surefire/surefire_147945511163518373979tmp>
Running org.apache.hadoop.hbase.client.TestScannerTimeout
Tests run: 4, Failures: 0, Errors: 0, Skipped: 0, Time elapsed: 57.433 sec
Forking command line: /bin/sh -c cd <https://builds.apache.org/job/HBase-TRUNK/ws/trunk/hbase-server>
&& /home/hudson/tools/java/jdk1.6.0_27-32/jre/bin/java -enableassertions -Xmx1900m
-Djava.security.egd=file:/dev/./urandom -jar <https://builds.apache.org/job/HBase-TRUNK/ws/trunk/hbase-server/target/surefire/surefirebooter4879734624175642656.jar>
<https://builds.apache.org/job/HBase-TRUNK/ws/trunk/hbase-server/target/surefire/surefire4326040302710043532tmp>
<https://builds.apache.org/job/HBase-TRUNK/ws/trunk/hbase-server/target/surefire/surefire_1482472502545511457151tmp>
Running org.apache.hadoop.hbase.client.TestMetaMigrationRemovingHTD
Tests run: 3, Failures: 0, Errors: 0, Skipped: 0, Time elapsed: 46.158 sec
Forking command line: /bin/sh -c cd <https://builds.apache.org/job/HBase-TRUNK/ws/trunk/hbase-server>
&& /home/hudson/tools/java/jdk1.6.0_27-32/jre/bin/java -enableassertions -Xmx1900m
-Djava.security.egd=file:/dev/./urandom -jar <https://builds.apache.org/job/HBase-TRUNK/ws/trunk/hbase-server/target/surefire/surefirebooter1014031066619169888.jar>
<https://builds.apache.org/job/HBase-TRUNK/ws/trunk/hbase-server/target/surefire/surefire81678238554968623tmp>
<https://builds.apache.org/job/HBase-TRUNK/ws/trunk/hbase-server/target/surefire/surefire_1494314159602506025763tmp>
Running org.apache.hadoop.hbase.client.TestShell
Tests run: 1, Failures: 0, Errors: 0, Skipped: 0, Time elapsed: 177.246 sec
Forking command line: /bin/sh -c cd <https://builds.apache.org/job/HBase-TRUNK/ws/trunk/hbase-server>
&& /home/hudson/tools/java/jdk1.6.0_27-32/jre/bin/java -enableassertions -Xmx1900m
-Djava.security.egd=file:/dev/./urandom -jar <https://builds.apache.org/job/HBase-TRUNK/ws/trunk/hbase-server/target/surefire/surefirebooter5635855174150800887.jar>
<https://builds.apache.org/job/HBase-TRUNK/ws/trunk/hbase-server/target/surefire/surefire1030836351348896276tmp>
<https://builds.apache.org/job/HBase-TRUNK/ws/trunk/hbase-server/target/surefire/surefire_1503203001244409323293tmp>
Running org.apache.hadoop.hbase.client.TestMultiParallel
Tests run: 11, Failures: 0, Errors: 0, Skipped: 0, Time elapsed: 69.983 sec
Forking command line: /bin/sh -c cd <https://builds.apache.org/job/HBase-TRUNK/ws/trunk/hbase-server>
&& /home/hudson/tools/java/jdk1.6.0_27-32/jre/bin/java -enableassertions -Xmx1900m
-Djava.security.egd=file:/dev/./urandom -jar <https://builds.apache.org/job/HBase-TRUNK/ws/trunk/hbase-server/target/surefire/surefirebooter6307704677765702461.jar>
<https://builds.apache.org/job/HBase-TRUNK/ws/trunk/hbase-server/target/surefire/surefire8267604710424927993tmp>
<https://builds.apache.org/job/HBase-TRUNK/ws/trunk/hbase-server/target/surefire/surefire_1514491571169671137259tmp>
Running org.apache.hadoop.hbase.client.TestFromClientSide
Tests run: 56, Failures: 0, Errors: 0, Skipped: 3, Time elapsed: 284.798 sec
Forking command line: /bin/sh -c cd <https://builds.apache.org/job/HBase-TRUNK/ws/trunk/hbase-server>
&& /home/hudson/tools/java/jdk1.6.0_27-32/jre/bin/java -enableassertions -Xmx1900m
-Djava.security.egd=file:/dev/./urandom -jar <https://builds.apache.org/job/HBase-TRUNK/ws/trunk/hbase-server/target/surefire/surefirebooter3679387971516784634.jar>
<https://builds.apache.org/job/HBase-TRUNK/ws/trunk/hbase-server/target/surefire/surefire3854748160607974461tmp>
<https://builds.apache.org/job/HBase-TRUNK/ws/trunk/hbase-server/target/surefire/surefire_1528863003079649735920tmp>
Running org.apache.hadoop.hbase.TestMultiVersions
Tests run: 3, Failures: 0, Errors: 0, Skipped: 0, Time elapsed: 45.868 sec
Forking command line: /bin/sh -c cd <https://builds.apache.org/job/HBase-TRUNK/ws/trunk/hbase-server>
&& /home/hudson/tools/java/jdk1.6.0_27-32/jre/bin/java -enableassertions -Xmx1900m
-Djava.security.egd=file:/dev/./urandom -jar <https://builds.apache.org/job/HBase-TRUNK/ws/trunk/hbase-server/target/surefire/surefirebooter129850302489050722.jar>
<https://builds.apache.org/job/HBase-TRUNK/ws/trunk/hbase-server/target/surefire/surefire3496044499689106262tmp>
<https://builds.apache.org/job/HBase-TRUNK/ws/trunk/hbase-server/target/surefire/surefire_153848574010324295388tmp>
Running org.apache.hadoop.hbase.client.TestAdmin
Tests run: 39, Failures: 0, Errors: 0, Skipped: 0, Time elapsed: 274.414 sec
Forking command line: /bin/sh -c cd <https://builds.apache.org/job/HBase-TRUNK/ws/trunk/hbase-server>
&& /home/hudson/tools/java/jdk1.6.0_27-32/jre/bin/java -enableassertions -Xmx1900m
-Djava.security.egd=file:/dev/./urandom -jar <https://builds.apache.org/job/HBase-TRUNK/ws/trunk/hbase-server/target/surefire/surefirebooter5891837706329930324.jar>
<https://builds.apache.org/job/HBase-TRUNK/ws/trunk/hbase-server/target/surefire/surefire3384115710670727915tmp>
<https://builds.apache.org/job/HBase-TRUNK/ws/trunk/hbase-server/target/surefire/surefire_1545819037602943114113tmp>
Running org.apache.hadoop.hbase.master.TestActiveMasterManager
Tests run: 2, Failures: 0, Errors: 0, Skipped: 0, Time elapsed: 1.464 sec
Forking command line: /bin/sh -c cd <https://builds.apache.org/job/HBase-TRUNK/ws/trunk/hbase-server>
&& /home/hudson/tools/java/jdk1.6.0_27-32/jre/bin/java -enableassertions -Xmx1900m
-Djava.security.egd=file:/dev/./urandom -jar <https://builds.apache.org/job/HBase-TRUNK/ws/trunk/hbase-server/target/surefire/surefirebooter1259434909924377879.jar>
<https://builds.apache.org/job/HBase-TRUNK/ws/trunk/hbase-server/target/surefire/surefire7246707384361884300tmp>
<https://builds.apache.org/job/HBase-TRUNK/ws/trunk/hbase-server/target/surefire/surefire_1552941655172999436608tmp>
Running org.apache.hadoop.hbase.master.TestMasterNoCluster
Tests run: 3, Failures: 0, Errors: 0, Skipped: 0, Time elapsed: 8.298 sec
Forking command line: /bin/sh -c cd <https://builds.apache.org/job/HBase-TRUNK/ws/trunk/hbase-server>
&& /home/hudson/tools/java/jdk1.6.0_27-32/jre/bin/java -enableassertions -Xmx1900m
-Djava.security.egd=file:/dev/./urandom -jar <https://builds.apache.org/job/HBase-TRUNK/ws/trunk/hbase-server/target/surefire/surefirebooter2379960755614169626.jar>
<https://builds.apache.org/job/HBase-TRUNK/ws/trunk/hbase-server/target/surefire/surefire3939400934035404661tmp>
<https://builds.apache.org/job/HBase-TRUNK/ws/trunk/hbase-server/target/surefire/surefire_1568146113390364848448tmp>
Running org.apache.hadoop.hbase.master.TestLogsCleaner
Tests run: 1, Failures: 0, Errors: 0, Skipped: 0, Time elapsed: 3.56 sec
Forking command line: /bin/sh -c cd <https://builds.apache.org/job/HBase-TRUNK/ws/trunk/hbase-server>
&& /home/hudson/tools/java/jdk1.6.0_27-32/jre/bin/java -enableassertions -Xmx1900m
-Djava.security.egd=file:/dev/./urandom -jar <https://builds.apache.org/job/HBase-TRUNK/ws/trunk/hbase-server/target/surefire/surefirebooter4844968961063161497.jar>
<https://builds.apache.org/job/HBase-TRUNK/ws/trunk/hbase-server/target/surefire/surefire7347008288348593716tmp>
<https://builds.apache.org/job/HBase-TRUNK/ws/trunk/hbase-server/target/surefire/surefire_157307123087018627358tmp>
Running org.apache.hadoop.hbase.thrift.TestThriftServer
Tests run: 1, Failures: 0, Errors: 0, Skipped: 0, Time elapsed: 104.176 sec
Forking command line: /bin/sh -c cd <https://builds.apache.org/job/HBase-TRUNK/ws/trunk/hbase-server>
&& /home/hudson/tools/java/jdk1.6.0_27-32/jre/bin/java -enableassertions -Xmx1900m
-Djava.security.egd=file:/dev/./urandom -jar <https://builds.apache.org/job/HBase-TRUNK/ws/trunk/hbase-server/target/surefire/surefirebooter8131536881428328521.jar>
<https://builds.apache.org/job/HBase-TRUNK/ws/trunk/hbase-server/target/surefire/surefire1394205729441986709tmp>
<https://builds.apache.org/job/HBase-TRUNK/ws/trunk/hbase-server/target/surefire/surefire_1585816220729672279956tmp>
Running org.apache.hadoop.hbase.master.TestRollingRestart
Running org.apache.hadoop.hbase.master.balancer.TestDefaultLoadBalancer
Tests run: 1, Failures: 0, Errors: 0, Skipped: 0, Time elapsed: 1.498 sec
Tests run: 1, Failures: 0, Errors: 0, Skipped: 0, Time elapsed: 80.056 sec
Forking command line: /bin/sh -c cd <https://builds.apache.org/job/HBase-TRUNK/ws/trunk/hbase-server>
&& /home/hudson/tools/java/jdk1.6.0_27-32/jre/bin/java -enableassertions -Xmx1900m
-Djava.security.egd=file:/dev/./urandom -jar <https://builds.apache.org/job/HBase-TRUNK/ws/trunk/hbase-server/target/surefire/surefirebooter2846327162129681864.jar>
<https://builds.apache.org/job/HBase-TRUNK/ws/trunk/hbase-server/target/surefire/surefire3577627121548814738tmp>
<https://builds.apache.org/job/HBase-TRUNK/ws/trunk/hbase-server/target/surefire/surefire_1598198007451600488355tmp>
Forking command line: /bin/sh -c cd <https://builds.apache.org/job/HBase-TRUNK/ws/trunk/hbase-server>
&& /home/hudson/tools/java/jdk1.6.0_27-32/jre/bin/java -enableassertions -Xmx1900m
-Djava.security.egd=file:/dev/./urandom -jar <https://builds.apache.org/job/HBase-TRUNK/ws/trunk/hbase-server/target/surefire/surefirebooter6954094250296484922.jar>
<https://builds.apache.org/job/HBase-TRUNK/ws/trunk/hbase-server/target/surefire/surefire7156123861862505703tmp>
<https://builds.apache.org/job/HBase-TRUNK/ws/trunk/hbase-server/target/surefire/surefire_1606222916507414760037tmp>
Running org.apache.hadoop.hbase.master.balancer.TestBaseLoadBalancer
Tests run: 3, Failures: 0, Errors: 0, Skipped: 0, Time elapsed: 0.365 sec
Forking command line: /bin/sh -c cd <https://builds.apache.org/job/HBase-TRUNK/ws/trunk/hbase-server>
&& /home/hudson/tools/java/jdk1.6.0_27-32/jre/bin/java -enableassertions -Xmx1900m
-Djava.security.egd=file:/dev/./urandom -jar <https://builds.apache.org/job/HBase-TRUNK/ws/trunk/hbase-server/target/surefire/surefirebooter5398457481012999136.jar>
<https://builds.apache.org/job/HBase-TRUNK/ws/trunk/hbase-server/target/surefire/surefire5021776532575021940tmp>
<https://builds.apache.org/job/HBase-TRUNK/ws/trunk/hbase-server/target/surefire/surefire_1612030904998147724253tmp>
Running org.apache.hadoop.hbase.master.TestMaster
Tests run: 1, Failures: 0, Errors: 0, Skipped: 0, Time elapsed: 26.913 sec
Forking command line: /bin/sh -c cd <https://builds.apache.org/job/HBase-TRUNK/ws/trunk/hbase-server>
&& /home/hudson/tools/java/jdk1.6.0_27-32/jre/bin/java -enableassertions -Xmx1900m
-Djava.security.egd=file:/dev/./urandom -jar <https://builds.apache.org/job/HBase-TRUNK/ws/trunk/hbase-server/target/surefire/surefirebooter3866325858456837061.jar>
<https://builds.apache.org/job/HBase-TRUNK/ws/trunk/hbase-server/target/surefire/surefire2164797512088834125tmp>
<https://builds.apache.org/job/HBase-TRUNK/ws/trunk/hbase-server/target/surefire/surefire_1624920636027387144602tmp>
Running org.apache.hadoop.hbase.master.TestZKBasedOpenCloseRegion
Tests run: 4, Failures: 0, Errors: 0, Skipped: 0, Time elapsed: 42.019 sec
Forking command line: /bin/sh -c cd <https://builds.apache.org/job/HBase-TRUNK/ws/trunk/hbase-server>
&& /home/hudson/tools/java/jdk1.6.0_27-32/jre/bin/java -enableassertions -Xmx1900m
-Djava.security.egd=file:/dev/./urandom -jar <https://builds.apache.org/job/HBase-TRUNK/ws/trunk/hbase-server/target/surefire/surefirebooter8155216508841960128.jar>
<https://builds.apache.org/job/HBase-TRUNK/ws/trunk/hbase-server/target/surefire/surefire7545752104638452986tmp>
<https://builds.apache.org/job/HBase-TRUNK/ws/trunk/hbase-server/target/surefire/surefire_1637545778972120186125tmp>
Running org.apache.hadoop.hbase.master.TestMasterTransitions
Tests run: 3, Failures: 0, Errors: 0, Skipped: 3, Time elapsed: 36.279 sec
Forking command line: /bin/sh -c cd <https://builds.apache.org/job/HBase-TRUNK/ws/trunk/hbase-server>
&& /home/hudson/tools/java/jdk1.6.0_27-32/jre/bin/java -enableassertions -Xmx1900m
-Djava.security.egd=file:/dev/./urandom -jar <https://builds.apache.org/job/HBase-TRUNK/ws/trunk/hbase-server/target/surefire/surefirebooter4900927833715163967.jar>
<https://builds.apache.org/job/HBase-TRUNK/ws/trunk/hbase-server/target/surefire/surefire2182269145481137489tmp>
<https://builds.apache.org/job/HBase-TRUNK/ws/trunk/hbase-server/target/surefire/surefire_1645235751210097415044tmp>
Running org.apache.hadoop.hbase.master.TestOpenedRegionHandler
Tests run: 2, Failures: 0, Errors: 0, Skipped: 0, Time elapsed: 26.445 sec
Forking command line: /bin/sh -c cd <https://builds.apache.org/job/HBase-TRUNK/ws/trunk/hbase-server>
&& /home/hudson/tools/java/jdk1.6.0_27-32/jre/bin/java -enableassertions -Xmx1900m
-Djava.security.egd=file:/dev/./urandom -jar <https://builds.apache.org/job/HBase-TRUNK/ws/trunk/hbase-server/target/surefire/surefirebooter441300155716766170.jar>
<https://builds.apache.org/job/HBase-TRUNK/ws/trunk/hbase-server/target/surefire/surefire3467410243328352599tmp>
<https://builds.apache.org/job/HBase-TRUNK/ws/trunk/hbase-server/target/surefire/surefire_1656687632003387113757tmp>
Running org.apache.hadoop.hbase.master.balancer.TestStochasticLoadBalancer
Tests run: 4, Failures: 0, Errors: 0, Skipped: 0, Time elapsed: 98.865 sec
Forking command line: /bin/sh -c cd <https://builds.apache.org/job/HBase-TRUNK/ws/trunk/hbase-server>
&& /home/hudson/tools/java/jdk1.6.0_27-32/jre/bin/java -enableassertions -Xmx1900m
-Djava.security.egd=file:/dev/./urandom -jar <https://builds.apache.org/job/HBase-TRUNK/ws/trunk/hbase-server/target/surefire/surefirebooter2280954101934293923.jar>
<https://builds.apache.org/job/HBase-TRUNK/ws/trunk/hbase-server/target/surefire/surefire9045081234770851109tmp>
<https://builds.apache.org/job/HBase-TRUNK/ws/trunk/hbase-server/target/surefire/surefire_1665907179101318207581tmp>
Running org.apache.hadoop.hbase.master.TestMXBean
Tests run: 1, Failures: 0, Errors: 0, Skipped: 0, Time elapsed: 24.063 sec
Forking command line: /bin/sh -c cd <https://builds.apache.org/job/HBase-TRUNK/ws/trunk/hbase-server>
&& /home/hudson/tools/java/jdk1.6.0_27-32/jre/bin/java -enableassertions -Xmx1900m
-Djava.security.egd=file:/dev/./urandom -jar <https://builds.apache.org/job/HBase-TRUNK/ws/trunk/hbase-server/target/surefire/surefirebooter5105163150479112628.jar>
<https://builds.apache.org/job/HBase-TRUNK/ws/trunk/hbase-server/target/surefire/surefire9071890754450188389tmp>
<https://builds.apache.org/job/HBase-TRUNK/ws/trunk/hbase-server/target/surefire/surefire_1678123313713029989744tmp>
Running org.apache.hadoop.hbase.master.TestSplitLogManager
Tests run: 12, Failures: 0, Errors: 0, Skipped: 0, Time elapsed: 22.328 sec
Forking command line: /bin/sh -c cd <https://builds.apache.org/job/HBase-TRUNK/ws/trunk/hbase-server>
&& /home/hudson/tools/java/jdk1.6.0_27-32/jre/bin/java -enableassertions -Xmx1900m
-Djava.security.egd=file:/dev/./urandom -jar <https://builds.apache.org/job/HBase-TRUNK/ws/trunk/hbase-server/target/surefire/surefirebooter4557544697408044074.jar>
<https://builds.apache.org/job/HBase-TRUNK/ws/trunk/hbase-server/target/surefire/surefire2499741903056565095tmp>
<https://builds.apache.org/job/HBase-TRUNK/ws/trunk/hbase-server/target/surefire/surefire_1684700424767740315137tmp>
Running org.apache.hadoop.hbase.master.TestAssignmentManager
Tests run: 11, Failures: 0, Errors: 0, Skipped: 0, Time elapsed: 4.741 sec
Forking command line: /bin/sh -c cd <https://builds.apache.org/job/HBase-TRUNK/ws/trunk/hbase-server>
&& /home/hudson/tools/java/jdk1.6.0_27-32/jre/bin/java -enableassertions -Xmx1900m
-Djava.security.egd=file:/dev/./urandom -jar <https://builds.apache.org/job/HBase-TRUNK/ws/trunk/hbase-server/target/surefire/surefirebooter4921730217069116967.jar>
<https://builds.apache.org/job/HBase-TRUNK/ws/trunk/hbase-server/target/surefire/surefire2094532879125384328tmp>
<https://builds.apache.org/job/HBase-TRUNK/ws/trunk/hbase-server/target/surefire/surefire_1693568792669511231987tmp>
Running org.apache.hadoop.hbase.master.TestMasterStatusServlet
Tests run: 5, Failures: 0, Errors: 0, Skipped: 0, Time elapsed: 1.214 sec
Forking command line: /bin/sh -c cd <https://builds.apache.org/job/HBase-TRUNK/ws/trunk/hbase-server>
&& /home/hudson/tools/java/jdk1.6.0_27-32/jre/bin/java -enableassertions -Xmx1900m
-Djava.security.egd=file:/dev/./urandom -jar <https://builds.apache.org/job/HBase-TRUNK/ws/trunk/hbase-server/target/surefire/surefirebooter1413218969179129085.jar>
<https://builds.apache.org/job/HBase-TRUNK/ws/trunk/hbase-server/target/surefire/surefire3064017964216421686tmp>
<https://builds.apache.org/job/HBase-TRUNK/ws/trunk/hbase-server/target/surefire/surefire_1707571543718286412817tmp>
Running org.apache.hadoop.hbase.master.TestHMasterRPCException
Tests run: 1, Failures: 0, Errors: 0, Skipped: 0, Time elapsed: 1.454 sec
Forking command line: /bin/sh -c cd <https://builds.apache.org/job/HBase-TRUNK/ws/trunk/hbase-server>
&& /home/hudson/tools/java/jdk1.6.0_27-32/jre/bin/java -enableassertions -Xmx1900m
-Djava.security.egd=file:/dev/./urandom -jar <https://builds.apache.org/job/HBase-TRUNK/ws/trunk/hbase-server/target/surefire/surefirebooter1417984950861788845.jar>
<https://builds.apache.org/job/HBase-TRUNK/ws/trunk/hbase-server/target/surefire/surefire6947043051621289298tmp>
<https://builds.apache.org/job/HBase-TRUNK/ws/trunk/hbase-server/target/surefire/surefire_1716682574361951902357tmp>
Running org.apache.hadoop.hbase.master.TestMasterRestartAfterDisablingTable
Tests run: 1, Failures: 0, Errors: 0, Skipped: 0, Time elapsed: 32.479 sec
Forking command line: /bin/sh -c cd <https://builds.apache.org/job/HBase-TRUNK/ws/trunk/hbase-server>
&& /home/hudson/tools/java/jdk1.6.0_27-32/jre/bin/java -enableassertions -Xmx1900m
-Djava.security.egd=file:/dev/./urandom -jar <https://builds.apache.org/job/HBase-TRUNK/ws/trunk/hbase-server/target/surefire/surefirebooter8358110232547577836.jar>
<https://builds.apache.org/job/HBase-TRUNK/ws/trunk/hbase-server/target/surefire/surefire2536134847051378665tmp>
<https://builds.apache.org/job/HBase-TRUNK/ws/trunk/hbase-server/target/surefire/surefire_1722872461006677435748tmp>
Running org.apache.hadoop.hbase.master.TestMasterShutdown
Tests run: 1, Failures: 0, Errors: 0, Skipped: 0, Time elapsed: 27.609 sec
Forking command line: /bin/sh -c cd <https://builds.apache.org/job/HBase-TRUNK/ws/trunk/hbase-server>
&& /home/hudson/tools/java/jdk1.6.0_27-32/jre/bin/java -enableassertions -Xmx1900m
-Djava.security.egd=file:/dev/./urandom -jar <https://builds.apache.org/job/HBase-TRUNK/ws/trunk/hbase-server/target/surefire/surefirebooter91411967191088666.jar>
<https://builds.apache.org/job/HBase-TRUNK/ws/trunk/hbase-server/target/surefire/surefire5829895887115744243tmp>
<https://builds.apache.org/job/HBase-TRUNK/ws/trunk/hbase-server/target/surefire/surefire_1731507188553713714806tmp>
Running org.apache.hadoop.hbase.master.TestRestartCluster
Tests run: 2, Failures: 0, Errors: 0, Skipped: 0, Time elapsed: 56.664 sec
Forking command line: /bin/sh -c cd <https://builds.apache.org/job/HBase-TRUNK/ws/trunk/hbase-server>
&& /home/hudson/tools/java/jdk1.6.0_27-32/jre/bin/java -enableassertions -Xmx1900m
-Djava.security.egd=file:/dev/./urandom -jar <https://builds.apache.org/job/HBase-TRUNK/ws/trunk/hbase-server/target/surefire/surefirebooter3514632626737418602.jar>
<https://builds.apache.org/job/HBase-TRUNK/ws/trunk/hbase-server/target/surefire/surefire95825900695724893tmp>
<https://builds.apache.org/job/HBase-TRUNK/ws/trunk/hbase-server/target/surefire/surefire_174744000730674241858tmp>
Running org.apache.hadoop.hbase.master.TestMasterFailover
Tests run: 4, Failures: 0, Errors: 0, Skipped: 0, Time elapsed: 125.204 sec
Forking command line: /bin/sh -c cd <https://builds.apache.org/job/HBase-TRUNK/ws/trunk/hbase-server>
&& /home/hudson/tools/java/jdk1.6.0_27-32/jre/bin/java -enableassertions -Xmx1900m
-Djava.security.egd=file:/dev/./urandom -jar <https://builds.apache.org/job/HBase-TRUNK/ws/trunk/hbase-server/target/surefire/surefirebooter5697017152049411165.jar>
<https://builds.apache.org/job/HBase-TRUNK/ws/trunk/hbase-server/target/surefire/surefire900634748477685926tmp>
<https://builds.apache.org/job/HBase-TRUNK/ws/trunk/hbase-server/target/surefire/surefire_1755615374745239617092tmp>
Running org.apache.hadoop.hbase.avro.TestAvroServer
Tests run: 3, Failures: 0, Errors: 0, Skipped: 0, Time elapsed: 48.515 sec
Forking command line: /bin/sh -c cd <https://builds.apache.org/job/HBase-TRUNK/ws/trunk/hbase-server>
&& /home/hudson/tools/java/jdk1.6.0_27-32/jre/bin/java -enableassertions -Xmx1900m
-Djava.security.egd=file:/dev/./urandom -jar <https://builds.apache.org/job/HBase-TRUNK/ws/trunk/hbase-server/target/surefire/surefirebooter1602620332871603206.jar>
<https://builds.apache.org/job/HBase-TRUNK/ws/trunk/hbase-server/target/surefire/surefire1628230191584244158tmp>
<https://builds.apache.org/job/HBase-TRUNK/ws/trunk/hbase-server/target/surefire/surefire_1764645650521323035119tmp>
Running org.apache.hadoop.hbase.master.TestDistributedLogSplitting
Tests run: 4, Failures: 0, Errors: 0, Skipped: 0, Time elapsed: 199.984 sec
Forking command line: /bin/sh -c cd <https://builds.apache.org/job/HBase-TRUNK/ws/trunk/hbase-server>
&& /home/hudson/tools/java/jdk1.6.0_27-32/jre/bin/java -enableassertions -Xmx1900m
-Djava.security.egd=file:/dev/./urandom -jar <https://builds.apache.org/job/HBase-TRUNK/ws/trunk/hbase-server/target/surefire/surefirebooter2791751903440768861.jar>
<https://builds.apache.org/job/HBase-TRUNK/ws/trunk/hbase-server/target/surefire/surefire6138226173624011996tmp>
<https://builds.apache.org/job/HBase-TRUNK/ws/trunk/hbase-server/target/surefire/surefire_1774203409846034669689tmp>
Running org.apache.hadoop.hbase.TestZooKeeper
Tests run: 9, Failures: 0, Errors: 0, Skipped: 0, Time elapsed: 36.763 sec
Forking command line: /bin/sh -c cd <https://builds.apache.org/job/HBase-TRUNK/ws/trunk/hbase-server>
&& /home/hudson/tools/java/jdk1.6.0_27-32/jre/bin/java -enableassertions -Xmx1900m
-Djava.security.egd=file:/dev/./urandom -jar <https://builds.apache.org/job/HBase-TRUNK/ws/trunk/hbase-server/target/surefire/surefirebooter5517052640452431879.jar>
<https://builds.apache.org/job/HBase-TRUNK/ws/trunk/hbase-server/target/surefire/surefire7145357678483784154tmp>
<https://builds.apache.org/job/HBase-TRUNK/ws/trunk/hbase-server/target/surefire/surefire_1784982142654519236045tmp>
Running org.apache.hadoop.hbase.ipc.TestDelayedRpc
Tests run: 4, Failures: 0, Errors: 0, Skipped: 0, Time elapsed: 2.402 sec
Forking command line: /bin/sh -c cd <https://builds.apache.org/job/HBase-TRUNK/ws/trunk/hbase-server>
&& /home/hudson/tools/java/jdk1.6.0_27-32/jre/bin/java -enableassertions -Xmx1900m
-Djava.security.egd=file:/dev/./urandom -jar <https://builds.apache.org/job/HBase-TRUNK/ws/trunk/hbase-server/target/surefire/surefirebooter5105553790862784210.jar>
<https://builds.apache.org/job/HBase-TRUNK/ws/trunk/hbase-server/target/surefire/surefire3647864713986490312tmp>
<https://builds.apache.org/job/HBase-TRUNK/ws/trunk/hbase-server/target/surefire/surefire_1794078628717299803383tmp>
Running org.apache.hadoop.hbase.TestRegionRebalancing
Tests run: 2, Failures: 0, Errors: 0, Skipped: 0, Time elapsed: 157.946 sec
Forking command line: /bin/sh -c cd <https://builds.apache.org/job/HBase-TRUNK/ws/trunk/hbase-server>
&& /home/hudson/tools/java/jdk1.6.0_27-32/jre/bin/java -enableassertions -Xmx1900m
-Djava.security.egd=file:/dev/./urandom -jar <https://builds.apache.org/job/HBase-TRUNK/ws/trunk/hbase-server/target/surefire/surefirebooter4870433810759079828.jar>
<https://builds.apache.org/job/HBase-TRUNK/ws/trunk/hbase-server/target/surefire/surefire3089078339512862477tmp>
<https://builds.apache.org/job/HBase-TRUNK/ws/trunk/hbase-server/target/surefire/surefire_1803753657927506349045tmp>
Running org.apache.hadoop.hbase.thrift2.TestThriftHBaseServiceHandler
Tests run: 12, Failures: 0, Errors: 0, Skipped: 0, Time elapsed: 23.343 sec
Running org.apache.hadoop.hbase.TestInfoServers
Tests run: 2, Failures: 0, Errors: 0, Skipped: 0, Time elapsed: 16.949 sec
Running org.apache.hadoop.hbase.TestAcidGuarantees
Tests run: 3, Failures: 0, Errors: 0, Skipped: 0, Time elapsed: 122.488 sec
Running org.apache.hadoop.hbase.thrift.TestThriftServerCmdLine
Tests run: 20, Failures: 0, Errors: 0, Skipped: 0, Time elapsed: 630.204 sec

Results :

Failed tests:   testMultiSlaveReplication(org.apache.hadoop.hbase.replication.TestMultiSlaveReplication):
expected:<1> but was:<0>

Tests run: 1015, Failures: 1, Errors: 0, Skipped: 9

[INFO] ------------------------------------------------------------------------
[INFO] Reactor Summary:
[INFO] 
[INFO] HBase ............................................. SUCCESS [3.969s]
[INFO] HBase - Common .................................... SUCCESS [14.975s]
[INFO] HBase - Server .................................... FAILURE [58:59.323s]
[INFO] HBase - Assembly .................................. SKIPPED
[INFO] HBase - Site ...................................... SKIPPED
[INFO] ------------------------------------------------------------------------
[INFO] BUILD FAILURE
[INFO] ------------------------------------------------------------------------
[INFO] Total time: 59:18.723s
[INFO] Finished at: Thu May 31 18:04:02 UTC 2012
[INFO] Final Memory: 42M/304M
[INFO] ------------------------------------------------------------------------
[ERROR] Failed to execute goal org.apache.maven.plugins:maven-surefire-plugin:2.12-TRUNK-HBASE-2:test
(secondPartTestsExecution) on project hbase-server: There are test failures.
[ERROR] 
[ERROR] Please refer to <https://builds.apache.org/job/HBase-TRUNK/ws/trunk/hbase-server/target/surefire-reports>
for the individual test results.
[ERROR] -> [Help 1]
org.apache.maven.lifecycle.LifecycleExecutionException: Failed to execute goal org.apache.maven.plugins:maven-surefire-plugin:2.12-TRUNK-HBASE-2:test
(secondPartTestsExecution) on project hbase-server: There are test failures.

Please refer to <https://builds.apache.org/job/HBase-TRUNK/ws/trunk/hbase-server/target/surefire-reports>
for the individual test results.
	at org.apache.maven.lifecycle.internal.MojoExecutor.execute(MojoExecutor.java:213)
	at org.apache.maven.lifecycle.internal.MojoExecutor.execute(MojoExecutor.java:153)
	at org.apache.maven.lifecycle.internal.MojoExecutor.execute(MojoExecutor.java:145)
	at org.apache.maven.lifecycle.internal.LifecycleModuleBuilder.buildProject(LifecycleModuleBuilder.java:84)
	at org.apache.maven.lifecycle.internal.LifecycleModuleBuilder.buildProject(LifecycleModuleBuilder.java:59)
	at org.apache.maven.lifecycle.internal.LifecycleStarter.singleThreadedBuild(LifecycleStarter.java:183)
	at org.apache.maven.lifecycle.internal.LifecycleStarter.execute(LifecycleStarter.java:161)
	at org.apache.maven.DefaultMaven.doExecute(DefaultMaven.java:319)
	at org.apache.maven.DefaultMaven.execute(DefaultMaven.java:156)
	at org.apache.maven.cli.MavenCli.execute(MavenCli.java:537)
	at org.apache.maven.cli.MavenCli.doMain(MavenCli.java:196)
	at org.apache.maven.cli.MavenCli.main(MavenCli.java:141)
	at sun.reflect.NativeMethodAccessorImpl.invoke0(Native Method)
	at sun.reflect.NativeMethodAccessorImpl.invoke(NativeMethodAccessorImpl.java:39)
	at sun.reflect.DelegatingMethodAccessorImpl.invoke(DelegatingMethodAccessorImpl.java:25)
	at java.lang.reflect.Method.invoke(Method.java:597)
	at org.codehaus.plexus.classworlds.launcher.Launcher.launchEnhanced(Launcher.java:290)
	at org.codehaus.plexus.classworlds.launcher.Launcher.launch(Launcher.java:230)
	at org.codehaus.plexus.classworlds.launcher.Launcher.mainWithExitCode(Launcher.java:409)
	at org.codehaus.plexus.classworlds.launcher.Launcher.main(Launcher.java:352)
Caused by: org.apache.maven.plugin.MojoFailureException: There are test failures.

Please refer to <https://builds.apache.org/job/HBase-TRUNK/ws/trunk/hbase-server/target/surefire-reports>
for the individual test results.
	at org.apache.maven.plugin.surefire.SurefireHelper.reportExecution(SurefireHelper.java:87)
	at org.apache.maven.plugin.surefire.SurefirePlugin.writeSummary(SurefirePlugin.java:651)
	at org.apache.maven.plugin.surefire.SurefirePlugin.handleSummary(SurefirePlugin.java:625)
	at org.apache.maven.plugin.surefire.AbstractSurefireMojo.executeAfterPreconditionsChecked(AbstractSurefireMojo.java:137)
	at org.apache.maven.plugin.surefire.AbstractSurefireMojo.execute(AbstractSurefireMojo.java:98)
	at org.apache.maven.plugin.DefaultBuildPluginManager.executeMojo(DefaultBuildPluginManager.java:101)
	at org.apache.maven.lifecycle.internal.MojoExecutor.execute(MojoExecutor.java:209)
	... 19 more
[ERROR] 
[ERROR] 
[ERROR] For more information about the errors and possible solutions, please read the following
articles:
[ERROR] [Help 1] http://cwiki.apache.org/confluence/display/MAVEN/MojoFailureException
[ERROR] 
[ERROR] After correcting the problems, you can resume the build with the command
[ERROR]   mvn <goals> -rf :hbase-server
Build step 'Invoke top-level Maven targets' marked build as failure
Archiving artifacts
Recording test results
Updating HBASE-6109

Mime
View raw message