hbase-dev mailing list archives

Site index · List index
Message view « Date » · « Thread »
Top « Date » · « Thread »
From Apache Jenkins Server <jenk...@builds.apache.org>
Subject Build failed in Jenkins: HBase-TRUNK #2935
Date Sun, 27 May 2012 22:26:07 GMT
See <https://builds.apache.org/job/HBase-TRUNK/2935/changes>

Changes:

[tedyu] HBASE-6110 Fix TestInfoServers, patch v3 (Jesse)

------------------------------------------
[...truncated 5774 lines...]
Forking command line: /bin/sh -c cd <https://builds.apache.org/job/HBase-TRUNK/ws/trunk/hbase-server>
&& /home/jenkins/tools/java/jdk1.6.0_27-32/jre/bin/java -enableassertions -Xmx1900m
-Djava.security.egd=file:/dev/./urandom -jar <https://builds.apache.org/job/HBase-TRUNK/ws/trunk/hbase-server/target/surefire/surefirebooter1590599687472892319.jar>
<https://builds.apache.org/job/HBase-TRUNK/ws/trunk/hbase-server/target/surefire/surefire7228238705817608583tmp>
<https://builds.apache.org/job/HBase-TRUNK/ws/trunk/hbase-server/target/surefire/surefire_1207277616356203315185tmp>
Running org.apache.hadoop.hbase.client.TestFromClientSide3
Tests run: 1, Failures: 0, Errors: 0, Skipped: 0, Time elapsed: 26.245 sec
Forking command line: /bin/sh -c cd <https://builds.apache.org/job/HBase-TRUNK/ws/trunk/hbase-server>
&& /home/jenkins/tools/java/jdk1.6.0_27-32/jre/bin/java -enableassertions -Xmx1900m
-Djava.security.egd=file:/dev/./urandom -jar <https://builds.apache.org/job/HBase-TRUNK/ws/trunk/hbase-server/target/surefire/surefirebooter6238631438430792001.jar>
<https://builds.apache.org/job/HBase-TRUNK/ws/trunk/hbase-server/target/surefire/surefire7655746689392582603tmp>
<https://builds.apache.org/job/HBase-TRUNK/ws/trunk/hbase-server/target/surefire/surefire_1213720066547736635928tmp>
Running org.apache.hadoop.hbase.TestAcidGuarantees
Tests run: 3, Failures: 0, Errors: 0, Skipped: 0, Time elapsed: 109.267 sec
Forking command line: /bin/sh -c cd <https://builds.apache.org/job/HBase-TRUNK/ws/trunk/hbase-server>
&& /home/jenkins/tools/java/jdk1.6.0_27-32/jre/bin/java -enableassertions -Xmx1900m
-Djava.security.egd=file:/dev/./urandom -jar <https://builds.apache.org/job/HBase-TRUNK/ws/trunk/hbase-server/target/surefire/surefirebooter4462521170457023047.jar>
<https://builds.apache.org/job/HBase-TRUNK/ws/trunk/hbase-server/target/surefire/surefire4645517184279311001tmp>
<https://builds.apache.org/job/HBase-TRUNK/ws/trunk/hbase-server/target/surefire/surefire_1221665874939012813263tmp>
Running org.apache.hadoop.hbase.client.TestTimestampsFilter
Tests run: 3, Failures: 0, Errors: 0, Skipped: 0, Time elapsed: 23.755 sec
Forking command line: /bin/sh -c cd <https://builds.apache.org/job/HBase-TRUNK/ws/trunk/hbase-server>
&& /home/jenkins/tools/java/jdk1.6.0_27-32/jre/bin/java -enableassertions -Xmx1900m
-Djava.security.egd=file:/dev/./urandom -jar <https://builds.apache.org/job/HBase-TRUNK/ws/trunk/hbase-server/target/surefire/surefirebooter8563814272689968779.jar>
<https://builds.apache.org/job/HBase-TRUNK/ws/trunk/hbase-server/target/surefire/surefire979438598380739715tmp>
<https://builds.apache.org/job/HBase-TRUNK/ws/trunk/hbase-server/target/surefire/surefire_1234311377244518915658tmp>
Running org.apache.hadoop.hbase.catalog.TestCatalogTrackerOnCluster
Tests run: 1, Failures: 0, Errors: 0, Skipped: 0, Time elapsed: 85.06 sec
Forking command line: /bin/sh -c cd <https://builds.apache.org/job/HBase-TRUNK/ws/trunk/hbase-server>
&& /home/jenkins/tools/java/jdk1.6.0_27-32/jre/bin/java -enableassertions -Xmx1900m
-Djava.security.egd=file:/dev/./urandom -jar <https://builds.apache.org/job/HBase-TRUNK/ws/trunk/hbase-server/target/surefire/surefirebooter3948502354604416685.jar>
<https://builds.apache.org/job/HBase-TRUNK/ws/trunk/hbase-server/target/surefire/surefire4941268053922986728tmp>
<https://builds.apache.org/job/HBase-TRUNK/ws/trunk/hbase-server/target/surefire/surefire_12414864520551314440tmp>
Running org.apache.hadoop.hbase.client.TestHCM
Tests run: 7, Failures: 0, Errors: 0, Skipped: 0, Time elapsed: 17.305 sec
Forking command line: /bin/sh -c cd <https://builds.apache.org/job/HBase-TRUNK/ws/trunk/hbase-server>
&& /home/jenkins/tools/java/jdk1.6.0_27-32/jre/bin/java -enableassertions -Xmx1900m
-Djava.security.egd=file:/dev/./urandom -jar <https://builds.apache.org/job/HBase-TRUNK/ws/trunk/hbase-server/target/surefire/surefirebooter7199917803268130849.jar>
<https://builds.apache.org/job/HBase-TRUNK/ws/trunk/hbase-server/target/surefire/surefire8688595982036267889tmp>
<https://builds.apache.org/job/HBase-TRUNK/ws/trunk/hbase-server/target/surefire/surefire_1257996239299639944510tmp>
Running org.apache.hadoop.hbase.client.TestScannerTimeout
Tests run: 4, Failures: 0, Errors: 0, Skipped: 0, Time elapsed: 47.594 sec
Forking command line: /bin/sh -c cd <https://builds.apache.org/job/HBase-TRUNK/ws/trunk/hbase-server>
&& /home/jenkins/tools/java/jdk1.6.0_27-32/jre/bin/java -enableassertions -Xmx1900m
-Djava.security.egd=file:/dev/./urandom -jar <https://builds.apache.org/job/HBase-TRUNK/ws/trunk/hbase-server/target/surefire/surefirebooter6336588878709513175.jar>
<https://builds.apache.org/job/HBase-TRUNK/ws/trunk/hbase-server/target/surefire/surefire1684705859213630726tmp>
<https://builds.apache.org/job/HBase-TRUNK/ws/trunk/hbase-server/target/surefire/surefire_1262575559554701034625tmp>
Running org.apache.hadoop.hbase.client.TestMetaScanner
Tests run: 1, Failures: 0, Errors: 0, Skipped: 0, Time elapsed: 13.159 sec
Forking command line: /bin/sh -c cd <https://builds.apache.org/job/HBase-TRUNK/ws/trunk/hbase-server>
&& /home/jenkins/tools/java/jdk1.6.0_27-32/jre/bin/java -enableassertions -Xmx1900m
-Djava.security.egd=file:/dev/./urandom -jar <https://builds.apache.org/job/HBase-TRUNK/ws/trunk/hbase-server/target/surefire/surefirebooter1459423605702826318.jar>
<https://builds.apache.org/job/HBase-TRUNK/ws/trunk/hbase-server/target/surefire/surefire2529911559879429445tmp>
<https://builds.apache.org/job/HBase-TRUNK/ws/trunk/hbase-server/target/surefire/surefire_1277803107075658714465tmp>
Running org.apache.hadoop.hbase.client.TestShell
Running org.apache.hadoop.hbase.client.TestHTableUtil
Tests run: 2, Failures: 0, Errors: 0, Skipped: 0, Time elapsed: 15.877 sec
Tests run: 1, Failures: 0, Errors: 0, Skipped: 0, Time elapsed: 108.723 sec
Forking command line: /bin/sh -c cd <https://builds.apache.org/job/HBase-TRUNK/ws/trunk/hbase-server>
&& /home/jenkins/tools/java/jdk1.6.0_27-32/jre/bin/java -enableassertions -Xmx1900m
-Djava.security.egd=file:/dev/./urandom -jar <https://builds.apache.org/job/HBase-TRUNK/ws/trunk/hbase-server/target/surefire/surefirebooter2447798575004853249.jar>
<https://builds.apache.org/job/HBase-TRUNK/ws/trunk/hbase-server/target/surefire/surefire1128435356325149581tmp>
<https://builds.apache.org/job/HBase-TRUNK/ws/trunk/hbase-server/target/surefire/surefire_1282890773061364605432tmp>
Forking command line: /bin/sh -c cd <https://builds.apache.org/job/HBase-TRUNK/ws/trunk/hbase-server>
&& /home/jenkins/tools/java/jdk1.6.0_27-32/jre/bin/java -enableassertions -Xmx1900m
-Djava.security.egd=file:/dev/./urandom -jar <https://builds.apache.org/job/HBase-TRUNK/ws/trunk/hbase-server/target/surefire/surefirebooter8723806630185093190.jar>
<https://builds.apache.org/job/HBase-TRUNK/ws/trunk/hbase-server/target/surefire/surefire3793532426308749476tmp>
<https://builds.apache.org/job/HBase-TRUNK/ws/trunk/hbase-server/target/surefire/surefire_1293844638966163611285tmp>
Running org.apache.hadoop.hbase.client.TestHTablePool$TestHTableReusablePool
Tests run: 9, Failures: 0, Errors: 0, Skipped: 0, Time elapsed: 5.128 sec
Running org.apache.hadoop.hbase.client.TestHTablePool$TestHTableThreadLocalPool
Tests run: 9, Failures: 0, Errors: 0, Skipped: 0, Time elapsed: 24.459 sec
Forking command line: /bin/sh -c cd <https://builds.apache.org/job/HBase-TRUNK/ws/trunk/hbase-server>
&& /home/jenkins/tools/java/jdk1.6.0_27-32/jre/bin/java -enableassertions -Xmx1900m
-Djava.security.egd=file:/dev/./urandom -jar <https://builds.apache.org/job/HBase-TRUNK/ws/trunk/hbase-server/target/surefire/surefirebooter3533924572767217005.jar>
<https://builds.apache.org/job/HBase-TRUNK/ws/trunk/hbase-server/target/surefire/surefire3194562935510828779tmp>
<https://builds.apache.org/job/HBase-TRUNK/ws/trunk/hbase-server/target/surefire/surefire_1304819338566900733195tmp>
Running org.apache.hadoop.hbase.client.TestMetaMigrationRemovingHTD
Tests run: 3, Failures: 0, Errors: 0, Skipped: 0, Time elapsed: 27.33 sec
Forking command line: /bin/sh -c cd <https://builds.apache.org/job/HBase-TRUNK/ws/trunk/hbase-server>
&& /home/jenkins/tools/java/jdk1.6.0_27-32/jre/bin/java -enableassertions -Xmx1900m
-Djava.security.egd=file:/dev/./urandom -jar <https://builds.apache.org/job/HBase-TRUNK/ws/trunk/hbase-server/target/surefire/surefirebooter8617883819172170807.jar>
<https://builds.apache.org/job/HBase-TRUNK/ws/trunk/hbase-server/target/surefire/surefire7495858124217412915tmp>
<https://builds.apache.org/job/HBase-TRUNK/ws/trunk/hbase-server/target/surefire/surefire_131448333483963182383tmp>
Running org.apache.hadoop.hbase.client.replication.TestReplicationAdmin
Tests run: 1, Failures: 0, Errors: 0, Skipped: 0, Time elapsed: 0.927 sec
Forking command line: /bin/sh -c cd <https://builds.apache.org/job/HBase-TRUNK/ws/trunk/hbase-server>
&& /home/jenkins/tools/java/jdk1.6.0_27-32/jre/bin/java -enableassertions -Xmx1900m
-Djava.security.egd=file:/dev/./urandom -jar <https://builds.apache.org/job/HBase-TRUNK/ws/trunk/hbase-server/target/surefire/surefirebooter3458926978176151278.jar>
<https://builds.apache.org/job/HBase-TRUNK/ws/trunk/hbase-server/target/surefire/surefire8503251768641836696tmp>
<https://builds.apache.org/job/HBase-TRUNK/ws/trunk/hbase-server/target/surefire/surefire_1328930683764467453276tmp>
Running org.apache.hadoop.hbase.client.TestMultipleTimestamps
Tests run: 8, Failures: 0, Errors: 0, Skipped: 0, Time elapsed: 31.327 sec
Forking command line: /bin/sh -c cd <https://builds.apache.org/job/HBase-TRUNK/ws/trunk/hbase-server>
&& /home/jenkins/tools/java/jdk1.6.0_27-32/jre/bin/java -enableassertions -Xmx1900m
-Djava.security.egd=file:/dev/./urandom -jar <https://builds.apache.org/job/HBase-TRUNK/ws/trunk/hbase-server/target/surefire/surefirebooter5187516961576385068.jar>
<https://builds.apache.org/job/HBase-TRUNK/ws/trunk/hbase-server/target/surefire/surefire3793287246190715345tmp>
<https://builds.apache.org/job/HBase-TRUNK/ws/trunk/hbase-server/target/surefire/surefire_1337829840504608541469tmp>
Running org.apache.hadoop.hbase.client.TestMultiParallel
Tests run: 11, Failures: 0, Errors: 0, Skipped: 0, Time elapsed: 39.773 sec
Forking command line: /bin/sh -c cd <https://builds.apache.org/job/HBase-TRUNK/ws/trunk/hbase-server>
&& /home/jenkins/tools/java/jdk1.6.0_27-32/jre/bin/java -enableassertions -Xmx1900m
-Djava.security.egd=file:/dev/./urandom -jar <https://builds.apache.org/job/HBase-TRUNK/ws/trunk/hbase-server/target/surefire/surefirebooter6160257687752235046.jar>
<https://builds.apache.org/job/HBase-TRUNK/ws/trunk/hbase-server/target/surefire/surefire5922504737807207908tmp>
<https://builds.apache.org/job/HBase-TRUNK/ws/trunk/hbase-server/target/surefire/surefire_1346185264006743823854tmp>
Running org.apache.hadoop.hbase.client.TestFromClientSide
Tests run: 56, Failures: 0, Errors: 0, Skipped: 3, Time elapsed: 175.561 sec
Forking command line: /bin/sh -c cd <https://builds.apache.org/job/HBase-TRUNK/ws/trunk/hbase-server>
&& /home/jenkins/tools/java/jdk1.6.0_27-32/jre/bin/java -enableassertions -Xmx1900m
-Djava.security.egd=file:/dev/./urandom -jar <https://builds.apache.org/job/HBase-TRUNK/ws/trunk/hbase-server/target/surefire/surefirebooter902405562370516636.jar>
<https://builds.apache.org/job/HBase-TRUNK/ws/trunk/hbase-server/target/surefire/surefire8623753320764648606tmp>
<https://builds.apache.org/job/HBase-TRUNK/ws/trunk/hbase-server/target/surefire/surefire_13592130324988088079tmp>
Running org.apache.hadoop.hbase.rest.TestGzipFilter
Tests run: 3, Failures: 0, Errors: 0, Skipped: 0, Time elapsed: 13.69 sec
Forking command line: /bin/sh -c cd <https://builds.apache.org/job/HBase-TRUNK/ws/trunk/hbase-server>
&& /home/jenkins/tools/java/jdk1.6.0_27-32/jre/bin/java -enableassertions -Xmx1900m
-Djava.security.egd=file:/dev/./urandom -jar <https://builds.apache.org/job/HBase-TRUNK/ws/trunk/hbase-server/target/surefire/surefirebooter1034179542881469260.jar>
<https://builds.apache.org/job/HBase-TRUNK/ws/trunk/hbase-server/target/surefire/surefire8552625207646193663tmp>
<https://builds.apache.org/job/HBase-TRUNK/ws/trunk/hbase-server/target/surefire/surefire_1366828465094034438587tmp>
Running org.apache.hadoop.hbase.constraint.TestConstraint
Tests run: 5, Failures: 0, Errors: 0, Skipped: 0, Time elapsed: 29.889 sec
Forking command line: /bin/sh -c cd <https://builds.apache.org/job/HBase-TRUNK/ws/trunk/hbase-server>
&& /home/jenkins/tools/java/jdk1.6.0_27-32/jre/bin/java -enableassertions -Xmx1900m
-Djava.security.egd=file:/dev/./urandom -jar <https://builds.apache.org/job/HBase-TRUNK/ws/trunk/hbase-server/target/surefire/surefirebooter4378991217427134690.jar>
<https://builds.apache.org/job/HBase-TRUNK/ws/trunk/hbase-server/target/surefire/surefire4763760208954961321tmp>
<https://builds.apache.org/job/HBase-TRUNK/ws/trunk/hbase-server/target/surefire/surefire_137431783425409900981tmp>
Running org.apache.hadoop.hbase.rest.TestMultiRowResource
Tests run: 3, Failures: 0, Errors: 0, Skipped: 0, Time elapsed: 15.14 sec
Forking command line: /bin/sh -c cd <https://builds.apache.org/job/HBase-TRUNK/ws/trunk/hbase-server>
&& /home/jenkins/tools/java/jdk1.6.0_27-32/jre/bin/java -enableassertions -Xmx1900m
-Djava.security.egd=file:/dev/./urandom -jar <https://builds.apache.org/job/HBase-TRUNK/ws/trunk/hbase-server/target/surefire/surefirebooter3714067588924247640.jar>
<https://builds.apache.org/job/HBase-TRUNK/ws/trunk/hbase-server/target/surefire/surefire8657038285077703651tmp>
<https://builds.apache.org/job/HBase-TRUNK/ws/trunk/hbase-server/target/surefire/surefire_1384408194303208333989tmp>
Running org.apache.hadoop.hbase.rest.TestScannersWithFilters
Tests run: 10, Failures: 0, Errors: 0, Skipped: 0, Time elapsed: 19.809 sec
Forking command line: /bin/sh -c cd <https://builds.apache.org/job/HBase-TRUNK/ws/trunk/hbase-server>
&& /home/jenkins/tools/java/jdk1.6.0_27-32/jre/bin/java -enableassertions -Xmx1900m
-Djava.security.egd=file:/dev/./urandom -jar <https://builds.apache.org/job/HBase-TRUNK/ws/trunk/hbase-server/target/surefire/surefirebooter1836365401044119693.jar>
<https://builds.apache.org/job/HBase-TRUNK/ws/trunk/hbase-server/target/surefire/surefire2591301899368045211tmp>
<https://builds.apache.org/job/HBase-TRUNK/ws/trunk/hbase-server/target/surefire/surefire_1398751289531368837618tmp>
Running org.apache.hadoop.hbase.rest.TestRowResource
Tests run: 11, Failures: 0, Errors: 0, Skipped: 0, Time elapsed: 16.789 sec
Forking command line: /bin/sh -c cd <https://builds.apache.org/job/HBase-TRUNK/ws/trunk/hbase-server>
&& /home/jenkins/tools/java/jdk1.6.0_27-32/jre/bin/java -enableassertions -Xmx1900m
-Djava.security.egd=file:/dev/./urandom -jar <https://builds.apache.org/job/HBase-TRUNK/ws/trunk/hbase-server/target/surefire/surefirebooter7259269968013095980.jar>
<https://builds.apache.org/job/HBase-TRUNK/ws/trunk/hbase-server/target/surefire/surefire2694051685659316949tmp>
<https://builds.apache.org/job/HBase-TRUNK/ws/trunk/hbase-server/target/surefire/surefire_1402451824460215866794tmp>
Running org.apache.hadoop.hbase.rest.client.TestRemoteAdmin
Tests run: 1, Failures: 0, Errors: 0, Skipped: 0, Time elapsed: 16.22 sec
Forking command line: /bin/sh -c cd <https://builds.apache.org/job/HBase-TRUNK/ws/trunk/hbase-server>
&& /home/jenkins/tools/java/jdk1.6.0_27-32/jre/bin/java -enableassertions -Xmx1900m
-Djava.security.egd=file:/dev/./urandom -jar <https://builds.apache.org/job/HBase-TRUNK/ws/trunk/hbase-server/target/surefire/surefirebooter5090116864431404523.jar>
<https://builds.apache.org/job/HBase-TRUNK/ws/trunk/hbase-server/target/surefire/surefire5190639915584915064tmp>
<https://builds.apache.org/job/HBase-TRUNK/ws/trunk/hbase-server/target/surefire/surefire_1417848391775250843215tmp>
Running org.apache.hadoop.hbase.rest.client.TestRemoteTable
Tests run: 3, Failures: 0, Errors: 0, Skipped: 0, Time elapsed: 16.52 sec
Forking command line: /bin/sh -c cd <https://builds.apache.org/job/HBase-TRUNK/ws/trunk/hbase-server>
&& /home/jenkins/tools/java/jdk1.6.0_27-32/jre/bin/java -enableassertions -Xmx1900m
-Djava.security.egd=file:/dev/./urandom -jar <https://builds.apache.org/job/HBase-TRUNK/ws/trunk/hbase-server/target/surefire/surefirebooter2833985349756809657.jar>
<https://builds.apache.org/job/HBase-TRUNK/ws/trunk/hbase-server/target/surefire/surefire26437522029963243tmp>
<https://builds.apache.org/job/HBase-TRUNK/ws/trunk/hbase-server/target/surefire/surefire_1428090894446218426003tmp>
Running org.apache.hadoop.hbase.rest.TestVersionResource
Tests run: 7, Failures: 0, Errors: 0, Skipped: 0, Time elapsed: 13.163 sec
Forking command line: /bin/sh -c cd <https://builds.apache.org/job/HBase-TRUNK/ws/trunk/hbase-server>
&& /home/jenkins/tools/java/jdk1.6.0_27-32/jre/bin/java -enableassertions -Xmx1900m
-Djava.security.egd=file:/dev/./urandom -jar <https://builds.apache.org/job/HBase-TRUNK/ws/trunk/hbase-server/target/surefire/surefirebooter7803819524015344468.jar>
<https://builds.apache.org/job/HBase-TRUNK/ws/trunk/hbase-server/target/surefire/surefire2596136942115177867tmp>
<https://builds.apache.org/job/HBase-TRUNK/ws/trunk/hbase-server/target/surefire/surefire_1437335567330269003979tmp>
Running org.apache.hadoop.hbase.rest.TestScannerResource
Running org.apache.hadoop.hbase.rest.TestTableResource
Tests run: 5, Failures: 0, Errors: 0, Skipped: 0, Time elapsed: 34.801 sec
Tests run: 8, Failures: 0, Errors: 0, Skipped: 0, Time elapsed: 25.804 sec
Forking command line: /bin/sh -c cd <https://builds.apache.org/job/HBase-TRUNK/ws/trunk/hbase-server>
&& /home/jenkins/tools/java/jdk1.6.0_27-32/jre/bin/java -enableassertions -Xmx1900m
-Djava.security.egd=file:/dev/./urandom -jar <https://builds.apache.org/job/HBase-TRUNK/ws/trunk/hbase-server/target/surefire/surefirebooter5763805285360482036.jar>
<https://builds.apache.org/job/HBase-TRUNK/ws/trunk/hbase-server/target/surefire/surefire7438361456362899792tmp>
<https://builds.apache.org/job/HBase-TRUNK/ws/trunk/hbase-server/target/surefire/surefire_144177928950939344946tmp>
Forking command line: /bin/sh -c cd <https://builds.apache.org/job/HBase-TRUNK/ws/trunk/hbase-server>
&& /home/jenkins/tools/java/jdk1.6.0_27-32/jre/bin/java -enableassertions -Xmx1900m
-Djava.security.egd=file:/dev/./urandom -jar <https://builds.apache.org/job/HBase-TRUNK/ws/trunk/hbase-server/target/surefire/surefirebooter7674929140479835421.jar>
<https://builds.apache.org/job/HBase-TRUNK/ws/trunk/hbase-server/target/surefire/surefire8355249710941368718tmp>
<https://builds.apache.org/job/HBase-TRUNK/ws/trunk/hbase-server/target/surefire/surefire_1452859511550884502473tmp>
Running org.apache.hadoop.hbase.mapreduce.TestTableInputFormatScan
Tests run: 12, Failures: 0, Errors: 0, Skipped: 0, Time elapsed: 601.219 sec
Forking command line: /bin/sh -c cd <https://builds.apache.org/job/HBase-TRUNK/ws/trunk/hbase-server>
&& /home/jenkins/tools/java/jdk1.6.0_27-32/jre/bin/java -enableassertions -Xmx1900m
-Djava.security.egd=file:/dev/./urandom -jar <https://builds.apache.org/job/HBase-TRUNK/ws/trunk/hbase-server/target/surefire/surefirebooter2168747106415178326.jar>
<https://builds.apache.org/job/HBase-TRUNK/ws/trunk/hbase-server/target/surefire/surefire949928253694863315tmp>
<https://builds.apache.org/job/HBase-TRUNK/ws/trunk/hbase-server/target/surefire/surefire_1466691578771397862434tmp>
Running org.apache.hadoop.hbase.rest.TestStatusResource
Tests run: 2, Failures: 0, Errors: 0, Skipped: 0, Time elapsed: 11.55 sec
Forking command line: /bin/sh -c cd <https://builds.apache.org/job/HBase-TRUNK/ws/trunk/hbase-server>
&& /home/jenkins/tools/java/jdk1.6.0_27-32/jre/bin/java -enableassertions -Xmx1900m
-Djava.security.egd=file:/dev/./urandom -jar <https://builds.apache.org/job/HBase-TRUNK/ws/trunk/hbase-server/target/surefire/surefirebooter438449765927559560.jar>
<https://builds.apache.org/job/HBase-TRUNK/ws/trunk/hbase-server/target/surefire/surefire1752309675378524449tmp>
<https://builds.apache.org/job/HBase-TRUNK/ws/trunk/hbase-server/target/surefire/surefire_1474048787319634162508tmp>
Running org.apache.hadoop.hbase.rest.TestSchemaResource
Tests run: 2, Failures: 0, Errors: 0, Skipped: 0, Time elapsed: 20.732 sec
Forking command line: /bin/sh -c cd <https://builds.apache.org/job/HBase-TRUNK/ws/trunk/hbase-server>
&& /home/jenkins/tools/java/jdk1.6.0_27-32/jre/bin/java -enableassertions -Xmx1900m
-Djava.security.egd=file:/dev/./urandom -jar <https://builds.apache.org/job/HBase-TRUNK/ws/trunk/hbase-server/target/surefire/surefirebooter5138881282231422048.jar>
<https://builds.apache.org/job/HBase-TRUNK/ws/trunk/hbase-server/target/surefire/surefire3997678197777051590tmp>
<https://builds.apache.org/job/HBase-TRUNK/ws/trunk/hbase-server/target/surefire/surefire_1486180480847777699927tmp>
Running org.apache.hadoop.hbase.client.TestAdmin
Tests run: 39, Failures: 0, Errors: 0, Skipped: 0, Time elapsed: 164.82 sec
Forking command line: /bin/sh -c cd <https://builds.apache.org/job/HBase-TRUNK/ws/trunk/hbase-server>
&& /home/jenkins/tools/java/jdk1.6.0_27-32/jre/bin/java -enableassertions -Xmx1900m
-Djava.security.egd=file:/dev/./urandom -jar <https://builds.apache.org/job/HBase-TRUNK/ws/trunk/hbase-server/target/surefire/surefirebooter370874030756932962.jar>
<https://builds.apache.org/job/HBase-TRUNK/ws/trunk/hbase-server/target/surefire/surefire6007248456966081270tmp>
<https://builds.apache.org/job/HBase-TRUNK/ws/trunk/hbase-server/target/surefire/surefire_1492851794587228387228tmp>
Running org.apache.hadoop.hbase.io.encoding.TestLoadAndSwitchEncodeOnDisk
Tests run: 1, Failures: 0, Errors: 0, Skipped: 0, Time elapsed: 29.415 sec
Forking command line: /bin/sh -c cd <https://builds.apache.org/job/HBase-TRUNK/ws/trunk/hbase-server>
&& /home/jenkins/tools/java/jdk1.6.0_27-32/jre/bin/java -enableassertions -Xmx1900m
-Djava.security.egd=file:/dev/./urandom -jar <https://builds.apache.org/job/HBase-TRUNK/ws/trunk/hbase-server/target/surefire/surefirebooter4712793036289032521.jar>
<https://builds.apache.org/job/HBase-TRUNK/ws/trunk/hbase-server/target/surefire/surefire5661382607800092495tmp>
<https://builds.apache.org/job/HBase-TRUNK/ws/trunk/hbase-server/target/surefire/surefire_1507784069323620205278tmp>
Running org.apache.hadoop.hbase.thrift.TestThriftServer
Running org.apache.hadoop.hbase.io.encoding.TestEncodedSeekers
Tests run: 8, Failures: 0, Errors: 0, Skipped: 0, Time elapsed: 31.357 sec
Tests run: 1, Failures: 0, Errors: 0, Skipped: 0, Time elapsed: 63.794 sec
Forking command line: /bin/sh -c cd <https://builds.apache.org/job/HBase-TRUNK/ws/trunk/hbase-server>
&& /home/jenkins/tools/java/jdk1.6.0_27-32/jre/bin/java -enableassertions -Xmx1900m
-Djava.security.egd=file:/dev/./urandom -jar <https://builds.apache.org/job/HBase-TRUNK/ws/trunk/hbase-server/target/surefire/surefirebooter2630611279985423021.jar>
<https://builds.apache.org/job/HBase-TRUNK/ws/trunk/hbase-server/target/surefire/surefire8280465770462258290tmp>
<https://builds.apache.org/job/HBase-TRUNK/ws/trunk/hbase-server/target/surefire/surefire_1517547464120774220139tmp>
Forking command line: /bin/sh -c cd <https://builds.apache.org/job/HBase-TRUNK/ws/trunk/hbase-server>
&& /home/jenkins/tools/java/jdk1.6.0_27-32/jre/bin/java -enableassertions -Xmx1900m
-Djava.security.egd=file:/dev/./urandom -jar <https://builds.apache.org/job/HBase-TRUNK/ws/trunk/hbase-server/target/surefire/surefirebooter7504556824667267589.jar>
<https://builds.apache.org/job/HBase-TRUNK/ws/trunk/hbase-server/target/surefire/surefire5173478355305274467tmp>
<https://builds.apache.org/job/HBase-TRUNK/ws/trunk/hbase-server/target/surefire/surefire_1524738064178316042452tmp>
Running org.apache.hadoop.hbase.io.encoding.TestBufferedDataBlockEncoder
Tests run: 1, Failures: 0, Errors: 0, Skipped: 0, Time elapsed: 22.498 sec
Forking command line: /bin/sh -c cd <https://builds.apache.org/job/HBase-TRUNK/ws/trunk/hbase-server>
&& /home/jenkins/tools/java/jdk1.6.0_27-32/jre/bin/java -enableassertions -Xmx1900m
-Djava.security.egd=file:/dev/./urandom -jar <https://builds.apache.org/job/HBase-TRUNK/ws/trunk/hbase-server/target/surefire/surefirebooter3602705795695375776.jar>
<https://builds.apache.org/job/HBase-TRUNK/ws/trunk/hbase-server/target/surefire/surefire607717149200220237tmp>
<https://builds.apache.org/job/HBase-TRUNK/ws/trunk/hbase-server/target/surefire/surefire_1533927023392225544500tmp>
Running org.apache.hadoop.hbase.io.encoding.TestUpgradeFromHFileV1ToEncoding
Tests run: 1, Failures: 0, Errors: 0, Skipped: 0, Time elapsed: 86.346 sec
Forking command line: /bin/sh -c cd <https://builds.apache.org/job/HBase-TRUNK/ws/trunk/hbase-server>
&& /home/jenkins/tools/java/jdk1.6.0_27-32/jre/bin/java -enableassertions -Xmx1900m
-Djava.security.egd=file:/dev/./urandom -jar <https://builds.apache.org/job/HBase-TRUNK/ws/trunk/hbase-server/target/surefire/surefirebooter5872278434508706215.jar>
<https://builds.apache.org/job/HBase-TRUNK/ws/trunk/hbase-server/target/surefire/surefire5493645247362252119tmp>
<https://builds.apache.org/job/HBase-TRUNK/ws/trunk/hbase-server/target/surefire/surefire_1547508226441587393562tmp>
Running org.apache.hadoop.hbase.io.encoding.TestDataBlockEncoders
Tests run: 12, Failures: 0, Errors: 0, Skipped: 0, Time elapsed: 112.617 sec
Forking command line: /bin/sh -c cd <https://builds.apache.org/job/HBase-TRUNK/ws/trunk/hbase-server>
&& /home/jenkins/tools/java/jdk1.6.0_27-32/jre/bin/java -enableassertions -Xmx1900m
-Djava.security.egd=file:/dev/./urandom -jar <https://builds.apache.org/job/HBase-TRUNK/ws/trunk/hbase-server/target/surefire/surefirebooter1187746537186428360.jar>
<https://builds.apache.org/job/HBase-TRUNK/ws/trunk/hbase-server/target/surefire/surefire2389856472347863481tmp>
<https://builds.apache.org/job/HBase-TRUNK/ws/trunk/hbase-server/target/surefire/surefire_1556803384308511055058tmp>
Running org.apache.hadoop.hbase.io.hfile.TestHFileSeek
Tests run: 1, Failures: 0, Errors: 0, Skipped: 0, Time elapsed: 9.56 sec
Forking command line: /bin/sh -c cd <https://builds.apache.org/job/HBase-TRUNK/ws/trunk/hbase-server>
&& /home/jenkins/tools/java/jdk1.6.0_27-32/jre/bin/java -enableassertions -Xmx1900m
-Djava.security.egd=file:/dev/./urandom -jar <https://builds.apache.org/job/HBase-TRUNK/ws/trunk/hbase-server/target/surefire/surefirebooter5554476303751998831.jar>
<https://builds.apache.org/job/HBase-TRUNK/ws/trunk/hbase-server/target/surefire/surefire352917469887509032tmp>
<https://builds.apache.org/job/HBase-TRUNK/ws/trunk/hbase-server/target/surefire/surefire_1568461599551644584999tmp>
Running org.apache.hadoop.hbase.io.hfile.slab.TestSlabCache
Tests run: 7, Failures: 0, Errors: 0, Skipped: 0, Time elapsed: 18.324 sec
Forking command line: /bin/sh -c cd <https://builds.apache.org/job/HBase-TRUNK/ws/trunk/hbase-server>
&& /home/jenkins/tools/java/jdk1.6.0_27-32/jre/bin/java -enableassertions -Xmx1900m
-Djava.security.egd=file:/dev/./urandom -jar <https://builds.apache.org/job/HBase-TRUNK/ws/trunk/hbase-server/target/surefire/surefirebooter1126278366733900145.jar>
<https://builds.apache.org/job/HBase-TRUNK/ws/trunk/hbase-server/target/surefire/surefire5143079081913922725tmp>
<https://builds.apache.org/job/HBase-TRUNK/ws/trunk/hbase-server/target/surefire/surefire_1574686663687016242434tmp>
Running org.apache.hadoop.hbase.io.hfile.TestHFileBlockIndex
Tests run: 10, Failures: 0, Errors: 0, Skipped: 0, Time elapsed: 10.262 sec
Forking command line: /bin/sh -c cd <https://builds.apache.org/job/HBase-TRUNK/ws/trunk/hbase-server>
&& /home/jenkins/tools/java/jdk1.6.0_27-32/jre/bin/java -enableassertions -Xmx1900m
-Djava.security.egd=file:/dev/./urandom -jar <https://builds.apache.org/job/HBase-TRUNK/ws/trunk/hbase-server/target/surefire/surefirebooter2419463059151422048.jar>
<https://builds.apache.org/job/HBase-TRUNK/ws/trunk/hbase-server/target/surefire/surefire7340026714673367686tmp>
<https://builds.apache.org/job/HBase-TRUNK/ws/trunk/hbase-server/target/surefire/surefire_1585155610764624980043tmp>
Running org.apache.hadoop.hbase.io.hfile.slab.TestSingleSizeCache
Tests run: 5, Failures: 0, Errors: 0, Skipped: 0, Time elapsed: 29.135 sec
Forking command line: /bin/sh -c cd <https://builds.apache.org/job/HBase-TRUNK/ws/trunk/hbase-server>
&& /home/jenkins/tools/java/jdk1.6.0_27-32/jre/bin/java -enableassertions -Xmx1900m
-Djava.security.egd=file:/dev/./urandom -jar <https://builds.apache.org/job/HBase-TRUNK/ws/trunk/hbase-server/target/surefire/surefirebooter1652888384915909514.jar>
<https://builds.apache.org/job/HBase-TRUNK/ws/trunk/hbase-server/target/surefire/surefire2096885934660462543tmp>
<https://builds.apache.org/job/HBase-TRUNK/ws/trunk/hbase-server/target/surefire/surefire_1591638151768223727433tmp>
Running org.apache.hadoop.hbase.io.hfile.TestHFilePerformance
Tests run: 1, Failures: 0, Errors: 0, Skipped: 0, Time elapsed: 6.91 sec
Forking command line: /bin/sh -c cd <https://builds.apache.org/job/HBase-TRUNK/ws/trunk/hbase-server>
&& /home/jenkins/tools/java/jdk1.6.0_27-32/jre/bin/java -enableassertions -Xmx1900m
-Djava.security.egd=file:/dev/./urandom -jar <https://builds.apache.org/job/HBase-TRUNK/ws/trunk/hbase-server/target/surefire/surefirebooter4973121853486686763.jar>
<https://builds.apache.org/job/HBase-TRUNK/ws/trunk/hbase-server/target/surefire/surefire1262847608644306275tmp>
<https://builds.apache.org/job/HBase-TRUNK/ws/trunk/hbase-server/target/surefire/surefire_1601942749998602861236tmp>
Running org.apache.hadoop.hbase.io.hfile.TestForceCacheImportantBlocks
Tests run: 4, Failures: 0, Errors: 3, Skipped: 0, Time elapsed: 29.99 sec <<< FAILURE!
Forking command line: /bin/sh -c cd <https://builds.apache.org/job/HBase-TRUNK/ws/trunk/hbase-server>
&& /home/jenkins/tools/java/jdk1.6.0_27-32/jre/bin/java -enableassertions -Xmx1900m
-Djava.security.egd=file:/dev/./urandom -jar <https://builds.apache.org/job/HBase-TRUNK/ws/trunk/hbase-server/target/surefire/surefirebooter6595326391305343663.jar>
<https://builds.apache.org/job/HBase-TRUNK/ws/trunk/hbase-server/target/surefire/surefire5521924360996906508tmp>
<https://builds.apache.org/job/HBase-TRUNK/ws/trunk/hbase-server/target/surefire/surefire_1616627720175667229834tmp>
Running org.apache.hadoop.hbase.io.hfile.TestScannerSelectionUsingTTL
Tests run: 6, Failures: 0, Errors: 0, Skipped: 0, Time elapsed: 61.217 sec
Forking command line: /bin/sh -c cd <https://builds.apache.org/job/HBase-TRUNK/ws/trunk/hbase-server>
&& /home/jenkins/tools/java/jdk1.6.0_27-32/jre/bin/java -enableassertions -Xmx1900m
-Djava.security.egd=file:/dev/./urandom -jar <https://builds.apache.org/job/HBase-TRUNK/ws/trunk/hbase-server/target/surefire/surefirebooter3990226122092115064.jar>
<https://builds.apache.org/job/HBase-TRUNK/ws/trunk/hbase-server/target/surefire/surefire6695097883976131516tmp>
<https://builds.apache.org/job/HBase-TRUNK/ws/trunk/hbase-server/target/surefire/surefire_1626667857876574428836tmp>
Running org.apache.hadoop.hbase.io.hfile.TestHFileBlock
Tests run: 16, Failures: 0, Errors: 0, Skipped: 0, Time elapsed: 48.388 sec
Forking command line: /bin/sh -c cd <https://builds.apache.org/job/HBase-TRUNK/ws/trunk/hbase-server>
&& /home/jenkins/tools/java/jdk1.6.0_27-32/jre/bin/java -enableassertions -Xmx1900m
-Djava.security.egd=file:/dev/./urandom -jar <https://builds.apache.org/job/HBase-TRUNK/ws/trunk/hbase-server/target/surefire/surefirebooter4826811750063256457.jar>
<https://builds.apache.org/job/HBase-TRUNK/ws/trunk/hbase-server/target/surefire/surefire7842750243443567370tmp>
<https://builds.apache.org/job/HBase-TRUNK/ws/trunk/hbase-server/target/surefire/surefire_1637740545507481077123tmp>
Running org.apache.hadoop.hbase.io.encoding.TestChangingEncoding
Tests run: 4, Failures: 0, Errors: 0, Skipped: 0, Time elapsed: 258.566 sec
Forking command line: /bin/sh -c cd <https://builds.apache.org/job/HBase-TRUNK/ws/trunk/hbase-server>
&& /home/jenkins/tools/java/jdk1.6.0_27-32/jre/bin/java -enableassertions -Xmx1900m
-Djava.security.egd=file:/dev/./urandom -jar <https://builds.apache.org/job/HBase-TRUNK/ws/trunk/hbase-server/target/surefire/surefirebooter7185485378485606418.jar>
<https://builds.apache.org/job/HBase-TRUNK/ws/trunk/hbase-server/target/surefire/surefire1723227274390952159tmp>
<https://builds.apache.org/job/HBase-TRUNK/ws/trunk/hbase-server/target/surefire/surefire_1645530106536544968624tmp>
Running org.apache.hadoop.hbase.io.hfile.TestCacheOnWrite
Tests run: 36, Failures: 0, Errors: 0, Skipped: 0, Time elapsed: 41.309 sec
Forking command line: /bin/sh -c cd <https://builds.apache.org/job/HBase-TRUNK/ws/trunk/hbase-server>
&& /home/jenkins/tools/java/jdk1.6.0_27-32/jre/bin/java -enableassertions -Xmx1900m
-Djava.security.egd=file:/dev/./urandom -jar <https://builds.apache.org/job/HBase-TRUNK/ws/trunk/hbase-server/target/surefire/surefirebooter1719432894486390379.jar>
<https://builds.apache.org/job/HBase-TRUNK/ws/trunk/hbase-server/target/surefire/surefire5749074449914744529tmp>
<https://builds.apache.org/job/HBase-TRUNK/ws/trunk/hbase-server/target/surefire/surefire_1654358279619551497029tmp>
Running org.apache.hadoop.hbase.TestClusterBootOrder
Tests run: 2, Failures: 0, Errors: 0, Skipped: 0, Time elapsed: 27.666 sec
Forking command line: /bin/sh -c cd <https://builds.apache.org/job/HBase-TRUNK/ws/trunk/hbase-server>
&& /home/jenkins/tools/java/jdk1.6.0_27-32/jre/bin/java -enableassertions -Xmx1900m
-Djava.security.egd=file:/dev/./urandom -jar <https://builds.apache.org/job/HBase-TRUNK/ws/trunk/hbase-server/target/surefire/surefirebooter4058967733629702102.jar>
<https://builds.apache.org/job/HBase-TRUNK/ws/trunk/hbase-server/target/surefire/surefire3706913322347383720tmp>
<https://builds.apache.org/job/HBase-TRUNK/ws/trunk/hbase-server/target/surefire/surefire_1663180420328729052982tmp>
Running org.apache.hadoop.hbase.replication.regionserver.TestReplicationSourceManager
Tests run: 1, Failures: 0, Errors: 0, Skipped: 0, Time elapsed: 0.998 sec
Forking command line: /bin/sh -c cd <https://builds.apache.org/job/HBase-TRUNK/ws/trunk/hbase-server>
&& /home/jenkins/tools/java/jdk1.6.0_27-32/jre/bin/java -enableassertions -Xmx1900m
-Djava.security.egd=file:/dev/./urandom -jar <https://builds.apache.org/job/HBase-TRUNK/ws/trunk/hbase-server/target/surefire/surefirebooter8140767197422818442.jar>
<https://builds.apache.org/job/HBase-TRUNK/ws/trunk/hbase-server/target/surefire/surefire6157685367740550791tmp>
<https://builds.apache.org/job/HBase-TRUNK/ws/trunk/hbase-server/target/surefire/surefire_1673364554149794015173tmp>
Running org.apache.hadoop.hbase.avro.TestAvroServer
Tests run: 3, Failures: 0, Errors: 0, Skipped: 0, Time elapsed: 29.029 sec
Forking command line: /bin/sh -c cd <https://builds.apache.org/job/HBase-TRUNK/ws/trunk/hbase-server>
&& /home/jenkins/tools/java/jdk1.6.0_27-32/jre/bin/java -enableassertions -Xmx1900m
-Djava.security.egd=file:/dev/./urandom -jar <https://builds.apache.org/job/HBase-TRUNK/ws/trunk/hbase-server/target/surefire/surefirebooter560292176543148670.jar>
<https://builds.apache.org/job/HBase-TRUNK/ws/trunk/hbase-server/target/surefire/surefire2869401321739584254tmp>
<https://builds.apache.org/job/HBase-TRUNK/ws/trunk/hbase-server/target/surefire/surefire_1686946626325053727760tmp>
Running org.apache.hadoop.hbase.replication.regionserver.TestReplicationSink
Tests run: 5, Failures: 0, Errors: 0, Skipped: 0, Time elapsed: 31.237 sec
Forking command line: /bin/sh -c cd <https://builds.apache.org/job/HBase-TRUNK/ws/trunk/hbase-server>
&& /home/jenkins/tools/java/jdk1.6.0_27-32/jre/bin/java -enableassertions -Xmx1900m
-Djava.security.egd=file:/dev/./urandom -jar <https://builds.apache.org/job/HBase-TRUNK/ws/trunk/hbase-server/target/surefire/surefirebooter2228899212731352660.jar>
<https://builds.apache.org/job/HBase-TRUNK/ws/trunk/hbase-server/target/surefire/surefire4309842660862848469tmp>
<https://builds.apache.org/job/HBase-TRUNK/ws/trunk/hbase-server/target/surefire/surefire_1696626480521076894041tmp>
Running org.apache.hadoop.hbase.replication.TestReplicationSource
Tests run: 1, Failures: 0, Errors: 0, Skipped: 0, Time elapsed: 2.246 sec
Forking command line: /bin/sh -c cd <https://builds.apache.org/job/HBase-TRUNK/ws/trunk/hbase-server>
&& /home/jenkins/tools/java/jdk1.6.0_27-32/jre/bin/java -enableassertions -Xmx1900m
-Djava.security.egd=file:/dev/./urandom -jar <https://builds.apache.org/job/HBase-TRUNK/ws/trunk/hbase-server/target/surefire/surefirebooter3261492450224567206.jar>
<https://builds.apache.org/job/HBase-TRUNK/ws/trunk/hbase-server/target/surefire/surefire843999735643226559tmp>
<https://builds.apache.org/job/HBase-TRUNK/ws/trunk/hbase-server/target/surefire/surefire_1708666551373908147629tmp>
Running org.apache.hadoop.hbase.replication.TestReplicationPeer
Tests run: 1, Failures: 0, Errors: 0, Skipped: 0, Time elapsed: 0.912 sec
Forking command line: /bin/sh -c cd <https://builds.apache.org/job/HBase-TRUNK/ws/trunk/hbase-server>
&& /home/jenkins/tools/java/jdk1.6.0_27-32/jre/bin/java -enableassertions -Xmx1900m
-Djava.security.egd=file:/dev/./urandom -jar <https://builds.apache.org/job/HBase-TRUNK/ws/trunk/hbase-server/target/surefire/surefirebooter5652498151175689413.jar>
<https://builds.apache.org/job/HBase-TRUNK/ws/trunk/hbase-server/target/surefire/surefire1740658335331710878tmp>
<https://builds.apache.org/job/HBase-TRUNK/ws/trunk/hbase-server/target/surefire/surefire_1714467393479152822188tmp>
Running org.apache.hadoop.hbase.replication.TestReplicationZookeeper
Tests run: 1, Failures: 0, Errors: 0, Skipped: 0, Time elapsed: 0.581 sec
Forking command line: /bin/sh -c cd <https://builds.apache.org/job/HBase-TRUNK/ws/trunk/hbase-server>
&& /home/jenkins/tools/java/jdk1.6.0_27-32/jre/bin/java -enableassertions -Xmx1900m
-Djava.security.egd=file:/dev/./urandom -jar <https://builds.apache.org/job/HBase-TRUNK/ws/trunk/hbase-server/target/surefire/surefirebooter4691793885216272290.jar>
<https://builds.apache.org/job/HBase-TRUNK/ws/trunk/hbase-server/target/surefire/surefire1287183187607708770tmp>
<https://builds.apache.org/job/HBase-TRUNK/ws/trunk/hbase-server/target/surefire/surefire_1726874594381111426087tmp>
Running org.apache.hadoop.hbase.replication.TestMultiSlaveReplication
Tests run: 1, Failures: 0, Errors: 0, Skipped: 0, Time elapsed: 69.602 sec
Forking command line: /bin/sh -c cd <https://builds.apache.org/job/HBase-TRUNK/ws/trunk/hbase-server>
&& /home/jenkins/tools/java/jdk1.6.0_27-32/jre/bin/java -enableassertions -Xmx1900m
-Djava.security.egd=file:/dev/./urandom -jar <https://builds.apache.org/job/HBase-TRUNK/ws/trunk/hbase-server/target/surefire/surefirebooter3305189620504427937.jar>
<https://builds.apache.org/job/HBase-TRUNK/ws/trunk/hbase-server/target/surefire/surefire7091196427439463613tmp>
<https://builds.apache.org/job/HBase-TRUNK/ws/trunk/hbase-server/target/surefire/surefire_1738503371355472273857tmp>
Running org.apache.hadoop.hbase.ipc.TestDelayedRpc
Tests run: 4, Failures: 0, Errors: 0, Skipped: 0, Time elapsed: 2.345 sec
Forking command line: /bin/sh -c cd <https://builds.apache.org/job/HBase-TRUNK/ws/trunk/hbase-server>
&& /home/jenkins/tools/java/jdk1.6.0_27-32/jre/bin/java -enableassertions -Xmx1900m
-Djava.security.egd=file:/dev/./urandom -jar <https://builds.apache.org/job/HBase-TRUNK/ws/trunk/hbase-server/target/surefire/surefirebooter9169282647237984711.jar>
<https://builds.apache.org/job/HBase-TRUNK/ws/trunk/hbase-server/target/surefire/surefire4035335588177620203tmp>
<https://builds.apache.org/job/HBase-TRUNK/ws/trunk/hbase-server/target/surefire/surefire_1741557203116233260503tmp>
Running org.apache.hadoop.hbase.replication.TestMasterReplication
Tests run: 2, Failures: 0, Errors: 0, Skipped: 0, Time elapsed: 65.231 sec
Forking command line: /bin/sh -c cd <https://builds.apache.org/job/HBase-TRUNK/ws/trunk/hbase-server>
&& /home/jenkins/tools/java/jdk1.6.0_27-32/jre/bin/java -enableassertions -Xmx1900m
-Djava.security.egd=file:/dev/./urandom -jar <https://builds.apache.org/job/HBase-TRUNK/ws/trunk/hbase-server/target/surefire/surefirebooter7976670645361414566.jar>
<https://builds.apache.org/job/HBase-TRUNK/ws/trunk/hbase-server/target/surefire/surefire1023971000953070275tmp>
<https://builds.apache.org/job/HBase-TRUNK/ws/trunk/hbase-server/target/surefire/surefire_1756115574852975220667tmp>
Running org.apache.hadoop.hbase.TestZooKeeper
Tests run: 9, Failures: 0, Errors: 0, Skipped: 0, Time elapsed: 26.737 sec
Running org.apache.hadoop.hbase.TestHBaseTestingUtility
Tests run: 7, Failures: 0, Errors: 0, Skipped: 0, Time elapsed: 63.63 sec
Running org.apache.hadoop.hbase.thrift.TestThriftServerCmdLine
Tests run: 20, Failures: 0, Errors: 0, Skipped: 0, Time elapsed: 474.484 sec
Running org.apache.hadoop.hbase.replication.TestReplication
Tests run: 10, Failures: 0, Errors: 0, Skipped: 0, Time elapsed: 145.471 sec

Results :

Tests in error: 
  testCacheBlocks[1](org.apache.hadoop.hbase.io.hfile.TestForceCacheImportantBlocks)
  testCacheBlocks[2](org.apache.hadoop.hbase.io.hfile.TestForceCacheImportantBlocks): unable
to create new native thread
  testCacheBlocks[3](org.apache.hadoop.hbase.io.hfile.TestForceCacheImportantBlocks): unable
to create new native thread

Tests run: 997, Failures: 0, Errors: 3, Skipped: 9

[INFO] ------------------------------------------------------------------------
[INFO] Reactor Summary:
[INFO] 
[INFO] HBase ............................................. SUCCESS [2.136s]
[INFO] HBase - Server .................................... FAILURE [35:49.775s]
[INFO] HBase - Assembly .................................. SKIPPED
[INFO] HBase - Site ...................................... SKIPPED
[INFO] ------------------------------------------------------------------------
[INFO] BUILD FAILURE
[INFO] ------------------------------------------------------------------------
[INFO] Total time: 35:52.255s
[INFO] Finished at: Sun May 27 22:25:33 UTC 2012
[INFO] Final Memory: 39M/536M
[INFO] ------------------------------------------------------------------------
[ERROR] Failed to execute goal org.apache.maven.plugins:maven-surefire-plugin:2.12-TRUNK-HBASE-2:test
(secondPartTestsExecution) on project hbase-server: There are test failures.
[ERROR] 
[ERROR] Please refer to <https://builds.apache.org/job/HBase-TRUNK/ws/trunk/hbase-server/target/surefire-reports>
for the individual test results.
[ERROR] -> [Help 1]
org.apache.maven.lifecycle.LifecycleExecutionException: Failed to execute goal org.apache.maven.plugins:maven-surefire-plugin:2.12-TRUNK-HBASE-2:test
(secondPartTestsExecution) on project hbase-server: There are test failures.

Please refer to <https://builds.apache.org/job/HBase-TRUNK/ws/trunk/hbase-server/target/surefire-reports>
for the individual test results.
	at org.apache.maven.lifecycle.internal.MojoExecutor.execute(MojoExecutor.java:213)
	at org.apache.maven.lifecycle.internal.MojoExecutor.execute(MojoExecutor.java:153)
	at org.apache.maven.lifecycle.internal.MojoExecutor.execute(MojoExecutor.java:145)
	at org.apache.maven.lifecycle.internal.LifecycleModuleBuilder.buildProject(LifecycleModuleBuilder.java:84)
	at org.apache.maven.lifecycle.internal.LifecycleModuleBuilder.buildProject(LifecycleModuleBuilder.java:59)
	at org.apache.maven.lifecycle.internal.LifecycleStarter.singleThreadedBuild(LifecycleStarter.java:183)
	at org.apache.maven.lifecycle.internal.LifecycleStarter.execute(LifecycleStarter.java:161)
	at org.apache.maven.DefaultMaven.doExecute(DefaultMaven.java:319)
	at org.apache.maven.DefaultMaven.execute(DefaultMaven.java:156)
	at org.apache.maven.cli.MavenCli.execute(MavenCli.java:537)
	at org.apache.maven.cli.MavenCli.doMain(MavenCli.java:196)
	at org.apache.maven.cli.MavenCli.main(MavenCli.java:141)
	at sun.reflect.NativeMethodAccessorImpl.invoke0(Native Method)
	at sun.reflect.NativeMethodAccessorImpl.invoke(NativeMethodAccessorImpl.java:39)
	at sun.reflect.DelegatingMethodAccessorImpl.invoke(DelegatingMethodAccessorImpl.java:25)
	at java.lang.reflect.Method.invoke(Method.java:597)
	at org.codehaus.plexus.classworlds.launcher.Launcher.launchEnhanced(Launcher.java:290)
	at org.codehaus.plexus.classworlds.launcher.Launcher.launch(Launcher.java:230)
	at org.codehaus.plexus.classworlds.launcher.Launcher.mainWithExitCode(Launcher.java:409)
	at org.codehaus.plexus.classworlds.launcher.Launcher.main(Launcher.java:352)
Caused by: org.apache.maven.plugin.MojoFailureException: There are test failures.

Please refer to <https://builds.apache.org/job/HBase-TRUNK/ws/trunk/hbase-server/target/surefire-reports>
for the individual test results.
	at org.apache.maven.plugin.surefire.SurefireHelper.reportExecution(SurefireHelper.java:87)
	at org.apache.maven.plugin.surefire.SurefirePlugin.writeSummary(SurefirePlugin.java:651)
	at org.apache.maven.plugin.surefire.SurefirePlugin.handleSummary(SurefirePlugin.java:625)
	at org.apache.maven.plugin.surefire.AbstractSurefireMojo.executeAfterPreconditionsChecked(AbstractSurefireMojo.java:137)
	at org.apache.maven.plugin.surefire.AbstractSurefireMojo.execute(AbstractSurefireMojo.java:98)
	at org.apache.maven.plugin.DefaultBuildPluginManager.executeMojo(DefaultBuildPluginManager.java:101)
	at org.apache.maven.lifecycle.internal.MojoExecutor.execute(MojoExecutor.java:209)
	... 19 more
[ERROR] 
[ERROR] 
[ERROR] For more information about the errors and possible solutions, please read the following
articles:
[ERROR] [Help 1] http://cwiki.apache.org/confluence/display/MAVEN/MojoFailureException
[ERROR] 
[ERROR] After correcting the problems, you can resume the build with the command
[ERROR]   mvn <goals> -rf :hbase-server
Build step 'Invoke top-level Maven targets' marked build as failure
Archiving artifacts
Recording test results
Updating HBASE-6110

Mime
View raw message