hbase-dev mailing list archives

Site index · List index
Message view « Date » · « Thread »
Top « Date » · « Thread »
From Apache Jenkins Server <jenk...@builds.apache.org>
Subject Build failed in Jenkins: HBase-TRUNK #2944
Date Tue, 29 May 2012 19:19:56 GMT
See <https://builds.apache.org/job/HBase-TRUNK/2944/changes>

Changes:

[stack] HBASE-6108 Use HRegion.closeHRegion instead of HRegion.close() and HRegion.getLog().close()

------------------------------------------
[...truncated 5880 lines...]
Forking command line: /bin/sh -c cd <https://builds.apache.org/job/HBase-TRUNK/ws/trunk/hbase-server>
&& /home/hudson/tools/java/jdk1.6.0_27-32/jre/bin/java -enableassertions -Xmx1900m
-Djava.security.egd=file:/dev/./urandom -jar <https://builds.apache.org/job/HBase-TRUNK/ws/trunk/hbase-server/target/surefire/surefirebooter7259393368209750239.jar>
<https://builds.apache.org/job/HBase-TRUNK/ws/trunk/hbase-server/target/surefire/surefire9173006007642054417tmp>
<https://builds.apache.org/job/HBase-TRUNK/ws/trunk/hbase-server/target/surefire/surefire_120410354838115081898tmp>
Running org.apache.hadoop.hbase.regionserver.TestMXBean
Tests run: 1, Failures: 0, Errors: 0, Skipped: 0, Time elapsed: 14.135 sec
Forking command line: /bin/sh -c cd <https://builds.apache.org/job/HBase-TRUNK/ws/trunk/hbase-server>
&& /home/hudson/tools/java/jdk1.6.0_27-32/jre/bin/java -enableassertions -Xmx1900m
-Djava.security.egd=file:/dev/./urandom -jar <https://builds.apache.org/job/HBase-TRUNK/ws/trunk/hbase-server/target/surefire/surefirebooter8124957017249706373.jar>
<https://builds.apache.org/job/HBase-TRUNK/ws/trunk/hbase-server/target/surefire/surefire6795472509383651607tmp>
<https://builds.apache.org/job/HBase-TRUNK/ws/trunk/hbase-server/target/surefire/surefire_1218065318248941614926tmp>
Running org.apache.hadoop.hbase.regionserver.metrics.TestSchemaMetrics
Tests run: 6, Failures: 0, Errors: 0, Skipped: 0, Time elapsed: 15.11 sec
Forking command line: /bin/sh -c cd <https://builds.apache.org/job/HBase-TRUNK/ws/trunk/hbase-server>
&& /home/hudson/tools/java/jdk1.6.0_27-32/jre/bin/java -enableassertions -Xmx1900m
-Djava.security.egd=file:/dev/./urandom -jar <https://builds.apache.org/job/HBase-TRUNK/ws/trunk/hbase-server/target/surefire/surefirebooter349534399163925930.jar>
<https://builds.apache.org/job/HBase-TRUNK/ws/trunk/hbase-server/target/surefire/surefire8706793912975393710tmp>
<https://builds.apache.org/job/HBase-TRUNK/ws/trunk/hbase-server/target/surefire/surefire_1224044815718877478926tmp>
Running org.apache.hadoop.hbase.regionserver.TestRpcMetrics
Tests run: 1, Failures: 0, Errors: 0, Skipped: 0, Time elapsed: 2.072 sec
Forking command line: /bin/sh -c cd <https://builds.apache.org/job/HBase-TRUNK/ws/trunk/hbase-server>
&& /home/hudson/tools/java/jdk1.6.0_27-32/jre/bin/java -enableassertions -Xmx1900m
-Djava.security.egd=file:/dev/./urandom -jar <https://builds.apache.org/job/HBase-TRUNK/ws/trunk/hbase-server/target/surefire/surefirebooter1858291830399194889.jar>
<https://builds.apache.org/job/HBase-TRUNK/ws/trunk/hbase-server/target/surefire/surefire3822191819682738263tmp>
<https://builds.apache.org/job/HBase-TRUNK/ws/trunk/hbase-server/target/surefire/surefire_1232604129540970786753tmp>
Running org.apache.hadoop.hbase.regionserver.TestGetClosestAtOrBefore
Tests run: 3, Failures: 0, Errors: 0, Skipped: 0, Time elapsed: 0.992 sec
Forking command line: /bin/sh -c cd <https://builds.apache.org/job/HBase-TRUNK/ws/trunk/hbase-server>
&& /home/hudson/tools/java/jdk1.6.0_27-32/jre/bin/java -enableassertions -Xmx1900m
-Djava.security.egd=file:/dev/./urandom -jar <https://builds.apache.org/job/HBase-TRUNK/ws/trunk/hbase-server/target/surefire/surefirebooter4491473154413446764.jar>
<https://builds.apache.org/job/HBase-TRUNK/ws/trunk/hbase-server/target/surefire/surefire4584238670056403211tmp>
<https://builds.apache.org/job/HBase-TRUNK/ws/trunk/hbase-server/target/surefire/surefire_124248395876285746942tmp>
Running org.apache.hadoop.hbase.regionserver.TestStoreScanner
Tests run: 16, Failures: 0, Errors: 0, Skipped: 0, Time elapsed: 0.063 sec
Forking command line: /bin/sh -c cd <https://builds.apache.org/job/HBase-TRUNK/ws/trunk/hbase-server>
&& /home/hudson/tools/java/jdk1.6.0_27-32/jre/bin/java -enableassertions -Xmx1900m
-Djava.security.egd=file:/dev/./urandom -jar <https://builds.apache.org/job/HBase-TRUNK/ws/trunk/hbase-server/target/surefire/surefirebooter8405257023303330572.jar>
<https://builds.apache.org/job/HBase-TRUNK/ws/trunk/hbase-server/target/surefire/surefire7059075728596246268tmp>
<https://builds.apache.org/job/HBase-TRUNK/ws/trunk/hbase-server/target/surefire/surefire_1256697615251805121268tmp>
Running org.apache.hadoop.hbase.regionserver.TestSeekOptimizations
Tests run: 6, Failures: 0, Errors: 0, Skipped: 0, Time elapsed: 2.96 sec
Forking command line: /bin/sh -c cd <https://builds.apache.org/job/HBase-TRUNK/ws/trunk/hbase-server>
&& /home/hudson/tools/java/jdk1.6.0_27-32/jre/bin/java -enableassertions -Xmx1900m
-Djava.security.egd=file:/dev/./urandom -jar <https://builds.apache.org/job/HBase-TRUNK/ws/trunk/hbase-server/target/surefire/surefirebooter1822420517881922883.jar>
<https://builds.apache.org/job/HBase-TRUNK/ws/trunk/hbase-server/target/surefire/surefire402719069643044097tmp>
<https://builds.apache.org/job/HBase-TRUNK/ws/trunk/hbase-server/target/surefire/surefire_1261430881831372417534tmp>
Running org.apache.hadoop.hbase.regionserver.wal.TestLogRollAbort
Tests run: 1, Failures: 0, Errors: 0, Skipped: 0, Time elapsed: 164.175 sec
Forking command line: /bin/sh -c cd <https://builds.apache.org/job/HBase-TRUNK/ws/trunk/hbase-server>
&& /home/hudson/tools/java/jdk1.6.0_27-32/jre/bin/java -enableassertions -Xmx1900m
-Djava.security.egd=file:/dev/./urandom -jar <https://builds.apache.org/job/HBase-TRUNK/ws/trunk/hbase-server/target/surefire/surefirebooter4608727080200262081.jar>
<https://builds.apache.org/job/HBase-TRUNK/ws/trunk/hbase-server/target/surefire/surefire343832855503350586tmp>
<https://builds.apache.org/job/HBase-TRUNK/ws/trunk/hbase-server/target/surefire/surefire_1272419140087851869458tmp>
Running org.apache.hadoop.hbase.regionserver.TestFSErrorsExposed
Tests run: 3, Failures: 0, Errors: 0, Skipped: 0, Time elapsed: 54.882 sec
Forking command line: /bin/sh -c cd <https://builds.apache.org/job/HBase-TRUNK/ws/trunk/hbase-server>
&& /home/hudson/tools/java/jdk1.6.0_27-32/jre/bin/java -enableassertions -Xmx1900m
-Djava.security.egd=file:/dev/./urandom -jar <https://builds.apache.org/job/HBase-TRUNK/ws/trunk/hbase-server/target/surefire/surefirebooter2680235844397061277.jar>
<https://builds.apache.org/job/HBase-TRUNK/ws/trunk/hbase-server/target/surefire/surefire7831507830364389748tmp>
<https://builds.apache.org/job/HBase-TRUNK/ws/trunk/hbase-server/target/surefire/surefire_1285349228714585799852tmp>
Running org.apache.hadoop.hbase.regionserver.TestSplitLogWorker
Tests run: 5, Failures: 0, Errors: 0, Skipped: 0, Time elapsed: 3.09 sec
Forking command line: /bin/sh -c cd <https://builds.apache.org/job/HBase-TRUNK/ws/trunk/hbase-server>
&& /home/hudson/tools/java/jdk1.6.0_27-32/jre/bin/java -enableassertions -Xmx1900m
-Djava.security.egd=file:/dev/./urandom -jar <https://builds.apache.org/job/HBase-TRUNK/ws/trunk/hbase-server/target/surefire/surefirebooter1747110828645202453.jar>
<https://builds.apache.org/job/HBase-TRUNK/ws/trunk/hbase-server/target/surefire/surefire2868791318126754364tmp>
<https://builds.apache.org/job/HBase-TRUNK/ws/trunk/hbase-server/target/surefire/surefire_1296566450863907286104tmp>
Running org.apache.hadoop.hbase.regionserver.wal.TestLogRolling
Tests run: 2, Failures: 0, Errors: 0, Skipped: 0, Time elapsed: 262.144 sec
Forking command line: /bin/sh -c cd <https://builds.apache.org/job/HBase-TRUNK/ws/trunk/hbase-server>
&& /home/hudson/tools/java/jdk1.6.0_27-32/jre/bin/java -enableassertions -Xmx1900m
-Djava.security.egd=file:/dev/./urandom -jar <https://builds.apache.org/job/HBase-TRUNK/ws/trunk/hbase-server/target/surefire/surefirebooter3850627601482653235.jar>
<https://builds.apache.org/job/HBase-TRUNK/ws/trunk/hbase-server/target/surefire/surefire5850203483723052179tmp>
<https://builds.apache.org/job/HBase-TRUNK/ws/trunk/hbase-server/target/surefire/surefire_1305801422646129143504tmp>
Running org.apache.hadoop.hbase.regionserver.TestHRegionServerBulkLoad
Tests run: 1, Failures: 0, Errors: 0, Skipped: 0, Time elapsed: 57.358 sec
Forking command line: /bin/sh -c cd <https://builds.apache.org/job/HBase-TRUNK/ws/trunk/hbase-server>
&& /home/hudson/tools/java/jdk1.6.0_27-32/jre/bin/java -enableassertions -Xmx1900m
-Djava.security.egd=file:/dev/./urandom -jar <https://builds.apache.org/job/HBase-TRUNK/ws/trunk/hbase-server/target/surefire/surefirebooter410730364465405943.jar>
<https://builds.apache.org/job/HBase-TRUNK/ws/trunk/hbase-server/target/surefire/surefire8757011568787334284tmp>
<https://builds.apache.org/job/HBase-TRUNK/ws/trunk/hbase-server/target/surefire/surefire_1313078514638299707933tmp>
Running org.apache.hadoop.hbase.regionserver.TestMultiColumnScanner
Tests run: 12, Failures: 0, Errors: 0, Skipped: 0, Time elapsed: 43.378 sec
Forking command line: /bin/sh -c cd <https://builds.apache.org/job/HBase-TRUNK/ws/trunk/hbase-server>
&& /home/hudson/tools/java/jdk1.6.0_27-32/jre/bin/java -enableassertions -Xmx1900m
-Djava.security.egd=file:/dev/./urandom -jar <https://builds.apache.org/job/HBase-TRUNK/ws/trunk/hbase-server/target/surefire/surefirebooter4623528404110498203.jar>
<https://builds.apache.org/job/HBase-TRUNK/ws/trunk/hbase-server/target/surefire/surefire6538715090150955703tmp>
<https://builds.apache.org/job/HBase-TRUNK/ws/trunk/hbase-server/target/surefire/surefire_1327909945777300066485tmp>
Running org.apache.hadoop.hbase.regionserver.TestCompoundBloomFilter
Tests run: 3, Failures: 0, Errors: 0, Skipped: 0, Time elapsed: 25.749 sec
Forking command line: /bin/sh -c cd <https://builds.apache.org/job/HBase-TRUNK/ws/trunk/hbase-server>
&& /home/hudson/tools/java/jdk1.6.0_27-32/jre/bin/java -enableassertions -Xmx1900m
-Djava.security.egd=file:/dev/./urandom -jar <https://builds.apache.org/job/HBase-TRUNK/ws/trunk/hbase-server/target/surefire/surefirebooter2554580807374396230.jar>
<https://builds.apache.org/job/HBase-TRUNK/ws/trunk/hbase-server/target/surefire/surefire5657517110031249541tmp>
<https://builds.apache.org/job/HBase-TRUNK/ws/trunk/hbase-server/target/surefire/surefire_1338649570477937708610tmp>
Running org.apache.hadoop.hbase.regionserver.TestHRegion
Tests run: 62, Failures: 0, Errors: 0, Skipped: 0, Time elapsed: 47.518 sec
Forking command line: /bin/sh -c cd <https://builds.apache.org/job/HBase-TRUNK/ws/trunk/hbase-server>
&& /home/hudson/tools/java/jdk1.6.0_27-32/jre/bin/java -enableassertions -Xmx1900m
-Djava.security.egd=file:/dev/./urandom -jar <https://builds.apache.org/job/HBase-TRUNK/ws/trunk/hbase-server/target/surefire/surefirebooter88164743851697162.jar>
<https://builds.apache.org/job/HBase-TRUNK/ws/trunk/hbase-server/target/surefire/surefire9140471726316053625tmp>
<https://builds.apache.org/job/HBase-TRUNK/ws/trunk/hbase-server/target/surefire/surefire_1342225421006267070562tmp>
Running org.apache.hadoop.hbase.client.replication.TestReplicationAdmin
Tests run: 1, Failures: 0, Errors: 0, Skipped: 0, Time elapsed: 1.36 sec
Forking command line: /bin/sh -c cd <https://builds.apache.org/job/HBase-TRUNK/ws/trunk/hbase-server>
&& /home/hudson/tools/java/jdk1.6.0_27-32/jre/bin/java -enableassertions -Xmx1900m
-Djava.security.egd=file:/dev/./urandom -jar <https://builds.apache.org/job/HBase-TRUNK/ws/trunk/hbase-server/target/surefire/surefirebooter3174062247009269462.jar>
<https://builds.apache.org/job/HBase-TRUNK/ws/trunk/hbase-server/target/surefire/surefire1785017324520408050tmp>
<https://builds.apache.org/job/HBase-TRUNK/ws/trunk/hbase-server/target/surefire/surefire_1355584887351558754346tmp>
Running org.apache.hadoop.hbase.regionserver.TestCompactionState
Tests run: 2, Failures: 0, Errors: 0, Skipped: 0, Time elapsed: 50.023 sec
Forking command line: /bin/sh -c cd <https://builds.apache.org/job/HBase-TRUNK/ws/trunk/hbase-server>
&& /home/hudson/tools/java/jdk1.6.0_27-32/jre/bin/java -enableassertions -Xmx1900m
-Djava.security.egd=file:/dev/./urandom -jar <https://builds.apache.org/job/HBase-TRUNK/ws/trunk/hbase-server/target/surefire/surefirebooter1392707010181854991.jar>
<https://builds.apache.org/job/HBase-TRUNK/ws/trunk/hbase-server/target/surefire/surefire5677354360429964967tmp>
<https://builds.apache.org/job/HBase-TRUNK/ws/trunk/hbase-server/target/surefire/surefire_1364581628168558579045tmp>
Running org.apache.hadoop.hbase.regionserver.TestEndToEndSplitTransaction
Tests run: 2, Failures: 0, Errors: 0, Skipped: 0, Time elapsed: 76.14 sec
Forking command line: /bin/sh -c cd <https://builds.apache.org/job/HBase-TRUNK/ws/trunk/hbase-server>
&& /home/hudson/tools/java/jdk1.6.0_27-32/jre/bin/java -enableassertions -Xmx1900m
-Djava.security.egd=file:/dev/./urandom -jar <https://builds.apache.org/job/HBase-TRUNK/ws/trunk/hbase-server/target/surefire/surefirebooter2467444169812116216.jar>
<https://builds.apache.org/job/HBase-TRUNK/ws/trunk/hbase-server/target/surefire/surefire2320604341586283276tmp>
<https://builds.apache.org/job/HBase-TRUNK/ws/trunk/hbase-server/target/surefire/surefire_1378081377349453741060tmp>
Running org.apache.hadoop.hbase.client.TestTimestampsFilter
Tests run: 3, Failures: 0, Errors: 0, Skipped: 0, Time elapsed: 32.324 sec
Forking command line: /bin/sh -c cd <https://builds.apache.org/job/HBase-TRUNK/ws/trunk/hbase-server>
&& /home/hudson/tools/java/jdk1.6.0_27-32/jre/bin/java -enableassertions -Xmx1900m
-Djava.security.egd=file:/dev/./urandom -jar <https://builds.apache.org/job/HBase-TRUNK/ws/trunk/hbase-server/target/surefire/surefirebooter404352289010459609.jar>
<https://builds.apache.org/job/HBase-TRUNK/ws/trunk/hbase-server/target/surefire/surefire5208139190837298302tmp>
<https://builds.apache.org/job/HBase-TRUNK/ws/trunk/hbase-server/target/surefire/surefire_13840282705460364677tmp>
Running org.apache.hadoop.hbase.client.TestMultipleTimestamps
Tests run: 8, Failures: 0, Errors: 0, Skipped: 0, Time elapsed: 46.151 sec
Forking command line: /bin/sh -c cd <https://builds.apache.org/job/HBase-TRUNK/ws/trunk/hbase-server>
&& /home/hudson/tools/java/jdk1.6.0_27-32/jre/bin/java -enableassertions -Xmx1900m
-Djava.security.egd=file:/dev/./urandom -jar <https://builds.apache.org/job/HBase-TRUNK/ws/trunk/hbase-server/target/surefire/surefirebooter4782819107898404649.jar>
<https://builds.apache.org/job/HBase-TRUNK/ws/trunk/hbase-server/target/surefire/surefire2742116100440880752tmp>
<https://builds.apache.org/job/HBase-TRUNK/ws/trunk/hbase-server/target/surefire/surefire_1392536965932878524287tmp>
Running org.apache.hadoop.hbase.client.TestHCM
Tests run: 7, Failures: 0, Errors: 0, Skipped: 0, Time elapsed: 33.668 sec
Forking command line: /bin/sh -c cd <https://builds.apache.org/job/HBase-TRUNK/ws/trunk/hbase-server>
&& /home/hudson/tools/java/jdk1.6.0_27-32/jre/bin/java -enableassertions -Xmx1900m
-Djava.security.egd=file:/dev/./urandom -jar <https://builds.apache.org/job/HBase-TRUNK/ws/trunk/hbase-server/target/surefire/surefirebooter1405694125384440194.jar>
<https://builds.apache.org/job/HBase-TRUNK/ws/trunk/hbase-server/target/surefire/surefire7472505454256318377tmp>
<https://builds.apache.org/job/HBase-TRUNK/ws/trunk/hbase-server/target/surefire/surefire_1404837070146359439558tmp>
Running org.apache.hadoop.hbase.regionserver.wal.TestHLogSplit
Tests run: 30, Failures: 0, Errors: 0, Skipped: 1, Time elapsed: 322.223 sec
Forking command line: /bin/sh -c cd <https://builds.apache.org/job/HBase-TRUNK/ws/trunk/hbase-server>
&& /home/hudson/tools/java/jdk1.6.0_27-32/jre/bin/java -enableassertions -Xmx1900m
-Djava.security.egd=file:/dev/./urandom -jar <https://builds.apache.org/job/HBase-TRUNK/ws/trunk/hbase-server/target/surefire/surefirebooter1432821867359839917.jar>
<https://builds.apache.org/job/HBase-TRUNK/ws/trunk/hbase-server/target/surefire/surefire448608796003155572tmp>
<https://builds.apache.org/job/HBase-TRUNK/ws/trunk/hbase-server/target/surefire/surefire_1416180797229687039380tmp>
Running org.apache.hadoop.hbase.client.TestHTablePool$TestHTableReusablePool
Tests run: 9, Failures: 0, Errors: 0, Skipped: 0, Time elapsed: 7.056 sec
Running org.apache.hadoop.hbase.client.TestHTablePool$TestHTableThreadLocalPool
Tests run: 9, Failures: 0, Errors: 0, Skipped: 0, Time elapsed: 40.373 sec
Forking command line: /bin/sh -c cd <https://builds.apache.org/job/HBase-TRUNK/ws/trunk/hbase-server>
&& /home/hudson/tools/java/jdk1.6.0_27-32/jre/bin/java -enableassertions -Xmx1900m
-Djava.security.egd=file:/dev/./urandom -jar <https://builds.apache.org/job/HBase-TRUNK/ws/trunk/hbase-server/target/surefire/surefirebooter7905659569954595023.jar>
<https://builds.apache.org/job/HBase-TRUNK/ws/trunk/hbase-server/target/surefire/surefire4736977431068245960tmp>
<https://builds.apache.org/job/HBase-TRUNK/ws/trunk/hbase-server/target/surefire/surefire_1422700026982535474319tmp>
Running org.apache.hadoop.hbase.client.TestFromClientSide3
Tests run: 1, Failures: 0, Errors: 0, Skipped: 0, Time elapsed: 37.714 sec
Forking command line: /bin/sh -c cd <https://builds.apache.org/job/HBase-TRUNK/ws/trunk/hbase-server>
&& /home/hudson/tools/java/jdk1.6.0_27-32/jre/bin/java -enableassertions -Xmx1900m
-Djava.security.egd=file:/dev/./urandom -jar <https://builds.apache.org/job/HBase-TRUNK/ws/trunk/hbase-server/target/surefire/surefirebooter834530018524332589.jar>
<https://builds.apache.org/job/HBase-TRUNK/ws/trunk/hbase-server/target/surefire/surefire4564878703636222563tmp>
<https://builds.apache.org/job/HBase-TRUNK/ws/trunk/hbase-server/target/surefire/surefire_1437013181379641745677tmp>
Running org.apache.hadoop.hbase.client.TestHTableUtil
Tests run: 2, Failures: 0, Errors: 0, Skipped: 0, Time elapsed: 21.294 sec
Forking command line: /bin/sh -c cd <https://builds.apache.org/job/HBase-TRUNK/ws/trunk/hbase-server>
&& /home/hudson/tools/java/jdk1.6.0_27-32/jre/bin/java -enableassertions -Xmx1900m
-Djava.security.egd=file:/dev/./urandom -jar <https://builds.apache.org/job/HBase-TRUNK/ws/trunk/hbase-server/target/surefire/surefirebooter5465174039127080213.jar>
<https://builds.apache.org/job/HBase-TRUNK/ws/trunk/hbase-server/target/surefire/surefire5943774829427877389tmp>
<https://builds.apache.org/job/HBase-TRUNK/ws/trunk/hbase-server/target/surefire/surefire_144975710062285070283tmp>
Running org.apache.hadoop.hbase.client.TestMetaScanner
Tests run: 1, Failures: 0, Errors: 0, Skipped: 0, Time elapsed: 21.667 sec
Forking command line: /bin/sh -c cd <https://builds.apache.org/job/HBase-TRUNK/ws/trunk/hbase-server>
&& /home/hudson/tools/java/jdk1.6.0_27-32/jre/bin/java -enableassertions -Xmx1900m
-Djava.security.egd=file:/dev/./urandom -jar <https://builds.apache.org/job/HBase-TRUNK/ws/trunk/hbase-server/target/surefire/surefirebooter3545715217440810596.jar>
<https://builds.apache.org/job/HBase-TRUNK/ws/trunk/hbase-server/target/surefire/surefire5234644731021168455tmp>
<https://builds.apache.org/job/HBase-TRUNK/ws/trunk/hbase-server/target/surefire/surefire_1457679304590565659595tmp>
Running org.apache.hadoop.hbase.client.TestScannerTimeout
Tests run: 4, Failures: 0, Errors: 0, Skipped: 0, Time elapsed: 66.649 sec
Forking command line: /bin/sh -c cd <https://builds.apache.org/job/HBase-TRUNK/ws/trunk/hbase-server>
&& /home/hudson/tools/java/jdk1.6.0_27-32/jre/bin/java -enableassertions -Xmx1900m
-Djava.security.egd=file:/dev/./urandom -jar <https://builds.apache.org/job/HBase-TRUNK/ws/trunk/hbase-server/target/surefire/surefirebooter8251243081566791912.jar>
<https://builds.apache.org/job/HBase-TRUNK/ws/trunk/hbase-server/target/surefire/surefire8246069409095964710tmp>
<https://builds.apache.org/job/HBase-TRUNK/ws/trunk/hbase-server/target/surefire/surefire_1468995394971184465838tmp>
Running org.apache.hadoop.hbase.client.TestMetaMigrationRemovingHTD
Tests run: 3, Failures: 0, Errors: 0, Skipped: 0, Time elapsed: 37.406 sec
Forking command line: /bin/sh -c cd <https://builds.apache.org/job/HBase-TRUNK/ws/trunk/hbase-server>
&& /home/hudson/tools/java/jdk1.6.0_27-32/jre/bin/java -enableassertions -Xmx1900m
-Djava.security.egd=file:/dev/./urandom -jar <https://builds.apache.org/job/HBase-TRUNK/ws/trunk/hbase-server/target/surefire/surefirebooter6104041530602720256.jar>
<https://builds.apache.org/job/HBase-TRUNK/ws/trunk/hbase-server/target/surefire/surefire5221809631605684632tmp>
<https://builds.apache.org/job/HBase-TRUNK/ws/trunk/hbase-server/target/surefire/surefire_1471558436127150584720tmp>
Running org.apache.hadoop.hbase.client.TestShell
Tests run: 1, Failures: 0, Errors: 0, Skipped: 0, Time elapsed: 151.931 sec
Forking command line: /bin/sh -c cd <https://builds.apache.org/job/HBase-TRUNK/ws/trunk/hbase-server>
&& /home/hudson/tools/java/jdk1.6.0_27-32/jre/bin/java -enableassertions -Xmx1900m
-Djava.security.egd=file:/dev/./urandom -jar <https://builds.apache.org/job/HBase-TRUNK/ws/trunk/hbase-server/target/surefire/surefirebooter3232209281127592863.jar>
<https://builds.apache.org/job/HBase-TRUNK/ws/trunk/hbase-server/target/surefire/surefire543461482384967560tmp>
<https://builds.apache.org/job/HBase-TRUNK/ws/trunk/hbase-server/target/surefire/surefire_1484391459664036666890tmp>
Running org.apache.hadoop.hbase.client.TestFromClientSide
Tests run: 56, Failures: 0, Errors: 0, Skipped: 3, Time elapsed: 277.723 sec
Forking command line: /bin/sh -c cd <https://builds.apache.org/job/HBase-TRUNK/ws/trunk/hbase-server>
&& /home/hudson/tools/java/jdk1.6.0_27-32/jre/bin/java -enableassertions -Xmx1900m
-Djava.security.egd=file:/dev/./urandom -jar <https://builds.apache.org/job/HBase-TRUNK/ws/trunk/hbase-server/target/surefire/surefirebooter1315555067690293224.jar>
<https://builds.apache.org/job/HBase-TRUNK/ws/trunk/hbase-server/target/surefire/surefire3251270484468360539tmp>
<https://builds.apache.org/job/HBase-TRUNK/ws/trunk/hbase-server/target/surefire/surefire_1494159915982483791350tmp>
Running org.apache.hadoop.hbase.TestMultiVersions
Tests run: 3, Failures: 0, Errors: 0, Skipped: 0, Time elapsed: 33.868 sec
Forking command line: /bin/sh -c cd <https://builds.apache.org/job/HBase-TRUNK/ws/trunk/hbase-server>
&& /home/hudson/tools/java/jdk1.6.0_27-32/jre/bin/java -enableassertions -Xmx1900m
-Djava.security.egd=file:/dev/./urandom -jar <https://builds.apache.org/job/HBase-TRUNK/ws/trunk/hbase-server/target/surefire/surefirebooter7870804716007457385.jar>
<https://builds.apache.org/job/HBase-TRUNK/ws/trunk/hbase-server/target/surefire/surefire2959829650943760828tmp>
<https://builds.apache.org/job/HBase-TRUNK/ws/trunk/hbase-server/target/surefire/surefire_150437294361052699756tmp>
Running org.apache.hadoop.hbase.client.TestMultiParallel
Tests run: 11, Failures: 0, Errors: 0, Skipped: 0, Time elapsed: 67.829 sec
Forking command line: /bin/sh -c cd <https://builds.apache.org/job/HBase-TRUNK/ws/trunk/hbase-server>
&& /home/hudson/tools/java/jdk1.6.0_27-32/jre/bin/java -enableassertions -Xmx1900m
-Djava.security.egd=file:/dev/./urandom -jar <https://builds.apache.org/job/HBase-TRUNK/ws/trunk/hbase-server/target/surefire/surefirebooter4690975340505200663.jar>
<https://builds.apache.org/job/HBase-TRUNK/ws/trunk/hbase-server/target/surefire/surefire695373451120299423tmp>
<https://builds.apache.org/job/HBase-TRUNK/ws/trunk/hbase-server/target/surefire/surefire_1513216787294075495483tmp>
Running org.apache.hadoop.hbase.client.TestAdmin
Tests run: 39, Failures: 0, Errors: 1, Skipped: 0, Time elapsed: 261.661 sec <<<
FAILURE!
Forking command line: /bin/sh -c cd <https://builds.apache.org/job/HBase-TRUNK/ws/trunk/hbase-server>
&& /home/hudson/tools/java/jdk1.6.0_27-32/jre/bin/java -enableassertions -Xmx1900m
-Djava.security.egd=file:/dev/./urandom -jar <https://builds.apache.org/job/HBase-TRUNK/ws/trunk/hbase-server/target/surefire/surefirebooter3910410116378675012.jar>
<https://builds.apache.org/job/HBase-TRUNK/ws/trunk/hbase-server/target/surefire/surefire1722583752746981663tmp>
<https://builds.apache.org/job/HBase-TRUNK/ws/trunk/hbase-server/target/surefire/surefire_1521629600641405289984tmp>
Running org.apache.hadoop.hbase.master.TestActiveMasterManager
Tests run: 2, Failures: 0, Errors: 0, Skipped: 0, Time elapsed: 1.189 sec
Forking command line: /bin/sh -c cd <https://builds.apache.org/job/HBase-TRUNK/ws/trunk/hbase-server>
&& /home/hudson/tools/java/jdk1.6.0_27-32/jre/bin/java -enableassertions -Xmx1900m
-Djava.security.egd=file:/dev/./urandom -jar <https://builds.apache.org/job/HBase-TRUNK/ws/trunk/hbase-server/target/surefire/surefirebooter4979375896165991273.jar>
<https://builds.apache.org/job/HBase-TRUNK/ws/trunk/hbase-server/target/surefire/surefire8329134261897490832tmp>
<https://builds.apache.org/job/HBase-TRUNK/ws/trunk/hbase-server/target/surefire/surefire_153134858556380766953tmp>
Running org.apache.hadoop.hbase.master.TestMasterNoCluster
Tests run: 3, Failures: 0, Errors: 0, Skipped: 0, Time elapsed: 8.745 sec
Forking command line: /bin/sh -c cd <https://builds.apache.org/job/HBase-TRUNK/ws/trunk/hbase-server>
&& /home/hudson/tools/java/jdk1.6.0_27-32/jre/bin/java -enableassertions -Xmx1900m
-Djava.security.egd=file:/dev/./urandom -jar <https://builds.apache.org/job/HBase-TRUNK/ws/trunk/hbase-server/target/surefire/surefirebooter170528102650995301.jar>
<https://builds.apache.org/job/HBase-TRUNK/ws/trunk/hbase-server/target/surefire/surefire6655388421224544737tmp>
<https://builds.apache.org/job/HBase-TRUNK/ws/trunk/hbase-server/target/surefire/surefire_1545352444607577193756tmp>
Running org.apache.hadoop.hbase.master.TestRollingRestart
Running org.apache.hadoop.hbase.master.TestLogsCleaner
Tests run: 1, Failures: 0, Errors: 0, Skipped: 0, Time elapsed: 3.237 sec
Forking command line: /bin/sh -c cd <https://builds.apache.org/job/HBase-TRUNK/ws/trunk/hbase-server>
&& /home/hudson/tools/java/jdk1.6.0_27-32/jre/bin/java -enableassertions -Xmx1900m
-Djava.security.egd=file:/dev/./urandom -jar <https://builds.apache.org/job/HBase-TRUNK/ws/trunk/hbase-server/target/surefire/surefirebooter1572060120076200652.jar>
<https://builds.apache.org/job/HBase-TRUNK/ws/trunk/hbase-server/target/surefire/surefire2610450760431203644tmp>
<https://builds.apache.org/job/HBase-TRUNK/ws/trunk/hbase-server/target/surefire/surefire_1552212697062242302476tmp>
Tests run: 1, Failures: 0, Errors: 0, Skipped: 0, Time elapsed: 74.585 sec
Forking command line: /bin/sh -c cd <https://builds.apache.org/job/HBase-TRUNK/ws/trunk/hbase-server>
&& /home/hudson/tools/java/jdk1.6.0_27-32/jre/bin/java -enableassertions -Xmx1900m
-Djava.security.egd=file:/dev/./urandom -jar <https://builds.apache.org/job/HBase-TRUNK/ws/trunk/hbase-server/target/surefire/surefirebooter4635893195906526921.jar>
<https://builds.apache.org/job/HBase-TRUNK/ws/trunk/hbase-server/target/surefire/surefire3070100048841372074tmp>
<https://builds.apache.org/job/HBase-TRUNK/ws/trunk/hbase-server/target/surefire/surefire_15686053832546999905tmp>
Running org.apache.hadoop.hbase.thrift.TestThriftServer
Tests run: 1, Failures: 0, Errors: 0, Skipped: 0, Time elapsed: 81.291 sec
Forking command line: /bin/sh -c cd <https://builds.apache.org/job/HBase-TRUNK/ws/trunk/hbase-server>
&& /home/hudson/tools/java/jdk1.6.0_27-32/jre/bin/java -enableassertions -Xmx1900m
-Djava.security.egd=file:/dev/./urandom -jar <https://builds.apache.org/job/HBase-TRUNK/ws/trunk/hbase-server/target/surefire/surefirebooter6494445384703160772.jar>
<https://builds.apache.org/job/HBase-TRUNK/ws/trunk/hbase-server/target/surefire/surefire3894674898538814836tmp>
<https://builds.apache.org/job/HBase-TRUNK/ws/trunk/hbase-server/target/surefire/surefire_1576515740221691770594tmp>
Running org.apache.hadoop.hbase.master.TestMaster
Tests run: 1, Failures: 0, Errors: 0, Skipped: 0, Time elapsed: 21.163 sec
Forking command line: /bin/sh -c cd <https://builds.apache.org/job/HBase-TRUNK/ws/trunk/hbase-server>
&& /home/hudson/tools/java/jdk1.6.0_27-32/jre/bin/java -enableassertions -Xmx1900m
-Djava.security.egd=file:/dev/./urandom -jar <https://builds.apache.org/job/HBase-TRUNK/ws/trunk/hbase-server/target/surefire/surefirebooter2603217865120692925.jar>
<https://builds.apache.org/job/HBase-TRUNK/ws/trunk/hbase-server/target/surefire/surefire7071913828799410614tmp>
<https://builds.apache.org/job/HBase-TRUNK/ws/trunk/hbase-server/target/surefire/surefire_1587873793907923320124tmp>
Running org.apache.hadoop.hbase.master.TestMasterTransitions
Tests run: 3, Failures: 0, Errors: 0, Skipped: 3, Time elapsed: 27.782 sec
Forking command line: /bin/sh -c cd <https://builds.apache.org/job/HBase-TRUNK/ws/trunk/hbase-server>
&& /home/hudson/tools/java/jdk1.6.0_27-32/jre/bin/java -enableassertions -Xmx1900m
-Djava.security.egd=file:/dev/./urandom -jar <https://builds.apache.org/job/HBase-TRUNK/ws/trunk/hbase-server/target/surefire/surefirebooter1345170185374510334.jar>
<https://builds.apache.org/job/HBase-TRUNK/ws/trunk/hbase-server/target/surefire/surefire6485178977224877214tmp>
<https://builds.apache.org/job/HBase-TRUNK/ws/trunk/hbase-server/target/surefire/surefire_1595101581479700746791tmp>
Running org.apache.hadoop.hbase.master.TestZKBasedOpenCloseRegion
Tests run: 4, Failures: 0, Errors: 0, Skipped: 0, Time elapsed: 29.871 sec
Forking command line: /bin/sh -c cd <https://builds.apache.org/job/HBase-TRUNK/ws/trunk/hbase-server>
&& /home/hudson/tools/java/jdk1.6.0_27-32/jre/bin/java -enableassertions -Xmx1900m
-Djava.security.egd=file:/dev/./urandom -jar <https://builds.apache.org/job/HBase-TRUNK/ws/trunk/hbase-server/target/surefire/surefirebooter6471609872724196167.jar>
<https://builds.apache.org/job/HBase-TRUNK/ws/trunk/hbase-server/target/surefire/surefire840180893500456236tmp>
<https://builds.apache.org/job/HBase-TRUNK/ws/trunk/hbase-server/target/surefire/surefire_1602749044400911534277tmp>
Running org.apache.hadoop.hbase.master.TestOpenedRegionHandler
Tests run: 2, Failures: 0, Errors: 0, Skipped: 0, Time elapsed: 19.078 sec
Forking command line: /bin/sh -c cd <https://builds.apache.org/job/HBase-TRUNK/ws/trunk/hbase-server>
&& /home/hudson/tools/java/jdk1.6.0_27-32/jre/bin/java -enableassertions -Xmx1900m
-Djava.security.egd=file:/dev/./urandom -jar <https://builds.apache.org/job/HBase-TRUNK/ws/trunk/hbase-server/target/surefire/surefirebooter3156447470523592862.jar>
<https://builds.apache.org/job/HBase-TRUNK/ws/trunk/hbase-server/target/surefire/surefire7320130340112772530tmp>
<https://builds.apache.org/job/HBase-TRUNK/ws/trunk/hbase-server/target/surefire/surefire_1612270213092822987529tmp>
Running org.apache.hadoop.hbase.master.TestMXBean
Tests run: 1, Failures: 0, Errors: 0, Skipped: 0, Time elapsed: 16.919 sec
Running org.apache.hadoop.hbase.master.TestSplitLogManager
Tests run: 12, Failures: 0, Errors: 0, Skipped: 0, Time elapsed: 16.555 sec
Forking command line: /bin/sh -c cd <https://builds.apache.org/job/HBase-TRUNK/ws/trunk/hbase-server>
&& /home/hudson/tools/java/jdk1.6.0_27-32/jre/bin/java -enableassertions -Xmx1900m
-Djava.security.egd=file:/dev/./urandom -jar <https://builds.apache.org/job/HBase-TRUNK/ws/trunk/hbase-server/target/surefire/surefirebooter2650771284187420988.jar>
<https://builds.apache.org/job/HBase-TRUNK/ws/trunk/hbase-server/target/surefire/surefire1679330635222578001tmp>
<https://builds.apache.org/job/HBase-TRUNK/ws/trunk/hbase-server/target/surefire/surefire_1628186693780101738752tmp>
Forking command line: /bin/sh -c cd <https://builds.apache.org/job/HBase-TRUNK/ws/trunk/hbase-server>
&& /home/hudson/tools/java/jdk1.6.0_27-32/jre/bin/java -enableassertions -Xmx1900m
-Djava.security.egd=file:/dev/./urandom -jar <https://builds.apache.org/job/HBase-TRUNK/ws/trunk/hbase-server/target/surefire/surefirebooter6768741137640932712.jar>
<https://builds.apache.org/job/HBase-TRUNK/ws/trunk/hbase-server/target/surefire/surefire6415882210941861538tmp>
<https://builds.apache.org/job/HBase-TRUNK/ws/trunk/hbase-server/target/surefire/surefire_1633653939338705195120tmp>
Running org.apache.hadoop.hbase.master.TestAssignmentManager
Tests run: 11, Failures: 0, Errors: 0, Skipped: 0, Time elapsed: 3.419 sec
Forking command line: /bin/sh -c cd <https://builds.apache.org/job/HBase-TRUNK/ws/trunk/hbase-server>
&& /home/hudson/tools/java/jdk1.6.0_27-32/jre/bin/java -enableassertions -Xmx1900m
-Djava.security.egd=file:/dev/./urandom -jar <https://builds.apache.org/job/HBase-TRUNK/ws/trunk/hbase-server/target/surefire/surefirebooter2475531886467904658.jar>
<https://builds.apache.org/job/HBase-TRUNK/ws/trunk/hbase-server/target/surefire/surefire5416003308164517151tmp>
<https://builds.apache.org/job/HBase-TRUNK/ws/trunk/hbase-server/target/surefire/surefire_1642944146707724802179tmp>
Running org.apache.hadoop.hbase.master.TestMasterStatusServlet
Tests run: 5, Failures: 0, Errors: 0, Skipped: 0, Time elapsed: 1.258 sec
Forking command line: /bin/sh -c cd <https://builds.apache.org/job/HBase-TRUNK/ws/trunk/hbase-server>
&& /home/hudson/tools/java/jdk1.6.0_27-32/jre/bin/java -enableassertions -Xmx1900m
-Djava.security.egd=file:/dev/./urandom -jar <https://builds.apache.org/job/HBase-TRUNK/ws/trunk/hbase-server/target/surefire/surefirebooter827979575317102771.jar>
<https://builds.apache.org/job/HBase-TRUNK/ws/trunk/hbase-server/target/surefire/surefire7252385790081063406tmp>
<https://builds.apache.org/job/HBase-TRUNK/ws/trunk/hbase-server/target/surefire/surefire_165459436532247192311tmp>
Running org.apache.hadoop.hbase.master.TestHMasterRPCException
Tests run: 1, Failures: 0, Errors: 0, Skipped: 0, Time elapsed: 1.093 sec
Forking command line: /bin/sh -c cd <https://builds.apache.org/job/HBase-TRUNK/ws/trunk/hbase-server>
&& /home/hudson/tools/java/jdk1.6.0_27-32/jre/bin/java -enableassertions -Xmx1900m
-Djava.security.egd=file:/dev/./urandom -jar <https://builds.apache.org/job/HBase-TRUNK/ws/trunk/hbase-server/target/surefire/surefirebooter1206378262760610890.jar>
<https://builds.apache.org/job/HBase-TRUNK/ws/trunk/hbase-server/target/surefire/surefire6627607353621973999tmp>
<https://builds.apache.org/job/HBase-TRUNK/ws/trunk/hbase-server/target/surefire/surefire_1665356817979696224756tmp>
Running org.apache.hadoop.hbase.master.TestMasterRestartAfterDisablingTable
Tests run: 1, Failures: 0, Errors: 0, Skipped: 0, Time elapsed: 20.263 sec
Forking command line: /bin/sh -c cd <https://builds.apache.org/job/HBase-TRUNK/ws/trunk/hbase-server>
&& /home/hudson/tools/java/jdk1.6.0_27-32/jre/bin/java -enableassertions -Xmx1900m
-Djava.security.egd=file:/dev/./urandom -jar <https://builds.apache.org/job/HBase-TRUNK/ws/trunk/hbase-server/target/surefire/surefirebooter1928010101608562235.jar>
<https://builds.apache.org/job/HBase-TRUNK/ws/trunk/hbase-server/target/surefire/surefire3302943580011293785tmp>
<https://builds.apache.org/job/HBase-TRUNK/ws/trunk/hbase-server/target/surefire/surefire_1676742975902363577554tmp>
Running org.apache.hadoop.hbase.master.TestMasterShutdown
Tests run: 1, Failures: 0, Errors: 0, Skipped: 0, Time elapsed: 20.519 sec
Forking command line: /bin/sh -c cd <https://builds.apache.org/job/HBase-TRUNK/ws/trunk/hbase-server>
&& /home/hudson/tools/java/jdk1.6.0_27-32/jre/bin/java -enableassertions -Xmx1900m
-Djava.security.egd=file:/dev/./urandom -jar <https://builds.apache.org/job/HBase-TRUNK/ws/trunk/hbase-server/target/surefire/surefirebooter862220366584107821.jar>
<https://builds.apache.org/job/HBase-TRUNK/ws/trunk/hbase-server/target/surefire/surefire8392807792444474531tmp>
<https://builds.apache.org/job/HBase-TRUNK/ws/trunk/hbase-server/target/surefire/surefire_1688468845309828012678tmp>
Running org.apache.hadoop.hbase.master.TestRestartCluster
Tests run: 2, Failures: 0, Errors: 0, Skipped: 0, Time elapsed: 46.339 sec
Forking command line: /bin/sh -c cd <https://builds.apache.org/job/HBase-TRUNK/ws/trunk/hbase-server>
&& /home/hudson/tools/java/jdk1.6.0_27-32/jre/bin/java -enableassertions -Xmx1900m
-Djava.security.egd=file:/dev/./urandom -jar <https://builds.apache.org/job/HBase-TRUNK/ws/trunk/hbase-server/target/surefire/surefirebooter1897388455791248313.jar>
<https://builds.apache.org/job/HBase-TRUNK/ws/trunk/hbase-server/target/surefire/surefire4670372781320919382tmp>
<https://builds.apache.org/job/HBase-TRUNK/ws/trunk/hbase-server/target/surefire/surefire_1697802955087760955336tmp>
Running org.apache.hadoop.hbase.master.TestMasterFailover
Tests run: 4, Failures: 0, Errors: 0, Skipped: 0, Time elapsed: 94.768 sec
Forking command line: /bin/sh -c cd <https://builds.apache.org/job/HBase-TRUNK/ws/trunk/hbase-server>
&& /home/hudson/tools/java/jdk1.6.0_27-32/jre/bin/java -enableassertions -Xmx1900m
-Djava.security.egd=file:/dev/./urandom -jar <https://builds.apache.org/job/HBase-TRUNK/ws/trunk/hbase-server/target/surefire/surefirebooter1175753698132955299.jar>
<https://builds.apache.org/job/HBase-TRUNK/ws/trunk/hbase-server/target/surefire/surefire3920563606851970380tmp>
<https://builds.apache.org/job/HBase-TRUNK/ws/trunk/hbase-server/target/surefire/surefire_1706158751035105562175tmp>
Running org.apache.hadoop.hbase.avro.TestAvroServer
Tests run: 3, Failures: 0, Errors: 0, Skipped: 0, Time elapsed: 37.305 sec
Forking command line: /bin/sh -c cd <https://builds.apache.org/job/HBase-TRUNK/ws/trunk/hbase-server>
&& /home/hudson/tools/java/jdk1.6.0_27-32/jre/bin/java -enableassertions -Xmx1900m
-Djava.security.egd=file:/dev/./urandom -jar <https://builds.apache.org/job/HBase-TRUNK/ws/trunk/hbase-server/target/surefire/surefirebooter4239796924549565993.jar>
<https://builds.apache.org/job/HBase-TRUNK/ws/trunk/hbase-server/target/surefire/surefire7097027904921284802tmp>
<https://builds.apache.org/job/HBase-TRUNK/ws/trunk/hbase-server/target/surefire/surefire_1716784509988851704353tmp>
Running org.apache.hadoop.hbase.TestRegionRebalancing
Tests run: 1, Failures: 0, Errors: 0, Skipped: 0, Time elapsed: 57.096 sec
Forking command line: /bin/sh -c cd <https://builds.apache.org/job/HBase-TRUNK/ws/trunk/hbase-server>
&& /home/hudson/tools/java/jdk1.6.0_27-32/jre/bin/java -enableassertions -Xmx1900m
-Djava.security.egd=file:/dev/./urandom -jar <https://builds.apache.org/job/HBase-TRUNK/ws/trunk/hbase-server/target/surefire/surefirebooter6502991012230984007.jar>
<https://builds.apache.org/job/HBase-TRUNK/ws/trunk/hbase-server/target/surefire/surefire2814773446031781394tmp>
<https://builds.apache.org/job/HBase-TRUNK/ws/trunk/hbase-server/target/surefire/surefire_1727656847263008812905tmp>
Running org.apache.hadoop.hbase.TestZooKeeper
Tests run: 9, Failures: 0, Errors: 0, Skipped: 0, Time elapsed: 30.413 sec
Forking command line: /bin/sh -c cd <https://builds.apache.org/job/HBase-TRUNK/ws/trunk/hbase-server>
&& /home/hudson/tools/java/jdk1.6.0_27-32/jre/bin/java -enableassertions -Xmx1900m
-Djava.security.egd=file:/dev/./urandom -jar <https://builds.apache.org/job/HBase-TRUNK/ws/trunk/hbase-server/target/surefire/surefirebooter106685352813500139.jar>
<https://builds.apache.org/job/HBase-TRUNK/ws/trunk/hbase-server/target/surefire/surefire5629455437491958690tmp>
<https://builds.apache.org/job/HBase-TRUNK/ws/trunk/hbase-server/target/surefire/surefire_1738741990199116254561tmp>
Running org.apache.hadoop.hbase.master.TestDistributedLogSplitting
Tests run: 4, Failures: 0, Errors: 0, Skipped: 0, Time elapsed: 172.637 sec
Forking command line: /bin/sh -c cd <https://builds.apache.org/job/HBase-TRUNK/ws/trunk/hbase-server>
&& /home/hudson/tools/java/jdk1.6.0_27-32/jre/bin/java -enableassertions -Xmx1900m
-Djava.security.egd=file:/dev/./urandom -jar <https://builds.apache.org/job/HBase-TRUNK/ws/trunk/hbase-server/target/surefire/surefirebooter3519617878068937644.jar>
<https://builds.apache.org/job/HBase-TRUNK/ws/trunk/hbase-server/target/surefire/surefire6062427909862716614tmp>
<https://builds.apache.org/job/HBase-TRUNK/ws/trunk/hbase-server/target/surefire/surefire_1743307685486592548995tmp>
Running org.apache.hadoop.hbase.ipc.TestDelayedRpc
Tests run: 4, Failures: 0, Errors: 0, Skipped: 0, Time elapsed: 2.621 sec
Forking command line: /bin/sh -c cd <https://builds.apache.org/job/HBase-TRUNK/ws/trunk/hbase-server>
&& /home/hudson/tools/java/jdk1.6.0_27-32/jre/bin/java -enableassertions -Xmx1900m
-Djava.security.egd=file:/dev/./urandom -jar <https://builds.apache.org/job/HBase-TRUNK/ws/trunk/hbase-server/target/surefire/surefirebooter2944632444120487032.jar>
<https://builds.apache.org/job/HBase-TRUNK/ws/trunk/hbase-server/target/surefire/surefire9084475289414736364tmp>
<https://builds.apache.org/job/HBase-TRUNK/ws/trunk/hbase-server/target/surefire/surefire_1753205096412255255987tmp>
Running org.apache.hadoop.hbase.TestInfoServers
Tests run: 2, Failures: 0, Errors: 0, Skipped: 0, Time elapsed: 16.11 sec
Running org.apache.hadoop.hbase.thrift2.TestThriftHBaseServiceHandler
Tests run: 12, Failures: 0, Errors: 0, Skipped: 0, Time elapsed: 18.899 sec
Running org.apache.hadoop.hbase.TestAcidGuarantees
Tests run: 3, Failures: 0, Errors: 0, Skipped: 0, Time elapsed: 109.08 sec
Running org.apache.hadoop.hbase.thrift.TestThriftServerCmdLine
Tests run: 20, Failures: 0, Errors: 0, Skipped: 0, Time elapsed: 563.388 sec

Results :

Failed tests:   testMultiRowMutationMultiThreads(org.apache.hadoop.hbase.regionserver.TestAtomicOperation):
expected:<0> but was:<1>

Tests in error: 
  testCloseRegionThatFetchesTheHRIFromMeta(org.apache.hadoop.hbase.client.TestAdmin): -1

Tests run: 1000, Failures: 1, Errors: 1, Skipped: 9

[INFO] ------------------------------------------------------------------------
[INFO] Reactor Summary:
[INFO] 
[INFO] HBase ............................................. SUCCESS [5.636s]
[INFO] HBase - Server .................................... FAILURE [52:38.635s]
[INFO] HBase - Assembly .................................. SKIPPED
[INFO] HBase - Site ...................................... SKIPPED
[INFO] ------------------------------------------------------------------------
[INFO] BUILD FAILURE
[INFO] ------------------------------------------------------------------------
[INFO] Total time: 52:45.953s
[INFO] Finished at: Tue May 29 19:18:48 UTC 2012
[INFO] Final Memory: 33M/318M
[INFO] ------------------------------------------------------------------------
[ERROR] Failed to execute goal org.apache.maven.plugins:maven-surefire-plugin:2.12-TRUNK-HBASE-2:test
(secondPartTestsExecution) on project hbase-server: There are test failures.
[ERROR] 
[ERROR] Please refer to <https://builds.apache.org/job/HBase-TRUNK/ws/trunk/hbase-server/target/surefire-reports>
for the individual test results.
[ERROR] -> [Help 1]
org.apache.maven.lifecycle.LifecycleExecutionException: Failed to execute goal org.apache.maven.plugins:maven-surefire-plugin:2.12-TRUNK-HBASE-2:test
(secondPartTestsExecution) on project hbase-server: There are test failures.

Please refer to <https://builds.apache.org/job/HBase-TRUNK/ws/trunk/hbase-server/target/surefire-reports>
for the individual test results.
	at org.apache.maven.lifecycle.internal.MojoExecutor.execute(MojoExecutor.java:213)
	at org.apache.maven.lifecycle.internal.MojoExecutor.execute(MojoExecutor.java:153)
	at org.apache.maven.lifecycle.internal.MojoExecutor.execute(MojoExecutor.java:145)
	at org.apache.maven.lifecycle.internal.LifecycleModuleBuilder.buildProject(LifecycleModuleBuilder.java:84)
	at org.apache.maven.lifecycle.internal.LifecycleModuleBuilder.buildProject(LifecycleModuleBuilder.java:59)
	at org.apache.maven.lifecycle.internal.LifecycleStarter.singleThreadedBuild(LifecycleStarter.java:183)
	at org.apache.maven.lifecycle.internal.LifecycleStarter.execute(LifecycleStarter.java:161)
	at org.apache.maven.DefaultMaven.doExecute(DefaultMaven.java:319)
	at org.apache.maven.DefaultMaven.execute(DefaultMaven.java:156)
	at org.apache.maven.cli.MavenCli.execute(MavenCli.java:537)
	at org.apache.maven.cli.MavenCli.doMain(MavenCli.java:196)
	at org.apache.maven.cli.MavenCli.main(MavenCli.java:141)
	at sun.reflect.NativeMethodAccessorImpl.invoke0(Native Method)
	at sun.reflect.NativeMethodAccessorImpl.invoke(NativeMethodAccessorImpl.java:39)
	at sun.reflect.DelegatingMethodAccessorImpl.invoke(DelegatingMethodAccessorImpl.java:25)
	at java.lang.reflect.Method.invoke(Method.java:597)
	at org.codehaus.plexus.classworlds.launcher.Launcher.launchEnhanced(Launcher.java:290)
	at org.codehaus.plexus.classworlds.launcher.Launcher.launch(Launcher.java:230)
	at org.codehaus.plexus.classworlds.launcher.Launcher.mainWithExitCode(Launcher.java:409)
	at org.codehaus.plexus.classworlds.launcher.Launcher.main(Launcher.java:352)
Caused by: org.apache.maven.plugin.MojoFailureException: There are test failures.

Please refer to <https://builds.apache.org/job/HBase-TRUNK/ws/trunk/hbase-server/target/surefire-reports>
for the individual test results.
	at org.apache.maven.plugin.surefire.SurefireHelper.reportExecution(SurefireHelper.java:87)
	at org.apache.maven.plugin.surefire.SurefirePlugin.writeSummary(SurefirePlugin.java:651)
	at org.apache.maven.plugin.surefire.SurefirePlugin.handleSummary(SurefirePlugin.java:625)
	at org.apache.maven.plugin.surefire.AbstractSurefireMojo.executeAfterPreconditionsChecked(AbstractSurefireMojo.java:137)
	at org.apache.maven.plugin.surefire.AbstractSurefireMojo.execute(AbstractSurefireMojo.java:98)
	at org.apache.maven.plugin.DefaultBuildPluginManager.executeMojo(DefaultBuildPluginManager.java:101)
	at org.apache.maven.lifecycle.internal.MojoExecutor.execute(MojoExecutor.java:209)
	... 19 more
[ERROR] 
[ERROR] 
[ERROR] For more information about the errors and possible solutions, please read the following
articles:
[ERROR] [Help 1] http://cwiki.apache.org/confluence/display/MAVEN/MojoFailureException
[ERROR] 
[ERROR] After correcting the problems, you can resume the build with the command
[ERROR]   mvn <goals> -rf :hbase-server
Build step 'Invoke top-level Maven targets' marked build as failure
Archiving artifacts
Recording test results
Updating HBASE-6108

Mime
View raw message