hbase-dev mailing list archives

Site index · List index
Message view « Date » · « Thread »
Top « Date » · « Thread »
From Apache Jenkins Server <jenk...@builds.apache.org>
Subject Build failed in Jenkins: HBase-TRUNK #2953
Date Wed, 30 May 2012 16:47:24 GMT
See <https://builds.apache.org/job/HBase-TRUNK/2953/changes>

Changes:

[stack] HBASE-6131 Add attribution for code added by HBASE-5533 metrics

------------------------------------------
[...truncated 6149 lines...]
Forking command line: /bin/sh -c cd <https://builds.apache.org/job/HBase-TRUNK/ws/trunk/hbase-server>
&& /home/jenkins/tools/java/jdk1.6.0_27-32/jre/bin/java -enableassertions -Xmx1900m
-Djava.security.egd=file:/dev/./urandom -jar <https://builds.apache.org/job/HBase-TRUNK/ws/trunk/hbase-server/target/surefire/surefirebooter2680987316854938771.jar>
<https://builds.apache.org/job/HBase-TRUNK/ws/trunk/hbase-server/target/surefire/surefire5265536178461127450tmp>
<https://builds.apache.org/job/HBase-TRUNK/ws/trunk/hbase-server/target/surefire/surefire_1177260146853243846127tmp>
Running org.apache.hadoop.hbase.mapreduce.TestImportExport
Tests run: 2, Failures: 0, Errors: 0, Skipped: 0, Time elapsed: 47.853 sec
Forking command line: /bin/sh -c cd <https://builds.apache.org/job/HBase-TRUNK/ws/trunk/hbase-server>
&& /home/jenkins/tools/java/jdk1.6.0_27-32/jre/bin/java -enableassertions -Xmx1900m
-Djava.security.egd=file:/dev/./urandom -jar <https://builds.apache.org/job/HBase-TRUNK/ws/trunk/hbase-server/target/surefire/surefirebooter75639342532113775.jar>
<https://builds.apache.org/job/HBase-TRUNK/ws/trunk/hbase-server/target/surefire/surefire5495691312583281790tmp>
<https://builds.apache.org/job/HBase-TRUNK/ws/trunk/hbase-server/target/surefire/surefire_118201108953941360742tmp>
Running org.apache.hadoop.hbase.catalog.TestMetaReaderEditorNoCluster
Tests run: 1, Failures: 0, Errors: 0, Skipped: 0, Time elapsed: 4.221 sec
Forking command line: /bin/sh -c cd <https://builds.apache.org/job/HBase-TRUNK/ws/trunk/hbase-server>
&& /home/jenkins/tools/java/jdk1.6.0_27-32/jre/bin/java -enableassertions -Xmx1900m
-Djava.security.egd=file:/dev/./urandom -jar <https://builds.apache.org/job/HBase-TRUNK/ws/trunk/hbase-server/target/surefire/surefirebooter1857582031542017011.jar>
<https://builds.apache.org/job/HBase-TRUNK/ws/trunk/hbase-server/target/surefire/surefire4176980255777957718tmp>
<https://builds.apache.org/job/HBase-TRUNK/ws/trunk/hbase-server/target/surefire/surefire_1193759645786778942883tmp>
Running org.apache.hadoop.hbase.catalog.TestMetaReaderEditor
Tests run: 5, Failures: 0, Errors: 0, Skipped: 0, Time elapsed: 23.378 sec
Forking command line: /bin/sh -c cd <https://builds.apache.org/job/HBase-TRUNK/ws/trunk/hbase-server>
&& /home/jenkins/tools/java/jdk1.6.0_27-32/jre/bin/java -enableassertions -Xmx1900m
-Djava.security.egd=file:/dev/./urandom -jar <https://builds.apache.org/job/HBase-TRUNK/ws/trunk/hbase-server/target/surefire/surefirebooter5439694324009723662.jar>
<https://builds.apache.org/job/HBase-TRUNK/ws/trunk/hbase-server/target/surefire/surefire8682657303954341376tmp>
<https://builds.apache.org/job/HBase-TRUNK/ws/trunk/hbase-server/target/surefire/surefire_1203902640510111332982tmp>
Running org.apache.hadoop.hbase.catalog.TestCatalogTracker
Tests run: 9, Failures: 0, Errors: 0, Skipped: 1, Time elapsed: 5.582 sec
Forking command line: /bin/sh -c cd <https://builds.apache.org/job/HBase-TRUNK/ws/trunk/hbase-server>
&& /home/jenkins/tools/java/jdk1.6.0_27-32/jre/bin/java -enableassertions -Xmx1900m
-Djava.security.egd=file:/dev/./urandom -jar <https://builds.apache.org/job/HBase-TRUNK/ws/trunk/hbase-server/target/surefire/surefirebooter8598199643077039630.jar>
<https://builds.apache.org/job/HBase-TRUNK/ws/trunk/hbase-server/target/surefire/surefire2499983762239986666tmp>
<https://builds.apache.org/job/HBase-TRUNK/ws/trunk/hbase-server/target/surefire/surefire_1217475027302432806692tmp>
Running org.apache.hadoop.hbase.client.TestFromClientSide3
Tests run: 1, Failures: 0, Errors: 0, Skipped: 0, Time elapsed: 25.294 sec
Forking command line: /bin/sh -c cd <https://builds.apache.org/job/HBase-TRUNK/ws/trunk/hbase-server>
&& /home/jenkins/tools/java/jdk1.6.0_27-32/jre/bin/java -enableassertions -Xmx1900m
-Djava.security.egd=file:/dev/./urandom -jar <https://builds.apache.org/job/HBase-TRUNK/ws/trunk/hbase-server/target/surefire/surefirebooter9208663622805634512.jar>
<https://builds.apache.org/job/HBase-TRUNK/ws/trunk/hbase-server/target/surefire/surefire7351707061938799061tmp>
<https://builds.apache.org/job/HBase-TRUNK/ws/trunk/hbase-server/target/surefire/surefire_1224578494651157059109tmp>
Running org.apache.hadoop.hbase.client.TestTimestampsFilter
Tests run: 3, Failures: 0, Errors: 0, Skipped: 0, Time elapsed: 17.969 sec
Forking command line: /bin/sh -c cd <https://builds.apache.org/job/HBase-TRUNK/ws/trunk/hbase-server>
&& /home/jenkins/tools/java/jdk1.6.0_27-32/jre/bin/java -enableassertions -Xmx1900m
-Djava.security.egd=file:/dev/./urandom -jar <https://builds.apache.org/job/HBase-TRUNK/ws/trunk/hbase-server/target/surefire/surefirebooter4374167221568311852.jar>
<https://builds.apache.org/job/HBase-TRUNK/ws/trunk/hbase-server/target/surefire/surefire4575182384100162432tmp>
<https://builds.apache.org/job/HBase-TRUNK/ws/trunk/hbase-server/target/surefire/surefire_1238213016324864456590tmp>
Running org.apache.hadoop.hbase.TestAcidGuarantees
Tests run: 3, Failures: 0, Errors: 0, Skipped: 0, Time elapsed: 97.548 sec
Forking command line: /bin/sh -c cd <https://builds.apache.org/job/HBase-TRUNK/ws/trunk/hbase-server>
&& /home/jenkins/tools/java/jdk1.6.0_27-32/jre/bin/java -enableassertions -Xmx1900m
-Djava.security.egd=file:/dev/./urandom -jar <https://builds.apache.org/job/HBase-TRUNK/ws/trunk/hbase-server/target/surefire/surefirebooter2163732737160185473.jar>
<https://builds.apache.org/job/HBase-TRUNK/ws/trunk/hbase-server/target/surefire/surefire6643171395182476326tmp>
<https://builds.apache.org/job/HBase-TRUNK/ws/trunk/hbase-server/target/surefire/surefire_1249136807006708095610tmp>
Running org.apache.hadoop.hbase.catalog.TestCatalogTrackerOnCluster
Tests run: 1, Failures: 0, Errors: 0, Skipped: 0, Time elapsed: 80.267 sec
Forking command line: /bin/sh -c cd <https://builds.apache.org/job/HBase-TRUNK/ws/trunk/hbase-server>
&& /home/jenkins/tools/java/jdk1.6.0_27-32/jre/bin/java -enableassertions -Xmx1900m
-Djava.security.egd=file:/dev/./urandom -jar <https://builds.apache.org/job/HBase-TRUNK/ws/trunk/hbase-server/target/surefire/surefirebooter2742699582137442392.jar>
<https://builds.apache.org/job/HBase-TRUNK/ws/trunk/hbase-server/target/surefire/surefire2410947602582162083tmp>
<https://builds.apache.org/job/HBase-TRUNK/ws/trunk/hbase-server/target/surefire/surefire_125748694814208421887tmp>
Running org.apache.hadoop.hbase.client.TestHCM
Tests run: 7, Failures: 0, Errors: 0, Skipped: 0, Time elapsed: 17.699 sec
Forking command line: /bin/sh -c cd <https://builds.apache.org/job/HBase-TRUNK/ws/trunk/hbase-server>
&& /home/jenkins/tools/java/jdk1.6.0_27-32/jre/bin/java -enableassertions -Xmx1900m
-Djava.security.egd=file:/dev/./urandom -jar <https://builds.apache.org/job/HBase-TRUNK/ws/trunk/hbase-server/target/surefire/surefirebooter4984101360915473904.jar>
<https://builds.apache.org/job/HBase-TRUNK/ws/trunk/hbase-server/target/surefire/surefire3112113713095730484tmp>
<https://builds.apache.org/job/HBase-TRUNK/ws/trunk/hbase-server/target/surefire/surefire_1261107441998788493950tmp>
Running org.apache.hadoop.hbase.client.TestScannerTimeout
Tests run: 4, Failures: 0, Errors: 0, Skipped: 0, Time elapsed: 41.451 sec
Forking command line: /bin/sh -c cd <https://builds.apache.org/job/HBase-TRUNK/ws/trunk/hbase-server>
&& /home/jenkins/tools/java/jdk1.6.0_27-32/jre/bin/java -enableassertions -Xmx1900m
-Djava.security.egd=file:/dev/./urandom -jar <https://builds.apache.org/job/HBase-TRUNK/ws/trunk/hbase-server/target/surefire/surefirebooter6097475680408822772.jar>
<https://builds.apache.org/job/HBase-TRUNK/ws/trunk/hbase-server/target/surefire/surefire1355260674580634423tmp>
<https://builds.apache.org/job/HBase-TRUNK/ws/trunk/hbase-server/target/surefire/surefire_1279221600534119815478tmp>
Running org.apache.hadoop.hbase.client.TestMetaScanner
Tests run: 1, Failures: 0, Errors: 0, Skipped: 0, Time elapsed: 17.31 sec
Forking command line: /bin/sh -c cd <https://builds.apache.org/job/HBase-TRUNK/ws/trunk/hbase-server>
&& /home/jenkins/tools/java/jdk1.6.0_27-32/jre/bin/java -enableassertions -Xmx1900m
-Djava.security.egd=file:/dev/./urandom -jar <https://builds.apache.org/job/HBase-TRUNK/ws/trunk/hbase-server/target/surefire/surefirebooter7152520091559362746.jar>
<https://builds.apache.org/job/HBase-TRUNK/ws/trunk/hbase-server/target/surefire/surefire7311141066851299812tmp>
<https://builds.apache.org/job/HBase-TRUNK/ws/trunk/hbase-server/target/surefire/surefire_128452949397669752721tmp>
Running org.apache.hadoop.hbase.client.TestHTableUtil
Tests run: 2, Failures: 0, Errors: 0, Skipped: 0, Time elapsed: 14.579 sec
Forking command line: /bin/sh -c cd <https://builds.apache.org/job/HBase-TRUNK/ws/trunk/hbase-server>
&& /home/jenkins/tools/java/jdk1.6.0_27-32/jre/bin/java -enableassertions -Xmx1900m
-Djava.security.egd=file:/dev/./urandom -jar <https://builds.apache.org/job/HBase-TRUNK/ws/trunk/hbase-server/target/surefire/surefirebooter4403414932980023213.jar>
<https://builds.apache.org/job/HBase-TRUNK/ws/trunk/hbase-server/target/surefire/surefire1833467783103259252tmp>
<https://builds.apache.org/job/HBase-TRUNK/ws/trunk/hbase-server/target/surefire/surefire_1295467322123703168909tmp>
Running org.apache.hadoop.hbase.client.TestShell
Tests run: 1, Failures: 0, Errors: 0, Skipped: 0, Time elapsed: 110.462 sec
Forking command line: /bin/sh -c cd <https://builds.apache.org/job/HBase-TRUNK/ws/trunk/hbase-server>
&& /home/jenkins/tools/java/jdk1.6.0_27-32/jre/bin/java -enableassertions -Xmx1900m
-Djava.security.egd=file:/dev/./urandom -jar <https://builds.apache.org/job/HBase-TRUNK/ws/trunk/hbase-server/target/surefire/surefirebooter4526037995368168755.jar>
<https://builds.apache.org/job/HBase-TRUNK/ws/trunk/hbase-server/target/surefire/surefire2313948914501422563tmp>
<https://builds.apache.org/job/HBase-TRUNK/ws/trunk/hbase-server/target/surefire/surefire_1301591721127779909888tmp>
Running org.apache.hadoop.hbase.client.TestHTablePool$TestHTableReusablePool
Tests run: 9, Failures: 0, Errors: 0, Skipped: 0, Time elapsed: 5.141 sec
Running org.apache.hadoop.hbase.client.TestMetaMigrationRemovingHTD
Tests run: 3, Failures: 0, Errors: 0, Skipped: 0, Time elapsed: 27.083 sec
Forking command line: /bin/sh -c cd <https://builds.apache.org/job/HBase-TRUNK/ws/trunk/hbase-server>
&& /home/jenkins/tools/java/jdk1.6.0_27-32/jre/bin/java -enableassertions -Xmx1900m
-Djava.security.egd=file:/dev/./urandom -jar <https://builds.apache.org/job/HBase-TRUNK/ws/trunk/hbase-server/target/surefire/surefirebooter5636630147632376658.jar>
<https://builds.apache.org/job/HBase-TRUNK/ws/trunk/hbase-server/target/surefire/surefire2678752848500811859tmp>
<https://builds.apache.org/job/HBase-TRUNK/ws/trunk/hbase-server/target/surefire/surefire_1311407299584788601102tmp>
Running org.apache.hadoop.hbase.client.TestHTablePool$TestHTableThreadLocalPool
Tests run: 9, Failures: 0, Errors: 0, Skipped: 0, Time elapsed: 22.512 sec
Forking command line: /bin/sh -c cd <https://builds.apache.org/job/HBase-TRUNK/ws/trunk/hbase-server>
&& /home/jenkins/tools/java/jdk1.6.0_27-32/jre/bin/java -enableassertions -Xmx1900m
-Djava.security.egd=file:/dev/./urandom -jar <https://builds.apache.org/job/HBase-TRUNK/ws/trunk/hbase-server/target/surefire/surefirebooter59798290270603530.jar>
<https://builds.apache.org/job/HBase-TRUNK/ws/trunk/hbase-server/target/surefire/surefire963335187660446239tmp>
<https://builds.apache.org/job/HBase-TRUNK/ws/trunk/hbase-server/target/surefire/surefire_1326770038984556129944tmp>
Running org.apache.hadoop.hbase.client.replication.TestReplicationAdmin
Tests run: 1, Failures: 0, Errors: 0, Skipped: 0, Time elapsed: 0.846 sec
Forking command line: /bin/sh -c cd <https://builds.apache.org/job/HBase-TRUNK/ws/trunk/hbase-server>
&& /home/jenkins/tools/java/jdk1.6.0_27-32/jre/bin/java -enableassertions -Xmx1900m
-Djava.security.egd=file:/dev/./urandom -jar <https://builds.apache.org/job/HBase-TRUNK/ws/trunk/hbase-server/target/surefire/surefirebooter4926104027744598545.jar>
<https://builds.apache.org/job/HBase-TRUNK/ws/trunk/hbase-server/target/surefire/surefire4019774537844860640tmp>
<https://builds.apache.org/job/HBase-TRUNK/ws/trunk/hbase-server/target/surefire/surefire_1331729719462465384645tmp>
Running org.apache.hadoop.hbase.client.TestMultipleTimestamps
Tests run: 8, Failures: 0, Errors: 0, Skipped: 0, Time elapsed: 33.869 sec
Forking command line: /bin/sh -c cd <https://builds.apache.org/job/HBase-TRUNK/ws/trunk/hbase-server>
&& /home/jenkins/tools/java/jdk1.6.0_27-32/jre/bin/java -enableassertions -Xmx1900m
-Djava.security.egd=file:/dev/./urandom -jar <https://builds.apache.org/job/HBase-TRUNK/ws/trunk/hbase-server/target/surefire/surefirebooter7479412296373519747.jar>
<https://builds.apache.org/job/HBase-TRUNK/ws/trunk/hbase-server/target/surefire/surefire8228101061393688922tmp>
<https://builds.apache.org/job/HBase-TRUNK/ws/trunk/hbase-server/target/surefire/surefire_1348679746332201865719tmp>
Running org.apache.hadoop.hbase.client.TestMultiParallel
Tests run: 11, Failures: 0, Errors: 0, Skipped: 0, Time elapsed: 42.565 sec
Forking command line: /bin/sh -c cd <https://builds.apache.org/job/HBase-TRUNK/ws/trunk/hbase-server>
&& /home/jenkins/tools/java/jdk1.6.0_27-32/jre/bin/java -enableassertions -Xmx1900m
-Djava.security.egd=file:/dev/./urandom -jar <https://builds.apache.org/job/HBase-TRUNK/ws/trunk/hbase-server/target/surefire/surefirebooter4922342846790013506.jar>
<https://builds.apache.org/job/HBase-TRUNK/ws/trunk/hbase-server/target/surefire/surefire922581597847053820tmp>
<https://builds.apache.org/job/HBase-TRUNK/ws/trunk/hbase-server/target/surefire/surefire_1358725670744678708089tmp>
Running org.apache.hadoop.hbase.client.TestFromClientSide
Tests run: 56, Failures: 0, Errors: 0, Skipped: 3, Time elapsed: 184.699 sec
Forking command line: /bin/sh -c cd <https://builds.apache.org/job/HBase-TRUNK/ws/trunk/hbase-server>
&& /home/jenkins/tools/java/jdk1.6.0_27-32/jre/bin/java -enableassertions -Xmx1900m
-Djava.security.egd=file:/dev/./urandom -jar <https://builds.apache.org/job/HBase-TRUNK/ws/trunk/hbase-server/target/surefire/surefirebooter777891345310132388.jar>
<https://builds.apache.org/job/HBase-TRUNK/ws/trunk/hbase-server/target/surefire/surefire2138989218870198050tmp>
<https://builds.apache.org/job/HBase-TRUNK/ws/trunk/hbase-server/target/surefire/surefire_1364357868801726594155tmp>
Running org.apache.hadoop.hbase.rest.TestGzipFilter
Tests run: 3, Failures: 0, Errors: 0, Skipped: 0, Time elapsed: 15.631 sec
Forking command line: /bin/sh -c cd <https://builds.apache.org/job/HBase-TRUNK/ws/trunk/hbase-server>
&& /home/jenkins/tools/java/jdk1.6.0_27-32/jre/bin/java -enableassertions -Xmx1900m
-Djava.security.egd=file:/dev/./urandom -jar <https://builds.apache.org/job/HBase-TRUNK/ws/trunk/hbase-server/target/surefire/surefirebooter7904357337966539453.jar>
<https://builds.apache.org/job/HBase-TRUNK/ws/trunk/hbase-server/target/surefire/surefire1712308067056837098tmp>
<https://builds.apache.org/job/HBase-TRUNK/ws/trunk/hbase-server/target/surefire/surefire_1374715336432653420758tmp>
Running org.apache.hadoop.hbase.constraint.TestConstraint
Tests run: 5, Failures: 0, Errors: 0, Skipped: 0, Time elapsed: 39.383 sec
Forking command line: /bin/sh -c cd <https://builds.apache.org/job/HBase-TRUNK/ws/trunk/hbase-server>
&& /home/jenkins/tools/java/jdk1.6.0_27-32/jre/bin/java -enableassertions -Xmx1900m
-Djava.security.egd=file:/dev/./urandom -jar <https://builds.apache.org/job/HBase-TRUNK/ws/trunk/hbase-server/target/surefire/surefirebooter849904619145786204.jar>
<https://builds.apache.org/job/HBase-TRUNK/ws/trunk/hbase-server/target/surefire/surefire4503760838689891205tmp>
<https://builds.apache.org/job/HBase-TRUNK/ws/trunk/hbase-server/target/surefire/surefire_138525105929158973778tmp>
Running org.apache.hadoop.hbase.rest.TestMultiRowResource
Tests run: 3, Failures: 0, Errors: 0, Skipped: 0, Time elapsed: 19.057 sec
Forking command line: /bin/sh -c cd <https://builds.apache.org/job/HBase-TRUNK/ws/trunk/hbase-server>
&& /home/jenkins/tools/java/jdk1.6.0_27-32/jre/bin/java -enableassertions -Xmx1900m
-Djava.security.egd=file:/dev/./urandom -jar <https://builds.apache.org/job/HBase-TRUNK/ws/trunk/hbase-server/target/surefire/surefirebooter1947787523789326118.jar>
<https://builds.apache.org/job/HBase-TRUNK/ws/trunk/hbase-server/target/surefire/surefire5608291459576071790tmp>
<https://builds.apache.org/job/HBase-TRUNK/ws/trunk/hbase-server/target/surefire/surefire_1392030532264951643242tmp>
Running org.apache.hadoop.hbase.rest.TestScannersWithFilters
Tests run: 10, Failures: 0, Errors: 0, Skipped: 0, Time elapsed: 18.028 sec
Forking command line: /bin/sh -c cd <https://builds.apache.org/job/HBase-TRUNK/ws/trunk/hbase-server>
&& /home/jenkins/tools/java/jdk1.6.0_27-32/jre/bin/java -enableassertions -Xmx1900m
-Djava.security.egd=file:/dev/./urandom -jar <https://builds.apache.org/job/HBase-TRUNK/ws/trunk/hbase-server/target/surefire/surefirebooter4680781738606392243.jar>
<https://builds.apache.org/job/HBase-TRUNK/ws/trunk/hbase-server/target/surefire/surefire6078460988071193321tmp>
<https://builds.apache.org/job/HBase-TRUNK/ws/trunk/hbase-server/target/surefire/surefire_1405177495413133137193tmp>
Running org.apache.hadoop.hbase.rest.TestRowResource
Tests run: 11, Failures: 0, Errors: 0, Skipped: 0, Time elapsed: 17.084 sec
Forking command line: /bin/sh -c cd <https://builds.apache.org/job/HBase-TRUNK/ws/trunk/hbase-server>
&& /home/jenkins/tools/java/jdk1.6.0_27-32/jre/bin/java -enableassertions -Xmx1900m
-Djava.security.egd=file:/dev/./urandom -jar <https://builds.apache.org/job/HBase-TRUNK/ws/trunk/hbase-server/target/surefire/surefirebooter5202714040850759767.jar>
<https://builds.apache.org/job/HBase-TRUNK/ws/trunk/hbase-server/target/surefire/surefire1811830172378221098tmp>
<https://builds.apache.org/job/HBase-TRUNK/ws/trunk/hbase-server/target/surefire/surefire_1418499360138229159785tmp>
Running org.apache.hadoop.hbase.rest.client.TestRemoteAdmin
Tests run: 1, Failures: 0, Errors: 0, Skipped: 0, Time elapsed: 18.267 sec
Forking command line: /bin/sh -c cd <https://builds.apache.org/job/HBase-TRUNK/ws/trunk/hbase-server>
&& /home/jenkins/tools/java/jdk1.6.0_27-32/jre/bin/java -enableassertions -Xmx1900m
-Djava.security.egd=file:/dev/./urandom -jar <https://builds.apache.org/job/HBase-TRUNK/ws/trunk/hbase-server/target/surefire/surefirebooter6849673506945475162.jar>
<https://builds.apache.org/job/HBase-TRUNK/ws/trunk/hbase-server/target/surefire/surefire1189504759141347690tmp>
<https://builds.apache.org/job/HBase-TRUNK/ws/trunk/hbase-server/target/surefire/surefire_1425380660915680945418tmp>
Running org.apache.hadoop.hbase.rest.client.TestRemoteTable
Tests run: 3, Failures: 0, Errors: 0, Skipped: 0, Time elapsed: 16.407 sec
Forking command line: /bin/sh -c cd <https://builds.apache.org/job/HBase-TRUNK/ws/trunk/hbase-server>
&& /home/jenkins/tools/java/jdk1.6.0_27-32/jre/bin/java -enableassertions -Xmx1900m
-Djava.security.egd=file:/dev/./urandom -jar <https://builds.apache.org/job/HBase-TRUNK/ws/trunk/hbase-server/target/surefire/surefirebooter1782090035441118745.jar>
<https://builds.apache.org/job/HBase-TRUNK/ws/trunk/hbase-server/target/surefire/surefire3247301579943981784tmp>
<https://builds.apache.org/job/HBase-TRUNK/ws/trunk/hbase-server/target/surefire/surefire_1435134112774844443876tmp>
Running org.apache.hadoop.hbase.rest.TestVersionResource
Tests run: 7, Failures: 0, Errors: 0, Skipped: 0, Time elapsed: 12.269 sec
Forking command line: /bin/sh -c cd <https://builds.apache.org/job/HBase-TRUNK/ws/trunk/hbase-server>
&& /home/jenkins/tools/java/jdk1.6.0_27-32/jre/bin/java -enableassertions -Xmx1900m
-Djava.security.egd=file:/dev/./urandom -jar <https://builds.apache.org/job/HBase-TRUNK/ws/trunk/hbase-server/target/surefire/surefirebooter725402212650561391.jar>
<https://builds.apache.org/job/HBase-TRUNK/ws/trunk/hbase-server/target/surefire/surefire6449303904631029758tmp>
<https://builds.apache.org/job/HBase-TRUNK/ws/trunk/hbase-server/target/surefire/surefire_144171395369325645617tmp>
Running org.apache.hadoop.hbase.rest.TestScannerResource
Tests run: 5, Failures: 0, Errors: 0, Skipped: 0, Time elapsed: 31.047 sec
Forking command line: /bin/sh -c cd <https://builds.apache.org/job/HBase-TRUNK/ws/trunk/hbase-server>
&& /home/jenkins/tools/java/jdk1.6.0_27-32/jre/bin/java -enableassertions -Xmx1900m
-Djava.security.egd=file:/dev/./urandom -jar <https://builds.apache.org/job/HBase-TRUNK/ws/trunk/hbase-server/target/surefire/surefirebooter7443221822968635507.jar>
<https://builds.apache.org/job/HBase-TRUNK/ws/trunk/hbase-server/target/surefire/surefire8690669655757761919tmp>
<https://builds.apache.org/job/HBase-TRUNK/ws/trunk/hbase-server/target/surefire/surefire_1456678834900046549687tmp>
Running org.apache.hadoop.hbase.rest.TestTableResource
Tests run: 8, Failures: 0, Errors: 0, Skipped: 0, Time elapsed: 23.862 sec
Forking command line: /bin/sh -c cd <https://builds.apache.org/job/HBase-TRUNK/ws/trunk/hbase-server>
&& /home/jenkins/tools/java/jdk1.6.0_27-32/jre/bin/java -enableassertions -Xmx1900m
-Djava.security.egd=file:/dev/./urandom -jar <https://builds.apache.org/job/HBase-TRUNK/ws/trunk/hbase-server/target/surefire/surefirebooter1453460627240722000.jar>
<https://builds.apache.org/job/HBase-TRUNK/ws/trunk/hbase-server/target/surefire/surefire5683135778479528233tmp>
<https://builds.apache.org/job/HBase-TRUNK/ws/trunk/hbase-server/target/surefire/surefire_1463443862351516006419tmp>
Running org.apache.hadoop.hbase.rest.TestStatusResource
Tests run: 2, Failures: 0, Errors: 0, Skipped: 0, Time elapsed: 11.81 sec
Forking command line: /bin/sh -c cd <https://builds.apache.org/job/HBase-TRUNK/ws/trunk/hbase-server>
&& /home/jenkins/tools/java/jdk1.6.0_27-32/jre/bin/java -enableassertions -Xmx1900m
-Djava.security.egd=file:/dev/./urandom -jar <https://builds.apache.org/job/HBase-TRUNK/ws/trunk/hbase-server/target/surefire/surefirebooter3187309353930232845.jar>
<https://builds.apache.org/job/HBase-TRUNK/ws/trunk/hbase-server/target/surefire/surefire8540394507414060276tmp>
<https://builds.apache.org/job/HBase-TRUNK/ws/trunk/hbase-server/target/surefire/surefire_1473159884874979428346tmp>
Running org.apache.hadoop.hbase.rest.TestSchemaResource
Tests run: 2, Failures: 0, Errors: 0, Skipped: 0, Time elapsed: 20.042 sec
Forking command line: /bin/sh -c cd <https://builds.apache.org/job/HBase-TRUNK/ws/trunk/hbase-server>
&& /home/jenkins/tools/java/jdk1.6.0_27-32/jre/bin/java -enableassertions -Xmx1900m
-Djava.security.egd=file:/dev/./urandom -jar <https://builds.apache.org/job/HBase-TRUNK/ws/trunk/hbase-server/target/surefire/surefirebooter8726962764982411612.jar>
<https://builds.apache.org/job/HBase-TRUNK/ws/trunk/hbase-server/target/surefire/surefire4864247655749911087tmp>
<https://builds.apache.org/job/HBase-TRUNK/ws/trunk/hbase-server/target/surefire/surefire_1484474873009568855823tmp>
Running org.apache.hadoop.hbase.mapreduce.TestTableInputFormatScan
Tests run: 12, Failures: 0, Errors: 0, Skipped: 0, Time elapsed: 597.179 sec
Forking command line: /bin/sh -c cd <https://builds.apache.org/job/HBase-TRUNK/ws/trunk/hbase-server>
&& /home/jenkins/tools/java/jdk1.6.0_27-32/jre/bin/java -enableassertions -Xmx1900m
-Djava.security.egd=file:/dev/./urandom -jar <https://builds.apache.org/job/HBase-TRUNK/ws/trunk/hbase-server/target/surefire/surefirebooter588701487881559682.jar>
<https://builds.apache.org/job/HBase-TRUNK/ws/trunk/hbase-server/target/surefire/surefire5014414672131822646tmp>
<https://builds.apache.org/job/HBase-TRUNK/ws/trunk/hbase-server/target/surefire/surefire_1491930708890588843381tmp>
Running org.apache.hadoop.hbase.io.encoding.TestLoadAndSwitchEncodeOnDisk
Tests run: 1, Failures: 0, Errors: 0, Skipped: 0, Time elapsed: 28.041 sec
Forking command line: /bin/sh -c cd <https://builds.apache.org/job/HBase-TRUNK/ws/trunk/hbase-server>
&& /home/jenkins/tools/java/jdk1.6.0_27-32/jre/bin/java -enableassertions -Xmx1900m
-Djava.security.egd=file:/dev/./urandom -jar <https://builds.apache.org/job/HBase-TRUNK/ws/trunk/hbase-server/target/surefire/surefirebooter2076547939002715808.jar>
<https://builds.apache.org/job/HBase-TRUNK/ws/trunk/hbase-server/target/surefire/surefire1595510505485897338tmp>
<https://builds.apache.org/job/HBase-TRUNK/ws/trunk/hbase-server/target/surefire/surefire_150246454440694728025tmp>
Running org.apache.hadoop.hbase.client.TestAdmin
Tests run: 39, Failures: 0, Errors: 0, Skipped: 0, Time elapsed: 193.827 sec
Forking command line: /bin/sh -c cd <https://builds.apache.org/job/HBase-TRUNK/ws/trunk/hbase-server>
&& /home/jenkins/tools/java/jdk1.6.0_27-32/jre/bin/java -enableassertions -Xmx1900m
-Djava.security.egd=file:/dev/./urandom -jar <https://builds.apache.org/job/HBase-TRUNK/ws/trunk/hbase-server/target/surefire/surefirebooter1916941547133592901.jar>
<https://builds.apache.org/job/HBase-TRUNK/ws/trunk/hbase-server/target/surefire/surefire1134074755777082264tmp>
<https://builds.apache.org/job/HBase-TRUNK/ws/trunk/hbase-server/target/surefire/surefire_1513497681833616363136tmp>
Running org.apache.hadoop.hbase.io.encoding.TestEncodedSeekers
Tests run: 8, Failures: 0, Errors: 0, Skipped: 0, Time elapsed: 32.69 sec
Forking command line: /bin/sh -c cd <https://builds.apache.org/job/HBase-TRUNK/ws/trunk/hbase-server>
&& /home/jenkins/tools/java/jdk1.6.0_27-32/jre/bin/java -enableassertions -Xmx1900m
-Djava.security.egd=file:/dev/./urandom -jar <https://builds.apache.org/job/HBase-TRUNK/ws/trunk/hbase-server/target/surefire/surefirebooter1485887596531917648.jar>
<https://builds.apache.org/job/HBase-TRUNK/ws/trunk/hbase-server/target/surefire/surefire9204215452152404389tmp>
<https://builds.apache.org/job/HBase-TRUNK/ws/trunk/hbase-server/target/surefire/surefire_1528825581505503681171tmp>
Running org.apache.hadoop.hbase.thrift.TestThriftServer
Tests run: 1, Failures: 0, Errors: 0, Skipped: 0, Time elapsed: 85.381 sec
Forking command line: /bin/sh -c cd <https://builds.apache.org/job/HBase-TRUNK/ws/trunk/hbase-server>
&& /home/jenkins/tools/java/jdk1.6.0_27-32/jre/bin/java -enableassertions -Xmx1900m
-Djava.security.egd=file:/dev/./urandom -jar <https://builds.apache.org/job/HBase-TRUNK/ws/trunk/hbase-server/target/surefire/surefirebooter1044724773041135194.jar>
<https://builds.apache.org/job/HBase-TRUNK/ws/trunk/hbase-server/target/surefire/surefire4921550883856521358tmp>
<https://builds.apache.org/job/HBase-TRUNK/ws/trunk/hbase-server/target/surefire/surefire_1534545510083731226716tmp>
Running org.apache.hadoop.hbase.io.encoding.TestBufferedDataBlockEncoder
Tests run: 1, Failures: 0, Errors: 0, Skipped: 0, Time elapsed: 22.74 sec
Forking command line: /bin/sh -c cd <https://builds.apache.org/job/HBase-TRUNK/ws/trunk/hbase-server>
&& /home/jenkins/tools/java/jdk1.6.0_27-32/jre/bin/java -enableassertions -Xmx1900m
-Djava.security.egd=file:/dev/./urandom -jar <https://builds.apache.org/job/HBase-TRUNK/ws/trunk/hbase-server/target/surefire/surefirebooter5249396379400515780.jar>
<https://builds.apache.org/job/HBase-TRUNK/ws/trunk/hbase-server/target/surefire/surefire4894746942974511670tmp>
<https://builds.apache.org/job/HBase-TRUNK/ws/trunk/hbase-server/target/surefire/surefire_1542453086392890767514tmp>
Running org.apache.hadoop.hbase.io.encoding.TestUpgradeFromHFileV1ToEncoding
Tests run: 1, Failures: 0, Errors: 0, Skipped: 0, Time elapsed: 90.878 sec
Forking command line: /bin/sh -c cd <https://builds.apache.org/job/HBase-TRUNK/ws/trunk/hbase-server>
&& /home/jenkins/tools/java/jdk1.6.0_27-32/jre/bin/java -enableassertions -Xmx1900m
-Djava.security.egd=file:/dev/./urandom -jar <https://builds.apache.org/job/HBase-TRUNK/ws/trunk/hbase-server/target/surefire/surefirebooter4808901813192498793.jar>
<https://builds.apache.org/job/HBase-TRUNK/ws/trunk/hbase-server/target/surefire/surefire5739079248353379787tmp>
<https://builds.apache.org/job/HBase-TRUNK/ws/trunk/hbase-server/target/surefire/surefire_1551804609790646207549tmp>
Running org.apache.hadoop.hbase.io.hfile.TestHFileSeek
Tests run: 1, Failures: 0, Errors: 0, Skipped: 0, Time elapsed: 8.154 sec
Forking command line: /bin/sh -c cd <https://builds.apache.org/job/HBase-TRUNK/ws/trunk/hbase-server>
&& /home/jenkins/tools/java/jdk1.6.0_27-32/jre/bin/java -enableassertions -Xmx1900m
-Djava.security.egd=file:/dev/./urandom -jar <https://builds.apache.org/job/HBase-TRUNK/ws/trunk/hbase-server/target/surefire/surefirebooter7823775599661161367.jar>
<https://builds.apache.org/job/HBase-TRUNK/ws/trunk/hbase-server/target/surefire/surefire3416765254979982841tmp>
<https://builds.apache.org/job/HBase-TRUNK/ws/trunk/hbase-server/target/surefire/surefire_1569161933106503183448tmp>
Running org.apache.hadoop.hbase.io.encoding.TestDataBlockEncoders
Tests run: 12, Failures: 0, Errors: 0, Skipped: 0, Time elapsed: 111.543 sec
Forking command line: /bin/sh -c cd <https://builds.apache.org/job/HBase-TRUNK/ws/trunk/hbase-server>
&& /home/jenkins/tools/java/jdk1.6.0_27-32/jre/bin/java -enableassertions -Xmx1900m
-Djava.security.egd=file:/dev/./urandom -jar <https://builds.apache.org/job/HBase-TRUNK/ws/trunk/hbase-server/target/surefire/surefirebooter2746232398325983182.jar>
<https://builds.apache.org/job/HBase-TRUNK/ws/trunk/hbase-server/target/surefire/surefire7913665732100914636tmp>
<https://builds.apache.org/job/HBase-TRUNK/ws/trunk/hbase-server/target/surefire/surefire_15728538167309924425tmp>
Running org.apache.hadoop.hbase.io.hfile.slab.TestSlabCache
Tests run: 7, Failures: 0, Errors: 0, Skipped: 0, Time elapsed: 18.097 sec
Forking command line: /bin/sh -c cd <https://builds.apache.org/job/HBase-TRUNK/ws/trunk/hbase-server>
&& /home/jenkins/tools/java/jdk1.6.0_27-32/jre/bin/java -enableassertions -Xmx1900m
-Djava.security.egd=file:/dev/./urandom -jar <https://builds.apache.org/job/HBase-TRUNK/ws/trunk/hbase-server/target/surefire/surefirebooter149856340388936641.jar>
<https://builds.apache.org/job/HBase-TRUNK/ws/trunk/hbase-server/target/surefire/surefire3469373264862209053tmp>
<https://builds.apache.org/job/HBase-TRUNK/ws/trunk/hbase-server/target/surefire/surefire_1584288298329917572439tmp>
Running org.apache.hadoop.hbase.io.hfile.TestHFileBlockIndex
Tests run: 10, Failures: 0, Errors: 0, Skipped: 0, Time elapsed: 10.345 sec
Forking command line: /bin/sh -c cd <https://builds.apache.org/job/HBase-TRUNK/ws/trunk/hbase-server>
&& /home/jenkins/tools/java/jdk1.6.0_27-32/jre/bin/java -enableassertions -Xmx1900m
-Djava.security.egd=file:/dev/./urandom -jar <https://builds.apache.org/job/HBase-TRUNK/ws/trunk/hbase-server/target/surefire/surefirebooter173136374325768568.jar>
<https://builds.apache.org/job/HBase-TRUNK/ws/trunk/hbase-server/target/surefire/surefire2079494170227129985tmp>
<https://builds.apache.org/job/HBase-TRUNK/ws/trunk/hbase-server/target/surefire/surefire_1595473297006960674675tmp>
Running org.apache.hadoop.hbase.io.hfile.slab.TestSingleSizeCache
Tests run: 5, Failures: 0, Errors: 0, Skipped: 0, Time elapsed: 30.136 sec
Forking command line: /bin/sh -c cd <https://builds.apache.org/job/HBase-TRUNK/ws/trunk/hbase-server>
&& /home/jenkins/tools/java/jdk1.6.0_27-32/jre/bin/java -enableassertions -Xmx1900m
-Djava.security.egd=file:/dev/./urandom -jar <https://builds.apache.org/job/HBase-TRUNK/ws/trunk/hbase-server/target/surefire/surefirebooter2735270225686255182.jar>
<https://builds.apache.org/job/HBase-TRUNK/ws/trunk/hbase-server/target/surefire/surefire7885709537090184605tmp>
<https://builds.apache.org/job/HBase-TRUNK/ws/trunk/hbase-server/target/surefire/surefire_1609019445109369273387tmp>
Running org.apache.hadoop.hbase.io.hfile.TestHFilePerformance
Tests run: 1, Failures: 0, Errors: 0, Skipped: 0, Time elapsed: 6.765 sec
Forking command line: /bin/sh -c cd <https://builds.apache.org/job/HBase-TRUNK/ws/trunk/hbase-server>
&& /home/jenkins/tools/java/jdk1.6.0_27-32/jre/bin/java -enableassertions -Xmx1900m
-Djava.security.egd=file:/dev/./urandom -jar <https://builds.apache.org/job/HBase-TRUNK/ws/trunk/hbase-server/target/surefire/surefirebooter6463569699673163486.jar>
<https://builds.apache.org/job/HBase-TRUNK/ws/trunk/hbase-server/target/surefire/surefire6408735680211999518tmp>
<https://builds.apache.org/job/HBase-TRUNK/ws/trunk/hbase-server/target/surefire/surefire_1615678363328490935815tmp>
Running org.apache.hadoop.hbase.io.hfile.TestForceCacheImportantBlocks
Tests run: 4, Failures: 0, Errors: 0, Skipped: 0, Time elapsed: 52.322 sec
Forking command line: /bin/sh -c cd <https://builds.apache.org/job/HBase-TRUNK/ws/trunk/hbase-server>
&& /home/jenkins/tools/java/jdk1.6.0_27-32/jre/bin/java -enableassertions -Xmx1900m
-Djava.security.egd=file:/dev/./urandom -jar <https://builds.apache.org/job/HBase-TRUNK/ws/trunk/hbase-server/target/surefire/surefirebooter2756702039873913663.jar>
<https://builds.apache.org/job/HBase-TRUNK/ws/trunk/hbase-server/target/surefire/surefire804338371364439055tmp>
<https://builds.apache.org/job/HBase-TRUNK/ws/trunk/hbase-server/target/surefire/surefire_1625582557841712344350tmp>
Running org.apache.hadoop.hbase.io.hfile.TestScannerSelectionUsingTTL
Tests run: 6, Failures: 0, Errors: 0, Skipped: 0, Time elapsed: 61.206 sec
Forking command line: /bin/sh -c cd <https://builds.apache.org/job/HBase-TRUNK/ws/trunk/hbase-server>
&& /home/jenkins/tools/java/jdk1.6.0_27-32/jre/bin/java -enableassertions -Xmx1900m
-Djava.security.egd=file:/dev/./urandom -jar <https://builds.apache.org/job/HBase-TRUNK/ws/trunk/hbase-server/target/surefire/surefirebooter1441952275542924003.jar>
<https://builds.apache.org/job/HBase-TRUNK/ws/trunk/hbase-server/target/surefire/surefire513068993471930864tmp>
<https://builds.apache.org/job/HBase-TRUNK/ws/trunk/hbase-server/target/surefire/surefire_1632180501481821789557tmp>
Running org.apache.hadoop.hbase.io.encoding.TestChangingEncoding
Tests run: 4, Failures: 0, Errors: 0, Skipped: 0, Time elapsed: 264 sec
Forking command line: /bin/sh -c cd <https://builds.apache.org/job/HBase-TRUNK/ws/trunk/hbase-server>
&& /home/jenkins/tools/java/jdk1.6.0_27-32/jre/bin/java -enableassertions -Xmx1900m
-Djava.security.egd=file:/dev/./urandom -jar <https://builds.apache.org/job/HBase-TRUNK/ws/trunk/hbase-server/target/surefire/surefirebooter7534038498044664862.jar>
<https://builds.apache.org/job/HBase-TRUNK/ws/trunk/hbase-server/target/surefire/surefire4036662875309474697tmp>
<https://builds.apache.org/job/HBase-TRUNK/ws/trunk/hbase-server/target/surefire/surefire_164289657313093067156tmp>
Running org.apache.hadoop.hbase.io.hfile.TestHFileBlock
Tests run: 16, Failures: 0, Errors: 0, Skipped: 0, Time elapsed: 48.373 sec
Forking command line: /bin/sh -c cd <https://builds.apache.org/job/HBase-TRUNK/ws/trunk/hbase-server>
&& /home/jenkins/tools/java/jdk1.6.0_27-32/jre/bin/java -enableassertions -Xmx1900m
-Djava.security.egd=file:/dev/./urandom -jar <https://builds.apache.org/job/HBase-TRUNK/ws/trunk/hbase-server/target/surefire/surefirebooter5520132748091525553.jar>
<https://builds.apache.org/job/HBase-TRUNK/ws/trunk/hbase-server/target/surefire/surefire5744409313241553522tmp>
<https://builds.apache.org/job/HBase-TRUNK/ws/trunk/hbase-server/target/surefire/surefire_1657202953199470061575tmp>
Running org.apache.hadoop.hbase.TestClusterBootOrder
Tests run: 2, Failures: 0, Errors: 0, Skipped: 0, Time elapsed: 26.476 sec
Forking command line: /bin/sh -c cd <https://builds.apache.org/job/HBase-TRUNK/ws/trunk/hbase-server>
&& /home/jenkins/tools/java/jdk1.6.0_27-32/jre/bin/java -enableassertions -Xmx1900m
-Djava.security.egd=file:/dev/./urandom -jar <https://builds.apache.org/job/HBase-TRUNK/ws/trunk/hbase-server/target/surefire/surefirebooter5002320318101288414.jar>
<https://builds.apache.org/job/HBase-TRUNK/ws/trunk/hbase-server/target/surefire/surefire5562198824263798544tmp>
<https://builds.apache.org/job/HBase-TRUNK/ws/trunk/hbase-server/target/surefire/surefire_1668429611990688318548tmp>
Running org.apache.hadoop.hbase.io.hfile.TestCacheOnWrite
Tests run: 36, Failures: 0, Errors: 0, Skipped: 0, Time elapsed: 47.156 sec
Forking command line: /bin/sh -c cd <https://builds.apache.org/job/HBase-TRUNK/ws/trunk/hbase-server>
&& /home/jenkins/tools/java/jdk1.6.0_27-32/jre/bin/java -enableassertions -Xmx1900m
-Djava.security.egd=file:/dev/./urandom -jar <https://builds.apache.org/job/HBase-TRUNK/ws/trunk/hbase-server/target/surefire/surefirebooter1360665880428373681.jar>
<https://builds.apache.org/job/HBase-TRUNK/ws/trunk/hbase-server/target/surefire/surefire3387690896131158717tmp>
<https://builds.apache.org/job/HBase-TRUNK/ws/trunk/hbase-server/target/surefire/surefire_1676422242406549056222tmp>
Running org.apache.hadoop.hbase.replication.regionserver.TestReplicationSourceManager
Tests run: 1, Failures: 0, Errors: 0, Skipped: 0, Time elapsed: 1.019 sec
Forking command line: /bin/sh -c cd <https://builds.apache.org/job/HBase-TRUNK/ws/trunk/hbase-server>
&& /home/jenkins/tools/java/jdk1.6.0_27-32/jre/bin/java -enableassertions -Xmx1900m
-Djava.security.egd=file:/dev/./urandom -jar <https://builds.apache.org/job/HBase-TRUNK/ws/trunk/hbase-server/target/surefire/surefirebooter7152868640606894867.jar>
<https://builds.apache.org/job/HBase-TRUNK/ws/trunk/hbase-server/target/surefire/surefire3203891413089973744tmp>
<https://builds.apache.org/job/HBase-TRUNK/ws/trunk/hbase-server/target/surefire/surefire_1684126497923629239695tmp>
Running org.apache.hadoop.hbase.avro.TestAvroServer
Tests run: 3, Failures: 0, Errors: 0, Skipped: 0, Time elapsed: 27.15 sec
Forking command line: /bin/sh -c cd <https://builds.apache.org/job/HBase-TRUNK/ws/trunk/hbase-server>
&& /home/jenkins/tools/java/jdk1.6.0_27-32/jre/bin/java -enableassertions -Xmx1900m
-Djava.security.egd=file:/dev/./urandom -jar <https://builds.apache.org/job/HBase-TRUNK/ws/trunk/hbase-server/target/surefire/surefirebooter2031849668069351770.jar>
<https://builds.apache.org/job/HBase-TRUNK/ws/trunk/hbase-server/target/surefire/surefire8305837808659488272tmp>
<https://builds.apache.org/job/HBase-TRUNK/ws/trunk/hbase-server/target/surefire/surefire_169384890732153285883tmp>
Running org.apache.hadoop.hbase.replication.regionserver.TestReplicationSink
Tests run: 5, Failures: 0, Errors: 0, Skipped: 0, Time elapsed: 30.771 sec
Forking command line: /bin/sh -c cd <https://builds.apache.org/job/HBase-TRUNK/ws/trunk/hbase-server>
&& /home/jenkins/tools/java/jdk1.6.0_27-32/jre/bin/java -enableassertions -Xmx1900m
-Djava.security.egd=file:/dev/./urandom -jar <https://builds.apache.org/job/HBase-TRUNK/ws/trunk/hbase-server/target/surefire/surefirebooter6655257072464527541.jar>
<https://builds.apache.org/job/HBase-TRUNK/ws/trunk/hbase-server/target/surefire/surefire7368131028604769638tmp>
<https://builds.apache.org/job/HBase-TRUNK/ws/trunk/hbase-server/target/surefire/surefire_1703484969657014232449tmp>
Running org.apache.hadoop.hbase.replication.TestReplicationSource
Tests run: 1, Failures: 0, Errors: 0, Skipped: 0, Time elapsed: 2.228 sec
Forking command line: /bin/sh -c cd <https://builds.apache.org/job/HBase-TRUNK/ws/trunk/hbase-server>
&& /home/jenkins/tools/java/jdk1.6.0_27-32/jre/bin/java -enableassertions -Xmx1900m
-Djava.security.egd=file:/dev/./urandom -jar <https://builds.apache.org/job/HBase-TRUNK/ws/trunk/hbase-server/target/surefire/surefirebooter5400665027930531006.jar>
<https://builds.apache.org/job/HBase-TRUNK/ws/trunk/hbase-server/target/surefire/surefire665803757540041003tmp>
<https://builds.apache.org/job/HBase-TRUNK/ws/trunk/hbase-server/target/surefire/surefire_1719001298895556766670tmp>
Running org.apache.hadoop.hbase.replication.TestReplicationPeer
Tests run: 1, Failures: 0, Errors: 0, Skipped: 0, Time elapsed: 1.403 sec
Forking command line: /bin/sh -c cd <https://builds.apache.org/job/HBase-TRUNK/ws/trunk/hbase-server>
&& /home/jenkins/tools/java/jdk1.6.0_27-32/jre/bin/java -enableassertions -Xmx1900m
-Djava.security.egd=file:/dev/./urandom -jar <https://builds.apache.org/job/HBase-TRUNK/ws/trunk/hbase-server/target/surefire/surefirebooter6626203220959029705.jar>
<https://builds.apache.org/job/HBase-TRUNK/ws/trunk/hbase-server/target/surefire/surefire8020918966886124173tmp>
<https://builds.apache.org/job/HBase-TRUNK/ws/trunk/hbase-server/target/surefire/surefire_1728597178802749174179tmp>
Running org.apache.hadoop.hbase.replication.TestReplicationZookeeper
Tests run: 1, Failures: 0, Errors: 0, Skipped: 0, Time elapsed: 0.576 sec
Forking command line: /bin/sh -c cd <https://builds.apache.org/job/HBase-TRUNK/ws/trunk/hbase-server>
&& /home/jenkins/tools/java/jdk1.6.0_27-32/jre/bin/java -enableassertions -Xmx1900m
-Djava.security.egd=file:/dev/./urandom -jar <https://builds.apache.org/job/HBase-TRUNK/ws/trunk/hbase-server/target/surefire/surefirebooter722732426723205723.jar>
<https://builds.apache.org/job/HBase-TRUNK/ws/trunk/hbase-server/target/surefire/surefire4385433285140100277tmp>
<https://builds.apache.org/job/HBase-TRUNK/ws/trunk/hbase-server/target/surefire/surefire_1736955432370696418311tmp>
Running org.apache.hadoop.hbase.replication.TestMultiSlaveReplication
Tests run: 1, Failures: 0, Errors: 0, Skipped: 0, Time elapsed: 67.416 sec
Forking command line: /bin/sh -c cd <https://builds.apache.org/job/HBase-TRUNK/ws/trunk/hbase-server>
&& /home/jenkins/tools/java/jdk1.6.0_27-32/jre/bin/java -enableassertions -Xmx1900m
-Djava.security.egd=file:/dev/./urandom -jar <https://builds.apache.org/job/HBase-TRUNK/ws/trunk/hbase-server/target/surefire/surefirebooter7493751556916189129.jar>
<https://builds.apache.org/job/HBase-TRUNK/ws/trunk/hbase-server/target/surefire/surefire3797871874605598080tmp>
<https://builds.apache.org/job/HBase-TRUNK/ws/trunk/hbase-server/target/surefire/surefire_1742620660789142991382tmp>
Running org.apache.hadoop.hbase.ipc.TestDelayedRpc
Tests run: 4, Failures: 0, Errors: 0, Skipped: 0, Time elapsed: 2.358 sec
Forking command line: /bin/sh -c cd <https://builds.apache.org/job/HBase-TRUNK/ws/trunk/hbase-server>
&& /home/jenkins/tools/java/jdk1.6.0_27-32/jre/bin/java -enableassertions -Xmx1900m
-Djava.security.egd=file:/dev/./urandom -jar <https://builds.apache.org/job/HBase-TRUNK/ws/trunk/hbase-server/target/surefire/surefirebooter4052366531497388055.jar>
<https://builds.apache.org/job/HBase-TRUNK/ws/trunk/hbase-server/target/surefire/surefire7217311006144805837tmp>
<https://builds.apache.org/job/HBase-TRUNK/ws/trunk/hbase-server/target/surefire/surefire_17549949798005045874tmp>
Running org.apache.hadoop.hbase.replication.TestMasterReplication
Tests run: 2, Failures: 0, Errors: 0, Skipped: 0, Time elapsed: 62.653 sec
Forking command line: /bin/sh -c cd <https://builds.apache.org/job/HBase-TRUNK/ws/trunk/hbase-server>
&& /home/jenkins/tools/java/jdk1.6.0_27-32/jre/bin/java -enableassertions -Xmx1900m
-Djava.security.egd=file:/dev/./urandom -jar <https://builds.apache.org/job/HBase-TRUNK/ws/trunk/hbase-server/target/surefire/surefirebooter2545897333661165302.jar>
<https://builds.apache.org/job/HBase-TRUNK/ws/trunk/hbase-server/target/surefire/surefire9134256986732620804tmp>
<https://builds.apache.org/job/HBase-TRUNK/ws/trunk/hbase-server/target/surefire/surefire_1767231709441415013485tmp>
Running org.apache.hadoop.hbase.TestZooKeeper
Tests run: 9, Failures: 0, Errors: 0, Skipped: 0, Time elapsed: 25.873 sec
Running org.apache.hadoop.hbase.thrift.TestThriftServerCmdLine
Tests run: 20, Failures: 0, Errors: 0, Skipped: 0, Time elapsed: 474.822 sec
Running org.apache.hadoop.hbase.TestHBaseTestingUtility
Tests run: 7, Failures: 0, Errors: 0, Skipped: 0, Time elapsed: 63.088 sec
Running org.apache.hadoop.hbase.replication.TestReplication
Tests run: 10, Failures: 0, Errors: 0, Skipped: 0, Time elapsed: 152.148 sec

Results :

Tests run: 1000, Failures: 0, Errors: 0, Skipped: 9

[INFO] ------------------------------------------------------------------------
[INFO] Reactor Summary:
[INFO] 
[INFO] HBase ............................................. SUCCESS [2.201s]
[INFO] HBase - Server .................................... FAILURE [39:44.501s]
[INFO] HBase - Assembly .................................. SKIPPED
[INFO] HBase - Site ...................................... SKIPPED
[INFO] ------------------------------------------------------------------------
[INFO] BUILD FAILURE
[INFO] ------------------------------------------------------------------------
[INFO] Total time: 39:47.052s
[INFO] Finished at: Wed May 30 16:46:15 UTC 2012
[INFO] Final Memory: 63M/298M
[INFO] ------------------------------------------------------------------------
[ERROR] Failed to execute goal org.apache.maven.plugins:maven-surefire-plugin:2.12-TRUNK-HBASE-2:test
(secondPartTestsExecution) on project hbase-server: Failure or timeout -> [Help 1]
org.apache.maven.lifecycle.LifecycleExecutionException: Failed to execute goal org.apache.maven.plugins:maven-surefire-plugin:2.12-TRUNK-HBASE-2:test
(secondPartTestsExecution) on project hbase-server: Failure or timeout
	at org.apache.maven.lifecycle.internal.MojoExecutor.execute(MojoExecutor.java:217)
	at org.apache.maven.lifecycle.internal.MojoExecutor.execute(MojoExecutor.java:153)
	at org.apache.maven.lifecycle.internal.MojoExecutor.execute(MojoExecutor.java:145)
	at org.apache.maven.lifecycle.internal.LifecycleModuleBuilder.buildProject(LifecycleModuleBuilder.java:84)
	at org.apache.maven.lifecycle.internal.LifecycleModuleBuilder.buildProject(LifecycleModuleBuilder.java:59)
	at org.apache.maven.lifecycle.internal.LifecycleStarter.singleThreadedBuild(LifecycleStarter.java:183)
	at org.apache.maven.lifecycle.internal.LifecycleStarter.execute(LifecycleStarter.java:161)
	at org.apache.maven.DefaultMaven.doExecute(DefaultMaven.java:319)
	at org.apache.maven.DefaultMaven.execute(DefaultMaven.java:156)
	at org.apache.maven.cli.MavenCli.execute(MavenCli.java:537)
	at org.apache.maven.cli.MavenCli.doMain(MavenCli.java:196)
	at org.apache.maven.cli.MavenCli.main(MavenCli.java:141)
	at sun.reflect.NativeMethodAccessorImpl.invoke0(Native Method)
	at sun.reflect.NativeMethodAccessorImpl.invoke(NativeMethodAccessorImpl.java:39)
	at sun.reflect.DelegatingMethodAccessorImpl.invoke(DelegatingMethodAccessorImpl.java:25)
	at java.lang.reflect.Method.invoke(Method.java:597)
	at org.codehaus.plexus.classworlds.launcher.Launcher.launchEnhanced(Launcher.java:290)
	at org.codehaus.plexus.classworlds.launcher.Launcher.launch(Launcher.java:230)
	at org.codehaus.plexus.classworlds.launcher.Launcher.mainWithExitCode(Launcher.java:409)
	at org.codehaus.plexus.classworlds.launcher.Launcher.main(Launcher.java:352)
Caused by: org.apache.maven.plugin.MojoExecutionException: Failure or timeout
	at org.apache.maven.plugin.surefire.SurefirePlugin.assertNoFailureOrTimeout(SurefirePlugin.java:643)
	at org.apache.maven.plugin.surefire.SurefirePlugin.handleSummary(SurefirePlugin.java:624)
	at org.apache.maven.plugin.surefire.AbstractSurefireMojo.executeAfterPreconditionsChecked(AbstractSurefireMojo.java:137)
	at org.apache.maven.plugin.surefire.AbstractSurefireMojo.execute(AbstractSurefireMojo.java:98)
	at org.apache.maven.plugin.DefaultBuildPluginManager.executeMojo(DefaultBuildPluginManager.java:101)
	at org.apache.maven.lifecycle.internal.MojoExecutor.execute(MojoExecutor.java:209)
	... 19 more
[ERROR] 
[ERROR] 
[ERROR] For more information about the errors and possible solutions, please read the following
articles:
[ERROR] [Help 1] http://cwiki.apache.org/confluence/display/MAVEN/MojoExecutionException
[ERROR] 
[ERROR] After correcting the problems, you can resume the build with the command
[ERROR]   mvn <goals> -rf :hbase-server
Build step 'Invoke top-level Maven targets' marked build as failure
Archiving artifacts
Recording test results
Updating HBASE-5533
Updating HBASE-6131

Mime
View raw message