hbase-dev mailing list archives

Site index · List index
Message view « Date » · « Thread »
Top « Date » · « Thread »
From Apache Jenkins Server <jenk...@builds.apache.org>
Subject Build failed in Jenkins: HBase-0.92 #412
Date Fri, 18 May 2012 19:16:03 GMT
See <https://builds.apache.org/job/HBase-0.92/412/changes>

Changes:

[apurtell] HBASE-6011. Addendum to support master mocking (Ram)

------------------------------------------
[...truncated 1816 lines...]
Tests run: 11, Failures: 0, Errors: 0, Skipped: 0, Time elapsed: 1.829 sec
Running org.apache.hadoop.hbase.regionserver.TestRpcMetrics
Tests run: 1, Failures: 0, Errors: 0, Skipped: 0, Time elapsed: 1.927 sec
Running org.apache.hadoop.hbase.regionserver.TestCompoundBloomFilter
Tests run: 3, Failures: 0, Errors: 0, Skipped: 0, Time elapsed: 21.016 sec
Running org.apache.hadoop.hbase.regionserver.TestBlocksRead
Tests run: 3, Failures: 0, Errors: 0, Skipped: 0, Time elapsed: 1.109 sec
Running org.apache.hadoop.hbase.regionserver.TestKeyValueScanFixture
Tests run: 1, Failures: 0, Errors: 0, Skipped: 0, Time elapsed: 0.121 sec
Running org.apache.hadoop.hbase.regionserver.TestExplicitColumnTracker
Tests run: 4, Failures: 0, Errors: 0, Skipped: 0, Time elapsed: 0.891 sec
Running org.apache.hadoop.hbase.regionserver.TestStoreFile
Tests run: 8, Failures: 0, Errors: 0, Skipped: 0, Time elapsed: 1.711 sec
Running org.apache.hadoop.hbase.regionserver.TestWideScanner
Tests run: 1, Failures: 0, Errors: 0, Skipped: 0, Time elapsed: 1.918 sec
Running org.apache.hadoop.hbase.regionserver.TestQueryMatcher
Tests run: 4, Failures: 0, Errors: 0, Skipped: 0, Time elapsed: 0.541 sec
Running org.apache.hadoop.hbase.regionserver.TestReadWriteConsistencyControl
Tests run: 1, Failures: 0, Errors: 0, Skipped: 0, Time elapsed: 10.112 sec
Running org.apache.hadoop.hbase.regionserver.TestResettingCounters
Tests run: 1, Failures: 0, Errors: 0, Skipped: 0, Time elapsed: 0.818 sec
Running org.apache.hadoop.hbase.regionserver.TestStoreScanner
Tests run: 14, Failures: 0, Errors: 0, Skipped: 0, Time elapsed: 0.143 sec
Running org.apache.hadoop.hbase.regionserver.TestMinVersions
Tests run: 6, Failures: 0, Errors: 0, Skipped: 0, Time elapsed: 1.297 sec
Running org.apache.hadoop.hbase.regionserver.TestMemStoreLAB
Tests run: 3, Failures: 0, Errors: 0, Skipped: 0, Time elapsed: 1.453 sec
Running org.apache.hadoop.hbase.regionserver.TestSplitTransactionOnCluster
Tests run: 6, Failures: 0, Errors: 0, Skipped: 0, Time elapsed: 67.62 sec
Running org.apache.hadoop.hbase.regionserver.TestSplitTransaction
Tests run: 7, Failures: 0, Errors: 0, Skipped: 0, Time elapsed: 4.036 sec
Running org.apache.hadoop.hbase.regionserver.TestScanDeleteTracker
Tests run: 6, Failures: 0, Errors: 0, Skipped: 0, Time elapsed: 0.605 sec
Running org.apache.hadoop.hbase.regionserver.TestCompactSelection
Tests run: 1, Failures: 0, Errors: 0, Skipped: 0, Time elapsed: 0.735 sec
Running org.apache.hadoop.hbase.regionserver.TestStoreFileBlockCacheSummary
Tests run: 1, Failures: 0, Errors: 0, Skipped: 0, Time elapsed: 22.784 sec
Running org.apache.hadoop.hbase.regionserver.TestMemStore
Tests run: 21, Failures: 0, Errors: 0, Skipped: 0, Time elapsed: 27.863 sec
Running org.apache.hadoop.hbase.regionserver.TestGetClosestAtOrBefore
Tests run: 3, Failures: 0, Errors: 0, Skipped: 0, Time elapsed: 1.291 sec
Running org.apache.hadoop.hbase.regionserver.TestScanWithBloomError
Tests run: 3, Failures: 0, Errors: 0, Skipped: 0, Time elapsed: 1.132 sec
Running org.apache.hadoop.hbase.regionserver.TestKeyValueSkipListSet
Tests run: 4, Failures: 0, Errors: 0, Skipped: 0, Time elapsed: 0.123 sec
Running org.apache.hadoop.hbase.regionserver.TestKeyValueHeap
Tests run: 3, Failures: 0, Errors: 0, Skipped: 0, Time elapsed: 0.511 sec
Running org.apache.hadoop.hbase.regionserver.TestMXBean
Tests run: 1, Failures: 0, Errors: 0, Skipped: 0, Time elapsed: 16.279 sec
Running org.apache.hadoop.hbase.regionserver.TestScanner
Tests run: 7, Failures: 0, Errors: 0, Skipped: 0, Time elapsed: 4.911 sec
Running org.apache.hadoop.hbase.regionserver.TestRegionSplitPolicy
Tests run: 3, Failures: 0, Errors: 0, Skipped: 0, Time elapsed: 0.708 sec
Running org.apache.hadoop.hbase.regionserver.TestMultiColumnScanner
Tests run: 6, Failures: 0, Errors: 0, Skipped: 0, Time elapsed: 18.548 sec
Running org.apache.hadoop.hbase.regionserver.TestHRegionInfo
Tests run: 6, Failures: 0, Errors: 0, Skipped: 0, Time elapsed: 0.627 sec
Running org.apache.hadoop.hbase.regionserver.handler.TestCloseRegionHandler
Tests run: 3, Failures: 0, Errors: 0, Skipped: 0, Time elapsed: 1.269 sec
Running org.apache.hadoop.hbase.regionserver.handler.TestOpenRegionHandler
Tests run: 3, Failures: 0, Errors: 0, Skipped: 0, Time elapsed: 1.104 sec
Running org.apache.hadoop.hbase.regionserver.TestHRegionServerBulkLoad
Tests run: 1, Failures: 0, Errors: 0, Skipped: 0, Time elapsed: 50.877 sec
Running org.apache.hadoop.hbase.regionserver.TestRSKilledWhenMasterInitializing
Tests run: 1, Failures: 0, Errors: 0, Skipped: 0, Time elapsed: 74.232 sec
Running org.apache.hadoop.hbase.regionserver.TestMasterAddressManager
Tests run: 1, Failures: 0, Errors: 0, Skipped: 0, Time elapsed: 0.604 sec
Running org.apache.hadoop.hbase.regionserver.TestSplitLogWorker
Tests run: 5, Failures: 0, Errors: 0, Skipped: 0, Time elapsed: 2.248 sec
Running org.apache.hadoop.hbase.regionserver.TestFSErrorsExposed
Tests run: 3, Failures: 0, Errors: 0, Skipped: 0, Time elapsed: 32.639 sec
Running org.apache.hadoop.hbase.TestHServerAddress
Tests run: 6, Failures: 0, Errors: 0, Skipped: 0, Time elapsed: 0.07 sec
Running org.apache.hadoop.hbase.filter.TestColumnRangeFilter
Tests run: 1, Failures: 0, Errors: 0, Skipped: 0, Time elapsed: 23.48 sec
Running org.apache.hadoop.hbase.filter.TestColumnPaginationFilter
Tests run: 1, Failures: 0, Errors: 0, Skipped: 0, Time elapsed: 0.117 sec
Running org.apache.hadoop.hbase.filter.TestPageFilter
Tests run: 2, Failures: 0, Errors: 0, Skipped: 0, Time elapsed: 0.03 sec
Running org.apache.hadoop.hbase.filter.TestParseFilter
Tests run: 33, Failures: 0, Errors: 0, Skipped: 0, Time elapsed: 0.335 sec
Running org.apache.hadoop.hbase.filter.TestRandomRowFilter
Tests run: 2, Failures: 0, Errors: 0, Skipped: 0, Time elapsed: 0.568 sec
Running org.apache.hadoop.hbase.filter.TestPrefixFilter
Tests run: 3, Failures: 0, Errors: 0, Skipped: 0, Time elapsed: 0.112 sec
Running org.apache.hadoop.hbase.filter.TestBitComparator
Tests run: 3, Failures: 0, Errors: 0, Skipped: 0, Time elapsed: 0.052 sec
Running org.apache.hadoop.hbase.filter.TestDependentColumnFilter
Tests run: 2, Failures: 0, Errors: 0, Skipped: 0, Time elapsed: 0.851 sec
Running org.apache.hadoop.hbase.filter.TestSingleColumnValueFilter
Tests run: 2, Failures: 0, Errors: 0, Skipped: 0, Time elapsed: 0.16 sec
Running org.apache.hadoop.hbase.filter.TestInclusiveStopFilter
Tests run: 2, Failures: 0, Errors: 0, Skipped: 0, Time elapsed: 0.11 sec
Running org.apache.hadoop.hbase.filter.TestFilterList
Tests run: 5, Failures: 0, Errors: 0, Skipped: 0, Time elapsed: 0.257 sec
Running org.apache.hadoop.hbase.filter.TestFilter
Tests run: 18, Failures: 0, Errors: 0, Skipped: 0, Time elapsed: 2.575 sec
Running org.apache.hadoop.hbase.filter.TestMultipleColumnPrefixFilter
Tests run: 3, Failures: 0, Errors: 0, Skipped: 0, Time elapsed: 3.899 sec
Running org.apache.hadoop.hbase.filter.TestColumnPrefixFilter
Tests run: 2, Failures: 0, Errors: 0, Skipped: 0, Time elapsed: 3.098 sec
Running org.apache.hadoop.hbase.filter.TestSingleColumnValueExcludeFilter
Tests run: 1, Failures: 0, Errors: 0, Skipped: 0, Time elapsed: 0.133 sec
Running org.apache.hadoop.hbase.TestGlobalMemStoreSize
Tests run: 1, Failures: 0, Errors: 0, Skipped: 0, Time elapsed: 18.151 sec
Running org.apache.hadoop.hbase.TestHBaseTestingUtility
Tests run: 7, Failures: 0, Errors: 0, Skipped: 0, Time elapsed: 95.303 sec
Running org.apache.hadoop.hbase.security.TestUser
Tests run: 3, Failures: 0, Errors: 0, Skipped: 0, Time elapsed: 0.457 sec
Running org.apache.hadoop.hbase.TestMultiVersions
Tests run: 3, Failures: 0, Errors: 0, Skipped: 0, Time elapsed: 33.689 sec
Running org.apache.hadoop.hbase.TestRegionRebalancing
Tests run: 1, Failures: 0, Errors: 0, Skipped: 0, Time elapsed: 46.932 sec
Running org.apache.hadoop.hbase.replication.TestReplication
Tests run: 8, Failures: 0, Errors: 1, Skipped: 0, Time elapsed: 103.63 sec <<< FAILURE!
Running org.apache.hadoop.hbase.replication.TestMasterReplication
Tests run: 2, Failures: 0, Errors: 0, Skipped: 0, Time elapsed: 91.01 sec
Running org.apache.hadoop.hbase.replication.TestReplicationZookeeper
Tests run: 1, Failures: 0, Errors: 0, Skipped: 0, Time elapsed: 0.61 sec
Running org.apache.hadoop.hbase.replication.regionserver.TestReplicationSourceManager
Tests run: 1, Failures: 0, Errors: 0, Skipped: 0, Time elapsed: 0.954 sec
Running org.apache.hadoop.hbase.replication.regionserver.TestReplicationSink
Tests run: 5, Failures: 0, Errors: 0, Skipped: 0, Time elapsed: 22.011 sec
Running org.apache.hadoop.hbase.replication.TestReplicationPeer
Tests run: 1, Failures: 0, Errors: 0, Skipped: 0, Time elapsed: 25.584 sec
Running org.apache.hadoop.hbase.replication.TestMultiSlaveReplication
Tests run: 1, Failures: 0, Errors: 0, Skipped: 0, Time elapsed: 57.209 sec
Running org.apache.hadoop.hbase.replication.TestReplicationSource
Tests run: 1, Failures: 0, Errors: 0, Skipped: 0, Time elapsed: 2.461 sec
Running org.apache.hadoop.hbase.avro.TestAvroServer
Tests run: 3, Failures: 0, Errors: 0, Skipped: 0, Time elapsed: 33.969 sec
Running org.apache.hadoop.hbase.avro.TestAvroUtil
Tests run: 1, Failures: 0, Errors: 0, Skipped: 0, Time elapsed: 0.45 sec
Running org.apache.hadoop.hbase.TestAcidGuarantees
Tests run: 3, Failures: 0, Errors: 0, Skipped: 0, Time elapsed: 115.266 sec
Running org.apache.hadoop.hbase.TestKeyValue
Tests run: 13, Failures: 0, Errors: 0, Skipped: 0, Time elapsed: 0.134 sec
Running org.apache.hadoop.hbase.TestLocalHBaseCluster
Tests run: 1, Failures: 0, Errors: 0, Skipped: 0, Time elapsed: 10.482 sec
Running org.apache.hadoop.hbase.coprocessor.TestRegionServerCoprocessorExceptionWithRemove
Tests run: 1, Failures: 0, Errors: 0, Skipped: 0, Time elapsed: 23.422 sec
Running org.apache.hadoop.hbase.coprocessor.TestRegionObserverInterface
Tests run: 5, Failures: 0, Errors: 0, Skipped: 0, Time elapsed: 33.017 sec
Running org.apache.hadoop.hbase.coprocessor.TestCoprocessorInterface
Tests run: 1, Failures: 0, Errors: 0, Skipped: 0, Time elapsed: 4.064 sec
Running org.apache.hadoop.hbase.coprocessor.TestMasterObserver
Tests run: 3, Failures: 0, Errors: 0, Skipped: 0, Time elapsed: 35.412 sec
Running org.apache.hadoop.hbase.coprocessor.TestCoprocessorEndpoint
Tests run: 3, Failures: 0, Errors: 0, Skipped: 0, Time elapsed: 35.8 sec
Running org.apache.hadoop.hbase.coprocessor.TestWALObserver
Tests run: 3, Failures: 0, Errors: 0, Skipped: 0, Time elapsed: 21.508 sec
Running org.apache.hadoop.hbase.coprocessor.TestRegionObserverBypass
Tests run: 2, Failures: 0, Errors: 0, Skipped: 0, Time elapsed: 19.231 sec
Running org.apache.hadoop.hbase.coprocessor.TestMasterCoprocessorExceptionWithAbort
Tests run: 1, Failures: 0, Errors: 0, Skipped: 0, Time elapsed: 16.917 sec
Running org.apache.hadoop.hbase.coprocessor.TestRegionServerCoprocessorExceptionWithAbort
Tests run: 1, Failures: 0, Errors: 0, Skipped: 0, Time elapsed: 19.459 sec
Running org.apache.hadoop.hbase.coprocessor.TestAggregateProtocol
Tests run: 44, Failures: 0, Errors: 0, Skipped: 0, Time elapsed: 20.109 sec
Running org.apache.hadoop.hbase.coprocessor.TestMasterCoprocessorExceptionWithRemove
Tests run: 1, Failures: 0, Errors: 0, Skipped: 0, Time elapsed: 19.046 sec
Running org.apache.hadoop.hbase.coprocessor.TestRegionObserverStacking
Tests run: 1, Failures: 0, Errors: 0, Skipped: 0, Time elapsed: 0.733 sec
Running org.apache.hadoop.hbase.coprocessor.TestClassLoading
Tests run: 6, Failures: 0, Errors: 0, Skipped: 0, Time elapsed: 37.24 sec
Running org.apache.hadoop.hbase.mapred.TestTableMapReduce
Tests run: 1, Failures: 0, Errors: 1, Skipped: 0, Time elapsed: 60.644 sec <<< FAILURE!
Running org.apache.hadoop.hbase.mapred.TestTableInputFormat
Tests run: 6, Failures: 0, Errors: 0, Skipped: 0, Time elapsed: 30.154 sec
Running org.apache.hadoop.hbase.TestServerName
Tests run: 4, Failures: 0, Errors: 0, Skipped: 0, Time elapsed: 0.14 sec
Running org.apache.hadoop.hbase.master.TestOpenedRegionHandler
Tests run: 2, Failures: 0, Errors: 0, Skipped: 0, Time elapsed: 24.197 sec
Running org.apache.hadoop.hbase.master.TestActiveMasterManager
Tests run: 2, Failures: 0, Errors: 0, Skipped: 0, Time elapsed: 0.831 sec
Running org.apache.hadoop.hbase.master.TestMasterFailover
Tests run: 4, Failures: 0, Errors: 0, Skipped: 0, Time elapsed: 93.633 sec
Running org.apache.hadoop.hbase.master.TestMasterRestartAfterDisablingTable
Tests run: 1, Failures: 0, Errors: 0, Skipped: 0, Time elapsed: 26.967 sec
Running org.apache.hadoop.hbase.master.TestCatalogJanitor
Tests run: 4, Failures: 0, Errors: 0, Skipped: 0, Time elapsed: 7.329 sec
Running org.apache.hadoop.hbase.master.TestRollingRestart
Tests run: 1, Failures: 0, Errors: 0, Skipped: 0, Time elapsed: 70.897 sec
Running org.apache.hadoop.hbase.master.TestMasterTransitions
Tests run: 3, Failures: 0, Errors: 0, Skipped: 3, Time elapsed: 21.377 sec
Running org.apache.hadoop.hbase.master.TestRestartCluster
Tests run: 2, Failures: 0, Errors: 0, Skipped: 0, Time elapsed: 49.063 sec
Running org.apache.hadoop.hbase.master.TestMasterStatusServlet
Tests run: 5, Failures: 0, Errors: 0, Skipped: 0, Time elapsed: 0.981 sec
Running org.apache.hadoop.hbase.master.TestClockSkewDetection
Tests run: 1, Failures: 0, Errors: 0, Skipped: 0, Time elapsed: 0.245 sec
Running org.apache.hadoop.hbase.master.TestDefaultLoadBalancer
Tests run: 4, Failures: 0, Errors: 0, Skipped: 0, Time elapsed: 1.425 sec
Running org.apache.hadoop.hbase.master.TestHMasterRPCException
Tests run: 1, Failures: 0, Errors: 0, Skipped: 0, Time elapsed: 1.063 sec
Running org.apache.hadoop.hbase.master.TestDistributedLogSplitting
Tests run: 4, Failures: 0, Errors: 0, Skipped: 0, Time elapsed: 116.004 sec
Running org.apache.hadoop.hbase.master.TestMXBean
Tests run: 1, Failures: 0, Errors: 0, Skipped: 0, Time elapsed: 19.586 sec
Running org.apache.hadoop.hbase.master.TestMaster
Tests run: 1, Failures: 0, Errors: 0, Skipped: 0, Time elapsed: 21.704 sec
Running org.apache.hadoop.hbase.master.TestMasterShutdown
Tests run: 1, Failures: 0, Errors: 0, Skipped: 0, Time elapsed: 18.774 sec
Running org.apache.hadoop.hbase.master.TestSplitLogManager
Tests run: 12, Failures: 0, Errors: 0, Skipped: 0, Time elapsed: 14.216 sec
Running org.apache.hadoop.hbase.master.TestDeadServer
Tests run: 1, Failures: 0, Errors: 0, Skipped: 0, Time elapsed: 0.14 sec
Running org.apache.hadoop.hbase.master.TestLogsCleaner
Tests run: 1, Failures: 0, Errors: 0, Skipped: 0, Time elapsed: 3.019 sec
Running org.apache.hadoop.hbase.master.TestMasterZKSessionRecovery
Tests run: 2, Failures: 0, Errors: 0, Skipped: 0, Time elapsed: 30.274 sec
Running org.apache.hadoop.hbase.master.TestZKBasedOpenCloseRegion
Tests run: 4, Failures: 0, Errors: 0, Skipped: 0, Time elapsed: 25.07 sec

Results :

Failed tests:   testMRIncrementalLoad(org.apache.hadoop.hbase.mapreduce.TestHFileOutputFormat)
  testMRIncrementalLoadWithSplit(org.apache.hadoop.hbase.mapreduce.TestHFileOutputFormat)
  testMROnTable(org.apache.hadoop.hbase.mapreduce.TestImportTsv)
  testMROnTableWithCustomMapper(org.apache.hadoop.hbase.mapreduce.TestImportTsv)

Tests in error: 
  testVerifyRepJob(org.apache.hadoop.hbase.replication.TestReplication): org/apache/commons/io/FileUtils
  testMultiRegionTable(org.apache.hadoop.hbase.mapred.TestTableMapReduce): Job failed!

Tests run: 1123, Failures: 4, Errors: 2, Skipped: 8

[INFO] ------------------------------------------------------------------------
[INFO] BUILD FAILURE
[INFO] ------------------------------------------------------------------------
[INFO] Total time: 1:59:20.885s
[INFO] Finished at: Fri May 18 19:15:41 UTC 2012
[INFO] Final Memory: 21M/813M
[INFO] ------------------------------------------------------------------------
[WARNING] The requested profile "runAllTests" could not be activated because it does not exist.
[ERROR] Failed to execute goal org.apache.maven.plugins:maven-surefire-plugin:2.10:test (default-test)
on project hbase: There are test failures.
[ERROR] 
[ERROR] Please refer to <https://builds.apache.org/job/HBase-0.92/ws/trunk/target/surefire-reports>
for the individual test results.
[ERROR] -> [Help 1]
[ERROR] 
[ERROR] To see the full stack trace of the errors, re-run Maven with the -e switch.
[ERROR] Re-run Maven using the -X switch to enable full debug logging.
[ERROR] 
[ERROR] For more information about the errors and possible solutions, please read the following
articles:
[ERROR] [Help 1] http://cwiki.apache.org/confluence/display/MAVEN/MojoFailureException
Build step 'Invoke top-level Maven targets' marked build as failure
Archiving artifacts
Recording test results
Updating HBASE-6011

Mime
View raw message