hbase-dev mailing list archives

Site index · List index
Message view « Date » · « Thread »
Top « Date » · « Thread »
From Apache Jenkins Server <jenk...@builds.apache.org>
Subject Build failed in Jenkins: HBase-0.92-security #108
Date Fri, 25 May 2012 09:55:38 GMT
See <https://builds.apache.org/job/HBase-0.92-security/108/changes>

Changes:

[apurtell] Amend HBASE-6077. Replace HTML formatting that does not work with Docbook

[apurtell] HBASE-6077. Document the most common secure RPC troubleshooting resolutions

[tedyu] HBASE-6047 Put.has() can't determine result correctly (Alex Newman)

[tedyu] HBASE-6061 Fix ACL "Admin" Table inconsistent permission check (Matteo Bertozzi)

[jmhsieh] HBASE-5757 TableInputFormat should handle as many errors as possible (Jan Lukavsky)

[jmhsieh] HBASE-6044 copytable: remove rs.* parameters

[stack] HBASE-5920 New Compactions Logic can silently prevent user-initiated compactions from
occurring

[stack] HBASE-6054 0.92 failing because of missing commons-io after upgrade to hadoop 1.0.3.

[apurtell] HBASE-6011. Addendum to support master mocking (Ram)

[jmhsieh] HBASE-6013 Polish sharp edges from CopyTable

------------------------------------------
[...truncated 2825 lines...]
Writing <https://builds.apache.org/job/HBase-0.92-security/ws/trunk/target/site/book/developer/developer.html>
for chapter(developer)
[INFO] See <https://builds.apache.org/job/HBase-0.92-security/ws/trunk/target/site/book/developer>
for generated file(s)
[DEBUG] SourceFile: <https://builds.apache.org/job/HBase-0.92-security/ws/trunk/src/docbkx/preface.xml>
[DEBUG] TargetDirectory: <https://builds.apache.org/job/HBase-0.92-security/108/artifact/trunk/target/site/book>
[INFO] Processing input file: preface.xml
[DEBUG] Xerces XInclude mode entered
[INFO] Chunking output.
Writing <https://builds.apache.org/job/HBase-0.92-security/ws/trunk/target/site/book/preface/preface.html>
for preface(preface)
[INFO] See <https://builds.apache.org/job/HBase-0.92-security/ws/trunk/target/site/book/preface>
for generated file(s)
[DEBUG] SourceFile: <https://builds.apache.org/job/HBase-0.92-security/ws/trunk/src/docbkx/ops_mgt.xml>
[DEBUG] TargetDirectory: <https://builds.apache.org/job/HBase-0.92-security/108/artifact/trunk/target/site/book>
[INFO] Processing input file: ops_mgt.xml
[DEBUG] Xerces XInclude mode entered
[INFO] Chunking output.
ERROR: xref linking to trouble has no generated link text.
Error: no ID for constraint linkend: trouble.
ERROR: xref linking to performance has no generated link text.
Error: no ID for constraint linkend: performance.
ERROR: xref linking to configuration has no generated link text.
Error: no ID for constraint linkend: configuration.
ERROR: xref linking to hfile_tool has no generated link text.
Error: no ID for constraint linkend: hfile_tool.
Writing <https://builds.apache.org/job/HBase-0.92-security/ws/trunk/target/site/book/ops_mgt/node.management.html>
for section(node.management)
Writing <https://builds.apache.org/job/HBase-0.92-security/ws/trunk/target/site/book/ops_mgt/hbase_metrics.html>
for section(hbase_metrics)
Writing <https://builds.apache.org/job/HBase-0.92-security/ws/trunk/target/site/book/ops_mgt/ops.monitoring.html>
for section(ops.monitoring)
Writing <https://builds.apache.org/job/HBase-0.92-security/ws/trunk/target/site/book/ops_mgt/cluster_replication.html>
for section(cluster_replication)
Writing <https://builds.apache.org/job/HBase-0.92-security/ws/trunk/target/site/book/ops_mgt/ops.backup.html>
for section(ops.backup)
ERROR: xref linking to keyvalue has no generated link text.
Error: no ID for constraint linkend: keyvalue.
ERROR: xref linking to keysize has no generated link text.
Error: no ID for constraint linkend: keysize.
ERROR: xref linking to regions.arch has no generated link text.
Error: no ID for constraint linkend: regions.arch.
ERROR: xref linking to perf.number.of.regions has no generated link text.
Error: no ID for constraint linkend: perf.number.of.regions.
Writing <https://builds.apache.org/job/HBase-0.92-security/ws/trunk/target/site/book/ops_mgt/ops.capacity.html>
for section(ops.capacity)
Writing <https://builds.apache.org/job/HBase-0.92-security/ws/trunk/target/site/book/ops_mgt/ops_mgt.html>
for chapter(ops_mgt)
[INFO] See <https://builds.apache.org/job/HBase-0.92-security/ws/trunk/target/site/book/ops_mgt>
for generated file(s)
[DEBUG] SourceFile: <https://builds.apache.org/job/HBase-0.92-security/ws/trunk/src/docbkx/performance.xml>
[DEBUG] TargetDirectory: <https://builds.apache.org/job/HBase-0.92-security/108/artifact/trunk/target/site/book>
[INFO] Processing input file: performance.xml
[DEBUG] Xerces XInclude mode entered
[INFO] Chunking output.
Writing <https://builds.apache.org/job/HBase-0.92-security/ws/trunk/target/site/book/performance/perf.network.html>
for section(perf.network)
ERROR: xref linking to trouble.log.gc has no generated link text.
Error: no ID for constraint linkend: trouble.log.gc.
Writing <https://builds.apache.org/job/HBase-0.92-security/ws/trunk/target/site/book/performance/jvm.html>
for section(jvm)
ERROR: xref linking to recommended_configurations has no generated link text.
Error: no ID for constraint linkend: recommended_configurations.
ERROR: xref linking to bigger.regions has no generated link text.
Error: no ID for constraint linkend: bigger.regions.
ERROR: xref linking to arch.regions.size has no generated link text.
Error: no ID for constraint linkend: arch.regions.size.
Error: no ID for constraint linkend: disable.splitting.
ERROR: xref linking to hbase.regionserver.handler.count has no generated link text.
Error: no ID for constraint linkend: hbase.regionserver.handler.count.
ERROR: xref linking to rpc.logging has no generated link text.
Error: no ID for constraint linkend: rpc.logging.
ERROR: xref linking to hfile.block.cache.size has no generated link text.
Error: no ID for constraint linkend: hfile.block.cache.size.
ERROR: xref linking to hbase.regionserver.global.memstore.upperLimit has no generated link
text.
Error: no ID for constraint linkend: hbase.regionserver.global.memstore.upperLimit.
ERROR: xref linking to hbase.regionserver.global.memstore.lowerLimit has no generated link
text.
Error: no ID for constraint linkend: hbase.regionserver.global.memstore.lowerLimit.
ERROR: xref linking to hbase.hstore.blockingStoreFiles has no generated link text.
Error: no ID for constraint linkend: hbase.hstore.blockingStoreFiles.
ERROR: xref linking to hbase.hregion.memstore.block.multiplier has no generated link text.
Error: no ID for constraint linkend: hbase.hregion.memstore.block.multiplier.
Writing <https://builds.apache.org/job/HBase-0.92-security/ws/trunk/target/site/book/performance/perf.configurations.html>
for section(perf.configurations)
ERROR: xref linking to number.of.cfs has no generated link text.
Error: no ID for constraint linkend: number.of.cfs.
ERROR: xref linking to keysize has no generated link text.
Error: no ID for constraint linkend: keysize.
ERROR: xref linking to blooms has no generated link text.
Error: no ID for constraint linkend: blooms.
ERROR: xref linking to store has no generated link text.
Error: no ID for constraint linkend: store.
ERROR: xref linking to block.cache has no generated link text.
Error: no ID for constraint linkend: block.cache.
ERROR: xref linking to compression has no generated link text.
Error: no ID for constraint linkend: compression.
Writing <https://builds.apache.org/job/HBase-0.92-security/ws/trunk/target/site/book/performance/perf.schema.html>
for section(perf.schema)
Error: no ID for constraint linkend: timeseries.
Writing <https://builds.apache.org/job/HBase-0.92-security/ws/trunk/target/site/book/performance/perf.writing.html>
for section(perf.writing)
Writing <https://builds.apache.org/job/HBase-0.92-security/ws/trunk/target/site/book/performance/perf.reading.html>
for section(perf.reading)
ERROR: xref linking to datamodel has no generated link text.
Error: no ID for constraint linkend: datamodel.
ERROR: xref linking to compaction has no generated link text.
Error: no ID for constraint linkend: compaction.
Writing <https://builds.apache.org/job/HBase-0.92-security/ws/trunk/target/site/book/performance/perf.deleting.html>
for section(perf.deleting)
ERROR: xref linking to arch.hdfs has no generated link text.
Error: no ID for constraint linkend: arch.hdfs.
Writing <https://builds.apache.org/job/HBase-0.92-security/ws/trunk/target/site/book/performance/perf.hdfs.html>
for section(perf.hdfs)
Writing <https://builds.apache.org/job/HBase-0.92-security/ws/trunk/target/site/book/performance/perf.ec2.html>
for section(perf.ec2)
Writing <https://builds.apache.org/job/HBase-0.92-security/ws/trunk/target/site/book/performance/performance.html>
for chapter(performance)
[INFO] See <https://builds.apache.org/job/HBase-0.92-security/ws/trunk/target/site/book/performance>
for generated file(s)
[DEBUG] SourceFile: <https://builds.apache.org/job/HBase-0.92-security/ws/trunk/src/docbkx/upgrading.xml>
[DEBUG] TargetDirectory: <https://builds.apache.org/job/HBase-0.92-security/108/artifact/trunk/target/site/book>
[INFO] Processing input file: upgrading.xml
[DEBUG] Xerces XInclude mode entered
[INFO] Chunking output.
ERROR: xref linking to configuration has no generated link text.
Error: no ID for constraint linkend: configuration.
ERROR: xref linking to hbase_default_configurations has no generated link text.
Error: no ID for constraint linkend: hbase_default_configurations.
Writing <https://builds.apache.org/job/HBase-0.92-security/ws/trunk/target/site/book/upgrading/upgrading.html>
for chapter(upgrading)
[INFO] See <https://builds.apache.org/job/HBase-0.92-security/ws/trunk/target/site/book/upgrading>
for generated file(s)
[DEBUG] SourceFile: <https://builds.apache.org/job/HBase-0.92-security/ws/trunk/src/docbkx/external_apis.xml>
[DEBUG] TargetDirectory: <https://builds.apache.org/job/HBase-0.92-security/108/artifact/trunk/target/site/book>
[INFO] Processing input file: external_apis.xml
[DEBUG] Xerces XInclude mode entered
[INFO] Chunking output.
Writing <https://builds.apache.org/job/HBase-0.92-security/ws/trunk/target/site/book/external_apis/rest.html>
for section(rest)
Writing <https://builds.apache.org/job/HBase-0.92-security/ws/trunk/target/site/book/external_apis/thrift.html>
for section(thrift)
Writing <https://builds.apache.org/job/HBase-0.92-security/ws/trunk/target/site/book/external_apis/external_apis.html>
for chapter(external_apis)
[INFO] See <https://builds.apache.org/job/HBase-0.92-security/ws/trunk/target/site/book/external_apis>
for generated file(s)
[DEBUG] SourceFile: <https://builds.apache.org/job/HBase-0.92-security/ws/trunk/src/docbkx/configuration.xml>
[DEBUG] TargetDirectory: <https://builds.apache.org/job/HBase-0.92-security/108/artifact/trunk/target/site/book>
[INFO] Processing input file: configuration.xml
[DEBUG] Xerces XInclude mode entered
[INFO] Chunking output.
ERROR: xref linking to trouble.rs.runtime.filehandles has no generated link text.
Error: no ID for constraint linkend: trouble.rs.runtime.filehandles.
Writing <https://builds.apache.org/job/HBase-0.92-security/ws/trunk/target/site/book/configuration/os.html>
for section(os)
Writing <https://builds.apache.org/job/HBase-0.92-security/ws/trunk/target/site/book/configuration/hadoop.html>
for section(hadoop)
ERROR: xref linking to quickstart has no generated link text.
Error: no ID for constraint linkend: quickstart.
Element xreg in namespace 'http://docbook.org/ns/docbook' encountered in para, but no template
matches.
ERROR: xref linking to shell_exercises has no generated link text.
Error: no ID for constraint linkend: shell_exercises.
Writing <https://builds.apache.org/job/HBase-0.92-security/ws/trunk/target/site/book/configuration/standalone_dist.html>
for section(standalone_dist)
Writing <https://builds.apache.org/job/HBase-0.92-security/ws/trunk/target/site/book/configuration/zookeeper.html>
for section(zookeeper)
Writing <https://builds.apache.org/job/HBase-0.92-security/ws/trunk/target/site/book/configuration/config.files.html>
for section(config.files)
Writing <https://builds.apache.org/job/HBase-0.92-security/ws/trunk/target/site/book/configuration/example_config.html>
for section(example_config)
ERROR: xref linking to compression has no generated link text.
Error: no ID for constraint linkend: compression.
ERROR: xref linking to master.processes.loadbalancer has no generated link text.
Error: no ID for constraint linkend: master.processes.loadbalancer.
Writing <https://builds.apache.org/job/HBase-0.92-security/ws/trunk/target/site/book/configuration/important_configurations.html>
for section(important_configurations)
Writing <https://builds.apache.org/job/HBase-0.92-security/ws/trunk/target/site/book/configuration/config.bloom.html>
for section(config.bloom)
Writing <https://builds.apache.org/job/HBase-0.92-security/ws/trunk/target/site/book/configuration/configuration.html>
for chapter(configuration)
[INFO] See <https://builds.apache.org/job/HBase-0.92-security/ws/trunk/target/site/book/configuration>
for generated file(s)
[DEBUG] SourceFile: <https://builds.apache.org/job/HBase-0.92-security/ws/trunk/src/docbkx/getting_started.xml>
[DEBUG] TargetDirectory: <https://builds.apache.org/job/HBase-0.92-security/108/artifact/trunk/target/site/book>
[INFO] Processing input file: getting_started.xml
[DEBUG] Xerces XInclude mode entered
[INFO] Chunking output.
ERROR: xref linking to configuration has no generated link text.
Error: no ID for constraint linkend: configuration.
ERROR: xref linking to configuration has no generated link text.
Error: no ID for constraint linkend: configuration.
Writing <https://builds.apache.org/job/HBase-0.92-security/ws/trunk/target/site/book/getting_started/quickstart.html>
for section(quickstart)
Writing <https://builds.apache.org/job/HBase-0.92-security/ws/trunk/target/site/book/getting_started/getting_started.html>
for chapter(getting_started)
[INFO] See <https://builds.apache.org/job/HBase-0.92-security/ws/trunk/target/site/book/getting_started>
for generated file(s)
[DEBUG] SourceFile: <https://builds.apache.org/job/HBase-0.92-security/ws/trunk/src/docbkx/shell.xml>
[DEBUG] TargetDirectory: <https://builds.apache.org/job/HBase-0.92-security/108/artifact/trunk/target/site/book>
[INFO] Processing input file: shell.xml
[DEBUG] Xerces XInclude mode entered
[INFO] Chunking output.
ERROR: xref linking to shell_exercises has no generated link text.
Error: no ID for constraint linkend: shell_exercises.
Writing <https://builds.apache.org/job/HBase-0.92-security/ws/trunk/target/site/book/shell/shell_tricks.html>
for section(shell_tricks)
Writing <https://builds.apache.org/job/HBase-0.92-security/ws/trunk/target/site/book/shell/shell.html>
for chapter(shell)
[INFO] See <https://builds.apache.org/job/HBase-0.92-security/ws/trunk/target/site/book/shell>
for generated file(s)
[DEBUG] SourceFile: <https://builds.apache.org/job/HBase-0.92-security/ws/trunk/src/docbkx/book.xml>
[DEBUG] TargetDirectory: <https://builds.apache.org/job/HBase-0.92-security/108/artifact/trunk/target/site/book>
[INFO] Processing input file: book.xml
[DEBUG] Xerces XInclude mode entered
[INFO] Chunking output.
Error on line 539 column 396 of file://<https://builds.apache.org/job/HBase-0.92-security/ws/trunk/src/docbkx/troubleshooting.xml>:
  Error reported by XML parser: The element type "para" must be terminated by the matching
end-tag "</para>".
Error on line 1832 column 87 of file://<https://builds.apache.org/job/HBase-0.92-security/ws/trunk/src/docbkx/book.xml>:
  Error reported by XML parser: Error attempting to parse XML file (href='troubleshooting.xml').
[INFO] ------------------------------------------------------------------------
[INFO] BUILD FAILURE
[INFO] ------------------------------------------------------------------------
[INFO] Total time: 17.131s
[INFO] Finished at: Fri May 25 09:55:33 UTC 2012
[INFO] Final Memory: 15M/217M
[INFO] ------------------------------------------------------------------------
[ERROR] Failed to execute goal com.agilejava.docbkx:docbkx-maven-plugin:2.0.13:generate-html
(multipage) on project hbase: Failed to transform book.xml. org.xml.sax.SAXParseException:
Error attempting to parse XML file (href='troubleshooting.xml'). -> [Help 1]
org.apache.maven.lifecycle.LifecycleExecutionException: Failed to execute goal com.agilejava.docbkx:docbkx-maven-plugin:2.0.13:generate-html
(multipage) on project hbase: Failed to transform book.xml.
	at org.apache.maven.lifecycle.internal.MojoExecutor.execute(MojoExecutor.java:217)
	at org.apache.maven.lifecycle.internal.MojoExecutor.execute(MojoExecutor.java:153)
	at org.apache.maven.lifecycle.internal.MojoExecutor.execute(MojoExecutor.java:145)
	at org.apache.maven.lifecycle.internal.LifecycleModuleBuilder.buildProject(LifecycleModuleBuilder.java:84)
	at org.apache.maven.lifecycle.internal.LifecycleModuleBuilder.buildProject(LifecycleModuleBuilder.java:59)
	at org.apache.maven.lifecycle.internal.LifecycleStarter.singleThreadedBuild(LifecycleStarter.java:183)
	at org.apache.maven.lifecycle.internal.LifecycleStarter.execute(LifecycleStarter.java:161)
	at org.apache.maven.DefaultMaven.doExecute(DefaultMaven.java:319)
	at org.apache.maven.DefaultMaven.execute(DefaultMaven.java:156)
	at org.apache.maven.cli.MavenCli.execute(MavenCli.java:537)
	at org.apache.maven.cli.MavenCli.doMain(MavenCli.java:196)
	at org.apache.maven.cli.MavenCli.main(MavenCli.java:141)
	at sun.reflect.NativeMethodAccessorImpl.invoke0(Native Method)
	at sun.reflect.NativeMethodAccessorImpl.invoke(NativeMethodAccessorImpl.java:39)
	at sun.reflect.DelegatingMethodAccessorImpl.invoke(DelegatingMethodAccessorImpl.java:25)
	at java.lang.reflect.Method.invoke(Method.java:597)
	at org.codehaus.plexus.classworlds.launcher.Launcher.launchEnhanced(Launcher.java:290)
	at org.codehaus.plexus.classworlds.launcher.Launcher.launch(Launcher.java:230)
	at org.codehaus.plexus.classworlds.launcher.Launcher.mainWithExitCode(Launcher.java:409)
	at org.codehaus.plexus.classworlds.launcher.Launcher.main(Launcher.java:352)
Caused by: org.apache.maven.plugin.MojoExecutionException: Failed to transform book.xml.
	at com.agilejava.docbkx.maven.AbstractTransformerMojo.execute(AbstractTransformerMojo.java:179)
	at com.agilejava.docbkx.maven.AbstractHtmlMojo.execute(AbstractHtmlMojo.java:58)
	at org.apache.maven.plugin.DefaultBuildPluginManager.executeMojo(DefaultBuildPluginManager.java:101)
	at org.apache.maven.lifecycle.internal.MojoExecutor.execute(MojoExecutor.java:209)
	... 19 more
Caused by: javax.xml.transform.TransformerException: org.xml.sax.SAXParseException: Error
attempting to parse XML file (href='troubleshooting.xml').
	at com.icl.saxon.om.Builder.build(Builder.java:273)
	at com.icl.saxon.Controller.transform(Controller.java:936)
	at com.agilejava.docbkx.maven.AbstractTransformerMojo.execute(AbstractTransformerMojo.java:163)
	... 22 more
Caused by: org.xml.sax.SAXParseException: Error attempting to parse XML file (href='troubleshooting.xml').
	at org.apache.xerces.util.ErrorHandlerWrapper.createSAXParseException(Unknown Source)
	at org.apache.xerces.util.ErrorHandlerWrapper.fatalError(Unknown Source)
	at org.apache.xerces.impl.XMLErrorReporter.reportError(Unknown Source)
	at org.apache.xerces.impl.XMLErrorReporter.reportError(Unknown Source)
	at org.apache.xerces.xinclude.XIncludeHandler.reportError(Unknown Source)
	at org.apache.xerces.xinclude.XIncludeHandler.reportFatalError(Unknown Source)
	at org.apache.xerces.xinclude.XIncludeHandler.handleIncludeElement(Unknown Source)
	at org.apache.xerces.xinclude.XIncludeHandler.emptyElement(Unknown Source)
	at org.apache.xerces.impl.XMLNSDocumentScannerImpl.scanStartElement(Unknown Source)
	at org.apache.xerces.impl.XMLDocumentFragmentScannerImpl$FragmentContentDispatcher.dispatch(Unknown
Source)
	at org.apache.xerces.impl.XMLDocumentFragmentScannerImpl.scanDocument(Unknown Source)
	at org.apache.xerces.parsers.XML11Configuration.parse(Unknown Source)
	at org.apache.xerces.parsers.XML11Configuration.parse(Unknown Source)
	at org.apache.xerces.parsers.XMLParser.parse(Unknown Source)
	at org.apache.xerces.parsers.AbstractSAXParser.parse(Unknown Source)
	at org.apache.xerces.jaxp.SAXParserImpl$JAXPSAXParser.parse(Unknown Source)
	at org.xml.sax.helpers.XMLFilterImpl.parse(XMLFilterImpl.java:333)
	at com.icl.saxon.om.Builder.build(Builder.java:265)
	... 24 more
[ERROR] 
[ERROR] 
[ERROR] For more information about the errors and possible solutions, please read the following
articles:
[ERROR] [Help 1] http://cwiki.apache.org/confluence/display/MAVEN/MojoExecutionException
Build step 'Invoke top-level Maven targets' marked build as failure
Archiving artifacts
Updating HBASE-6044
Updating HBASE-5757
Updating HBASE-6011
Updating HBASE-6061
Updating HBASE-6013
Updating HBASE-6077
Updating HBASE-6054
Updating HBASE-6047
Updating HBASE-5920
Recording test results

Mime
View raw message