hbase-dev mailing list archives

Site index · List index
Message view « Date » · « Thread »
Top « Date » · « Thread »
From Apache Jenkins Server <jenk...@builds.apache.org>
Subject Build failed in Jenkins: HBase-0.94-security #31
Date Fri, 25 May 2012 09:16:02 GMT
See <https://builds.apache.org/job/HBase-0.94-security/31/changes>

Changes:

[apurtell] Amend HBASE-6077. Replace HTML formatting that does not work with Docbook

------------------------------------------
[...truncated 1895 lines...]
[DEBUG]   (s) outputDir = <https://builds.apache.org/job/HBase-0.94-security/ws/trunk/target/site>
[DEBUG]   (f) transformationSets = [org.codehaus.mojo.xml.transformer.TransformationSet@1875da7]
[DEBUG] -- end configuration --
[DEBUG] Depends <https://builds.apache.org/job/HBase-0.94-security/ws/trunk/pom.xml>:
Fri May 25 08:59:41 UTC 2012
[DEBUG] Depends <https://builds.apache.org/job/HBase-0.94-security/ws/trunk/src/main/xslt/configuration_to_docbook_section.xsl>:
Fri May 25 08:59:41 UTC 2012
[DEBUG] Depends []: Thu Jan 01 00:00:00 UTC 1970
[DEBUG] Depends <https://builds.apache.org/job/HBase-0.94-security/ws/trunk/src/main/resources/hbase-default.xml>:
Fri May 25 08:59:41 UTC 2012
[DEBUG] Produces <https://builds.apache.org/job/HBase-0.94-security/31/artifact/trunk/target/site/hbase-default.xml>:
Thu Jan 01 00:00:00 UTC 1970
[DEBUG] Depends timeStamp: 1337936381000, produces timestamp: 0
[INFO] Transforming file: <https://builds.apache.org/job/HBase-0.94-security/ws/trunk/src/main/resources/hbase-default.xml>
[INFO] Transformed 1 file(s).
[INFO] 
[INFO] --- docbkx-maven-plugin:2.0.13:generate-html (multipage) @ hbase ---
[DEBUG] com.agilejava.docbkx:docbkx-maven-plugin:jar:2.0.13:
[DEBUG]    org.docbook:docbook-xml:jar:4.4:runtime
[DEBUG]    antlr:stringtemplate:jar:2.2:compile
[DEBUG]       antlr:antlr:jar:2.7.2:compile
[DEBUG]    xerces:xercesImpl:jar:2.8.0:runtime
[DEBUG]       xml-apis:xml-apis:jar:1.3.03:compile
[DEBUG]    xerces:xmlParserAPIs:jar:2.6.2:runtime
[DEBUG]    org.apache.xmlgraphics:fop:jar:1.0:compile
[DEBUG]       org.apache.xmlgraphics:xmlgraphics-commons:jar:1.4:compile
[DEBUG]       org.apache.xmlgraphics:batik-svg-dom:jar:1.7:compile
[DEBUG]          org.apache.xmlgraphics:batik-anim:jar:1.7:compile
[DEBUG]          org.apache.xmlgraphics:batik-css:jar:1.7:compile
[DEBUG]          org.apache.xmlgraphics:batik-dom:jar:1.7:compile
[DEBUG]          org.apache.xmlgraphics:batik-parser:jar:1.7:compile
[DEBUG]          org.apache.xmlgraphics:batik-util:jar:1.7:compile
[DEBUG]          xml-apis:xml-apis-ext:jar:1.3.04:compile
[DEBUG]       org.apache.xmlgraphics:batik-bridge:jar:1.7:compile
[DEBUG]          org.apache.xmlgraphics:batik-script:jar:1.7:compile
[DEBUG]             org.apache.xmlgraphics:batik-js:jar:1.7:compile
[DEBUG]          org.apache.xmlgraphics:batik-xml:jar:1.7:compile
[DEBUG]       org.apache.xmlgraphics:batik-awt-util:jar:1.7:compile
[DEBUG]       org.apache.xmlgraphics:batik-gvt:jar:1.7:compile
[DEBUG]       org.apache.xmlgraphics:batik-transcoder:jar:1.7:compile
[DEBUG]          org.apache.xmlgraphics:batik-svggen:jar:1.7:compile
[DEBUG]       org.apache.xmlgraphics:batik-extension:jar:1.7:compile
[DEBUG]       org.apache.xmlgraphics:batik-ext:jar:1.7:compile
[DEBUG]       commons-logging:commons-logging:jar:1.0.4:compile
[DEBUG]       commons-io:commons-io:jar:1.3.1:compile
[DEBUG]       org.apache.avalon.framework:avalon-framework-api:jar:4.3.1:compile
[DEBUG]    org.apache.avalon.framework:avalon-framework-impl:jar:4.3.1:compile
[DEBUG]    xalan:xalan:jar:2.7.0:compile
[DEBUG]    org.apache.maven:maven-plugin-api:jar:2.0:compile
[DEBUG]    org.apache.maven:maven-project:jar:2.0.4:compile
[DEBUG]       org.apache.maven:maven-settings:jar:2.0.4:compile
[DEBUG]       org.apache.maven:maven-profile:jar:2.0.4:compile
[DEBUG]       org.apache.maven:maven-model:jar:2.0.4:compile
[DEBUG]       org.apache.maven:maven-artifact-manager:jar:2.0.4:compile
[DEBUG]          org.apache.maven:maven-repository-metadata:jar:2.0.4:compile
[DEBUG]       org.codehaus.plexus:plexus-utils:jar:1.1:compile
[DEBUG]       org.apache.maven:maven-artifact:jar:2.0.4:compile
[DEBUG]       org.codehaus.plexus:plexus-container-default:jar:1.0-alpha-9:compile
[DEBUG]          junit:junit:jar:3.8.1:compile
[DEBUG]          classworlds:classworlds:jar:1.1-alpha-2:compile
[DEBUG]    com.agilejava.docbkx:docbkx-maven-base:jar:2.0.13:compile
[DEBUG]       commons-el:commons-el:jar:1.0:compile
[DEBUG]       javax.servlet.jsp:jsp-api:jar:2.0:compile
[DEBUG]       jaxen:jaxen:jar:1.0-FCS:compile
[DEBUG]       saxpath:saxpath:jar:1.0-FCS:compile
[DEBUG]       xom:xom:jar:1.1:compile
[DEBUG]       saxon:saxon:jar:6.5.3:compile
[DEBUG]       xml-resolver:xml-resolver:jar:1.1:compile
[DEBUG]       plexus:plexus-utils:jar:1.0.1:compile
[DEBUG]       org.codehaus.plexus:plexus-archiver:jar:1.0-alpha-5:compile
[DEBUG]       org.apache.maven.plugins:maven-antrun-plugin:jar:1.1:compile
[DEBUG]          ant:ant-launcher:jar:1.6.5:runtime
[DEBUG]          ant:ant:jar:1.6.5:compile
[DEBUG]    net.sf.xslthl:xslthl:jar:2.0.1:compile
[DEBUG]    net.sf.docbook:docbook-xsl:zip:ns-resources:1.76.1:compile
[DEBUG]    net.sf.docbook:docbook-xsl-saxon:jar:1.0.0:compile
[DEBUG]    net.sf.docbook:docbook-xsl-webhelpindexer:jar:1.0.0:compile
[DEBUG]       org.apache.lucene:lucene-core:jar:3.0.0:compile
[DEBUG]       org.apache.lucene:lucene-analyzers:jar:3.0.0:compile
[DEBUG]       org.apache.ant:ant:jar:1.7.0:compile
[DEBUG]          org.apache.ant:ant-launcher:jar:1.7.0:compile
[DEBUG] Created new class realm plugin>com.agilejava.docbkx:docbkx-maven-plugin:2.0.13
[DEBUG] Importing foreign packages into class realm plugin>com.agilejava.docbkx:docbkx-maven-plugin:2.0.13
[DEBUG]   Imported:  < maven.api
[DEBUG] Populating class realm plugin>com.agilejava.docbkx:docbkx-maven-plugin:2.0.13
[DEBUG]   Included: com.agilejava.docbkx:docbkx-maven-plugin:jar:2.0.13
[DEBUG]   Included: org.docbook:docbook-xml:jar:4.4
[DEBUG]   Included: antlr:stringtemplate:jar:2.2
[DEBUG]   Included: antlr:antlr:jar:2.7.2
[DEBUG]   Included: xerces:xercesImpl:jar:2.8.0
[DEBUG]   Included: xml-apis:xml-apis:jar:1.3.03
[DEBUG]   Included: xerces:xmlParserAPIs:jar:2.6.2
[DEBUG]   Included: org.apache.xmlgraphics:fop:jar:1.0
[DEBUG]   Included: org.apache.xmlgraphics:xmlgraphics-commons:jar:1.4
[DEBUG]   Included: org.apache.xmlgraphics:batik-svg-dom:jar:1.7
[DEBUG]   Included: org.apache.xmlgraphics:batik-anim:jar:1.7
[DEBUG]   Included: org.apache.xmlgraphics:batik-css:jar:1.7
[DEBUG]   Included: org.apache.xmlgraphics:batik-dom:jar:1.7
[DEBUG]   Included: org.apache.xmlgraphics:batik-parser:jar:1.7
[DEBUG]   Included: org.apache.xmlgraphics:batik-util:jar:1.7
[DEBUG]   Included: xml-apis:xml-apis-ext:jar:1.3.04
[DEBUG]   Included: org.apache.xmlgraphics:batik-bridge:jar:1.7
[DEBUG]   Included: org.apache.xmlgraphics:batik-script:jar:1.7
[DEBUG]   Included: org.apache.xmlgraphics:batik-js:jar:1.7
[DEBUG]   Included: org.apache.xmlgraphics:batik-xml:jar:1.7
[DEBUG]   Included: org.apache.xmlgraphics:batik-awt-util:jar:1.7
[DEBUG]   Included: org.apache.xmlgraphics:batik-gvt:jar:1.7
[DEBUG]   Included: org.apache.xmlgraphics:batik-transcoder:jar:1.7
[DEBUG]   Included: org.apache.xmlgraphics:batik-svggen:jar:1.7
[DEBUG]   Included: org.apache.xmlgraphics:batik-extension:jar:1.7
[DEBUG]   Included: org.apache.xmlgraphics:batik-ext:jar:1.7
[DEBUG]   Included: commons-logging:commons-logging:jar:1.0.4
[DEBUG]   Included: commons-io:commons-io:jar:1.3.1
[DEBUG]   Included: org.apache.avalon.framework:avalon-framework-api:jar:4.3.1
[DEBUG]   Included: org.apache.avalon.framework:avalon-framework-impl:jar:4.3.1
[DEBUG]   Included: xalan:xalan:jar:2.7.0
[DEBUG]   Included: org.codehaus.plexus:plexus-utils:jar:1.1
[DEBUG]   Included: junit:junit:jar:3.8.1
[DEBUG]   Included: com.agilejava.docbkx:docbkx-maven-base:jar:2.0.13
[DEBUG]   Included: commons-el:commons-el:jar:1.0
[DEBUG]   Included: javax.servlet.jsp:jsp-api:jar:2.0
[DEBUG]   Included: jaxen:jaxen:jar:1.0-FCS
[DEBUG]   Included: saxpath:saxpath:jar:1.0-FCS
[DEBUG]   Included: xom:xom:jar:1.1
[DEBUG]   Included: saxon:saxon:jar:6.5.3
[DEBUG]   Included: xml-resolver:xml-resolver:jar:1.1
[DEBUG]   Included: plexus:plexus-utils:jar:1.0.1
[DEBUG]   Included: org.codehaus.plexus:plexus-archiver:jar:1.0-alpha-5
[DEBUG]   Included: org.apache.maven.plugins:maven-antrun-plugin:jar:1.1
[DEBUG]   Included: ant:ant-launcher:jar:1.6.5
[DEBUG]   Included: ant:ant:jar:1.6.5
[DEBUG]   Included: net.sf.xslthl:xslthl:jar:2.0.1
[DEBUG]   Included: net.sf.docbook:docbook-xsl:zip:ns-resources:1.76.1
[DEBUG]   Included: net.sf.docbook:docbook-xsl-saxon:jar:1.0.0
[DEBUG]   Included: net.sf.docbook:docbook-xsl-webhelpindexer:jar:1.0.0
[DEBUG]   Included: org.apache.lucene:lucene-core:jar:3.0.0
[DEBUG]   Included: org.apache.lucene:lucene-analyzers:jar:3.0.0
[DEBUG]   Included: org.apache.ant:ant:jar:1.7.0
[DEBUG]   Included: org.apache.ant:ant-launcher:jar:1.7.0
[DEBUG]   Excluded: org.apache.maven:maven-plugin-api:jar:2.0
[DEBUG]   Excluded: org.apache.maven:maven-project:jar:2.0.4
[DEBUG]   Excluded: org.apache.maven:maven-settings:jar:2.0.4
[DEBUG]   Excluded: org.apache.maven:maven-profile:jar:2.0.4
[DEBUG]   Excluded: org.apache.maven:maven-model:jar:2.0.4
[DEBUG]   Excluded: org.apache.maven:maven-artifact-manager:jar:2.0.4
[DEBUG]   Excluded: org.apache.maven:maven-repository-metadata:jar:2.0.4
[DEBUG]   Excluded: org.apache.maven:maven-artifact:jar:2.0.4
[DEBUG]   Excluded: org.codehaus.plexus:plexus-container-default:jar:1.0-alpha-9
[DEBUG]   Excluded: classworlds:classworlds:jar:1.1-alpha-2
[DEBUG] Configuring mojo com.agilejava.docbkx:docbkx-maven-plugin:2.0.13:generate-html from
plugin realm ClassRealm[plugin>com.agilejava.docbkx:docbkx-maven-plugin:2.0.13, parent:
sun.misc.Launcher$AppClassLoader@192d342]
[DEBUG] Configuring mojo 'com.agilejava.docbkx:docbkx-maven-plugin:2.0.13:generate-html' with
override configurator -->
[DEBUG]   (f) artifacts = [com.agilejava.docbkx:docbkx-maven-plugin:maven-plugin:2.0.13:,
org.docbook:docbook-xml:jar:4.4:runtime, antlr:stringtemplate:jar:2.2:compile, antlr:antlr:jar:2.7.2:compile,
xerces:xercesImpl:jar:2.8.0:runtime, xml-apis:xml-apis:jar:1.3.03:compile, xerces:xmlParserAPIs:jar:2.6.2:runtime,
org.apache.xmlgraphics:fop:jar:1.0:compile, org.apache.xmlgraphics:xmlgraphics-commons:jar:1.4:compile,
org.apache.xmlgraphics:batik-svg-dom:jar:1.7:compile, org.apache.xmlgraphics:batik-anim:jar:1.7:compile,
org.apache.xmlgraphics:batik-css:jar:1.7:compile, org.apache.xmlgraphics:batik-dom:jar:1.7:compile,
org.apache.xmlgraphics:batik-parser:jar:1.7:compile, org.apache.xmlgraphics:batik-util:jar:1.7:compile,
xml-apis:xml-apis-ext:jar:1.3.04:compile, org.apache.xmlgraphics:batik-bridge:jar:1.7:compile,
org.apache.xmlgraphics:batik-script:jar:1.7:compile, org.apache.xmlgraphics:batik-js:jar:1.7:compile,
org.apache.xmlgraphics:batik-xml:jar:1.7:compile, org.apache.xmlgraphics:batik-awt-util:jar:1.7:compile,
org.apache.xmlgraphics:batik-gvt:jar:1.7:compile, org.apache.xmlgraphics:batik-transcoder:jar:1.7:compile,
org.apache.xmlgraphics:batik-svggen:jar:1.7:compile, org.apache.xmlgraphics:batik-extension:jar:1.7:compile,
org.apache.xmlgraphics:batik-ext:jar:1.7:compile, commons-logging:commons-logging:jar:1.0.4:compile,
commons-io:commons-io:jar:1.3.1:compile, org.apache.avalon.framework:avalon-framework-api:jar:4.3.1:compile,
org.apache.avalon.framework:avalon-framework-impl:jar:4.3.1:compile, xalan:xalan:jar:2.7.0:compile,
org.codehaus.plexus:plexus-utils:jar:1.1:compile, junit:junit:jar:3.8.1:compile, com.agilejava.docbkx:docbkx-maven-base:jar:2.0.13:compile,
commons-el:commons-el:jar:1.0:compile, javax.servlet.jsp:jsp-api:jar:2.0:compile, jaxen:jaxen:jar:1.0-FCS:compile,
saxpath:saxpath:jar:1.0-FCS:compile, xom:xom:jar:1.1:compile, saxon:saxon:jar:6.5.3:compile,
xml-resolver:xml-resolver:jar:1.1:compile, plexus:plexus-utils:jar:1.0.1:compile, org.codehaus.plexus:plexus-archiver:jar:1.0-alpha-5:compile,
org.apache.maven.plugins:maven-antrun-plugin:jar:1.1:compile, ant:ant-launcher:jar:1.6.5:runtime,
ant:ant:jar:1.6.5:compile, net.sf.xslthl:xslthl:jar:2.0.1:compile, net.sf.docbook:docbook-xsl:zip:ns-resources:1.76.1:compile,
net.sf.docbook:docbook-xsl-saxon:jar:1.0.0:compile, net.sf.docbook:docbook-xsl-webhelpindexer:jar:1.0.0:compile,
org.apache.lucene:lucene-core:jar:3.0.0:compile, org.apache.lucene:lucene-analyzers:jar:3.0.0:compile,
org.apache.ant:ant:jar:1.7.0:compile, org.apache.ant:ant-launcher:jar:1.7.0:compile]
[DEBUG]   (f) chunkedOutput = true
[DEBUG]   (f) htmlCustomization = src/docbkx/customization.xsl
[DEBUG]   (f) htmlStylesheet = ../css/freebsd_docbook.css
[DEBUG]   (f) imgSrcPath = ../images/
[DEBUG]   (f) includes = *.xml
[DEBUG]   (f) insertXrefPageNumber = yes
[DEBUG]   (f) navigShowtitles = true
[DEBUG]   (f) project = MavenProject: org.apache.hbase:hbase:0.94.1-SNAPSHOT @ <https://builds.apache.org/job/HBase-0.94-security/ws/trunk/pom.xml>
[DEBUG]   (f) sectionAutolabel = true
[DEBUG]   (f) sectionAutolabelMaxDepth = 100
[DEBUG]   (f) sectionLabelIncludesComponentLabel = true
[DEBUG]   (f) sourceDirectory = <https://builds.apache.org/job/HBase-0.94-security/ws/trunk/src/docbkx>
[DEBUG]   (f) targetDirectory = <https://builds.apache.org/job/HBase-0.94-security/31/artifact/trunk/target/site/book>
[DEBUG]   (s) targetFileExtension = html
[DEBUG]   (f) tocMaxDepth = 2
[DEBUG]   (f) useIdAsFilename = true
[DEBUG]   (f) xincludeSupported = true
[DEBUG] -- end configuration --
[DEBUG] Catalogs to load: jar:file:/home/jenkins/.m2/repository/org/docbook/docbook-xml/4.4/docbook-xml-4.4.jar!/catalog.xml;jar:file:/home/jenkins/.m2/repository/net/sf/docbook/docbook-xsl/1.76.1/docbook-xsl-1.76.1-ns-resources.zip!/docbook/catalog.xml
[DEBUG] Using stylesheet: jar:file:/home/jenkins/.m2/repository/net/sf/docbook/docbook-xsl/1.76.1/docbook-xsl-1.76.1-ns-resources.zip!/docbook/html/chunk.xsl
[DEBUG] SourceFile: <https://builds.apache.org/job/HBase-0.94-security/ws/trunk/src/docbkx/troubleshooting.xml>
[DEBUG] TargetDirectory: <https://builds.apache.org/job/HBase-0.94-security/31/artifact/trunk/target/site/book>
[INFO] Processing input file: troubleshooting.xml
[DEBUG] Xerces XInclude mode entered
[DEBUG] Customization: src/docbkx/customization.xsl
[DEBUG] Customization: src/docbkx/customization.xsl
[DEBUG] Customization: src/docbkx/customization.xsl
[DEBUG] Configure the transformer.
[INFO] Chunking output.
Error on line 620 column 396 of file://<https://builds.apache.org/job/HBase-0.94-security/ws/trunk/src/docbkx/troubleshooting.xml>:
  Error reported by XML parser: The element type "para" must be terminated by the matching
end-tag "</para>".
[INFO]                                                                         
[INFO] ------------------------------------------------------------------------
[INFO] Skipping HBase
[INFO] This project has been banned from the build due to previous failures.
[INFO] ------------------------------------------------------------------------
[INFO] ------------------------------------------------------------------------
[INFO] BUILD FAILURE
[INFO] ------------------------------------------------------------------------
[INFO] Total time: 10.737s
[INFO] Finished at: Fri May 25 09:07:27 UTC 2012
[INFO] Final Memory: 11M/110M
[INFO] ------------------------------------------------------------------------
[ERROR] Failed to execute goal com.agilejava.docbkx:docbkx-maven-plugin:2.0.13:generate-html
(multipage) on project hbase: Failed to transform troubleshooting.xml. org.xml.sax.SAXParseException:
The element type "para" must be terminated by the matching end-tag "</para>". ->
[Help 1]
org.apache.maven.lifecycle.LifecycleExecutionException: Failed to execute goal com.agilejava.docbkx:docbkx-maven-plugin:2.0.13:generate-html
(multipage) on project hbase: Failed to transform troubleshooting.xml.
	at org.apache.maven.lifecycle.internal.MojoExecutor.execute(MojoExecutor.java:217)
	at org.apache.maven.lifecycle.internal.MojoExecutor.execute(MojoExecutor.java:153)
	at org.apache.maven.lifecycle.internal.MojoExecutor.execute(MojoExecutor.java:145)
	at org.apache.maven.lifecycle.internal.LifecycleModuleBuilder.buildProject(LifecycleModuleBuilder.java:84)
	at org.apache.maven.lifecycle.internal.LifecycleModuleBuilder.buildProject(LifecycleModuleBuilder.java:59)
	at org.apache.maven.lifecycle.internal.LifecycleStarter.singleThreadedBuild(LifecycleStarter.java:183)
	at org.apache.maven.lifecycle.internal.LifecycleStarter.execute(LifecycleStarter.java:161)
	at org.apache.maven.DefaultMaven.doExecute(DefaultMaven.java:319)
	at org.apache.maven.DefaultMaven.execute(DefaultMaven.java:156)
	at org.apache.maven.cli.MavenCli.execute(MavenCli.java:537)
	at org.apache.maven.cli.MavenCli.doMain(MavenCli.java:196)
	at org.apache.maven.cli.MavenCli.main(MavenCli.java:141)
	at sun.reflect.NativeMethodAccessorImpl.invoke0(Native Method)
	at sun.reflect.NativeMethodAccessorImpl.invoke(NativeMethodAccessorImpl.java:39)
	at sun.reflect.DelegatingMethodAccessorImpl.invoke(DelegatingMethodAccessorImpl.java:25)
	at java.lang.reflect.Method.invoke(Method.java:597)
	at org.codehaus.plexus.classworlds.launcher.Launcher.launchEnhanced(Launcher.java:290)
	at org.codehaus.plexus.classworlds.launcher.Launcher.launch(Launcher.java:230)
	at org.codehaus.plexus.classworlds.launcher.Launcher.mainWithExitCode(Launcher.java:409)
	at org.codehaus.plexus.classworlds.launcher.Launcher.main(Launcher.java:352)
Caused by: org.apache.maven.plugin.MojoExecutionException: Failed to transform troubleshooting.xml.
	at com.agilejava.docbkx.maven.AbstractTransformerMojo.execute(AbstractTransformerMojo.java:179)
	at com.agilejava.docbkx.maven.AbstractHtmlMojo.execute(AbstractHtmlMojo.java:58)
	at org.apache.maven.plugin.DefaultBuildPluginManager.executeMojo(DefaultBuildPluginManager.java:101)
	at org.apache.maven.lifecycle.internal.MojoExecutor.execute(MojoExecutor.java:209)
	... 19 more
Caused by: javax.xml.transform.TransformerException: org.xml.sax.SAXParseException: The element
type "para" must be terminated by the matching end-tag "</para>".
	at com.icl.saxon.om.Builder.build(Builder.java:273)
	at com.icl.saxon.Controller.transform(Controller.java:936)
	at com.agilejava.docbkx.maven.AbstractTransformerMojo.execute(AbstractTransformerMojo.java:163)
	... 22 more
Caused by: org.xml.sax.SAXParseException: The element type "para" must be terminated by the
matching end-tag "</para>".
	at org.apache.xerces.util.ErrorHandlerWrapper.createSAXParseException(Unknown Source)
	at org.apache.xerces.util.ErrorHandlerWrapper.fatalError(Unknown Source)
	at org.apache.xerces.impl.XMLErrorReporter.reportError(Unknown Source)
	at org.apache.xerces.impl.XMLErrorReporter.reportError(Unknown Source)
	at org.apache.xerces.impl.XMLScanner.reportFatalError(Unknown Source)
	at org.apache.xerces.impl.XMLNSDocumentScannerImpl.scanEndElement(Unknown Source)
	at org.apache.xerces.impl.XMLDocumentFragmentScannerImpl$FragmentContentDispatcher.dispatch(Unknown
Source)
	at org.apache.xerces.impl.XMLDocumentFragmentScannerImpl.scanDocument(Unknown Source)
	at org.apache.xerces.parsers.XML11Configuration.parse(Unknown Source)
	at org.apache.xerces.parsers.XML11Configuration.parse(Unknown Source)
	at org.apache.xerces.parsers.XMLParser.parse(Unknown Source)
	at org.apache.xerces.parsers.AbstractSAXParser.parse(Unknown Source)
	at org.apache.xerces.jaxp.SAXParserImpl$JAXPSAXParser.parse(Unknown Source)
	at org.xml.sax.helpers.XMLFilterImpl.parse(XMLFilterImpl.java:333)
	at com.icl.saxon.om.Builder.build(Builder.java:265)
	... 24 more
[ERROR] 
[ERROR] 
[ERROR] For more information about the errors and possible solutions, please read the following
articles:
[ERROR] [Help 1] http://cwiki.apache.org/confluence/display/MAVEN/MojoExecutionException
Build step 'Invoke top-level Maven targets' marked build as failure
Archiving artifacts
Updating HBASE-6077
Recording test results

Mime
View raw message