hbase-dev mailing list archives

Site index · List index
Message view « Date » · « Thread »
Top « Date » · « Thread »
From Stack <st...@duboce.net>
Subject Re: Build failed in Jenkins: HBase-TRUNK #2807
Date Tue, 24 Apr 2012 18:34:57 GMT
Failure seems again to be allocating native memory.  I set build heap
down from 3g to 2g.  Lets see if that helps.
St.Ack

On Tue, Apr 24, 2012 at 11:25 AM, Apache Jenkins Server
<jenkins@builds.apache.org> wrote:
> See <https://builds.apache.org/job/HBase-TRUNK/2807/changes>
>
> Changes:
>
> [ramkrishna] HBASE-5848 Create table with EMPTY_START_ROW passed as splitKey causes the
HMaster to abort (Ram)
>
> ------------------------------------------
> [...truncated 8123 lines...]
> Tests run: 6, Failures: 0, Errors: 0, Skipped: 0, Time elapsed: 38.578 sec
> Running org.apache.hadoop.hbase.coprocessor.TestRegionServerCoprocessorExceptionWithAbort
> Tests run: 1, Failures: 0, Errors: 0, Skipped: 0, Time elapsed: 21.138 sec
> Running org.apache.hadoop.hbase.coprocessor.TestCoprocessorEndpoint
> Tests run: 3, Failures: 0, Errors: 0, Skipped: 1, Time elapsed: 36.083 sec
> Running org.apache.hadoop.hbase.coprocessor.TestRowProcessorEndpoint
> Tests run: 4, Failures: 0, Errors: 0, Skipped: 0, Time elapsed: 41.794 sec
> Running org.apache.hadoop.hbase.coprocessor.TestMasterCoprocessorExceptionWithRemove
> Tests run: 1, Failures: 0, Errors: 0, Skipped: 0, Time elapsed: 24.628 sec
> Running org.apache.hadoop.hbase.coprocessor.TestRegionObserverInterface
> Tests run: 6, Failures: 0, Errors: 0, Skipped: 0, Time elapsed: 48.579 sec
> Running org.apache.hadoop.hbase.coprocessor.TestRegionServerCoprocessorExceptionWithRemove
> Tests run: 1, Failures: 0, Errors: 0, Skipped: 0, Time elapsed: 25.75 sec
> Running org.apache.hadoop.hbase.coprocessor.TestWALObserver
> Tests run: 3, Failures: 0, Errors: 0, Skipped: 0, Time elapsed: 22.713 sec
> Running org.apache.hadoop.hbase.coprocessor.TestMasterCoprocessorExceptionWithAbort
> Tests run: 1, Failures: 0, Errors: 0, Skipped: 0, Time elapsed: 31.814 sec
> Running org.apache.hadoop.hbase.coprocessor.TestMasterObserver
> Tests run: 3, Failures: 0, Errors: 0, Skipped: 0, Time elapsed: 41.247 sec
> Running org.apache.hadoop.hbase.util.TestMergeTable
> Tests run: 1, Failures: 0, Errors: 0, Skipped: 0, Time elapsed: 42.644 sec
> Running org.apache.hadoop.hbase.util.TestFSUtils
> Tests run: 4, Failures: 0, Errors: 0, Skipped: 0, Time elapsed: 49.516 sec
> Running org.apache.hadoop.hbase.replication.TestReplication
> Tests run: 10, Failures: 1, Errors: 0, Skipped: 0, Time elapsed: 250.966 sec <<<
FAILURE!
> Running org.apache.hadoop.hbase.util.hbck.TestOfflineMetaRebuildOverlap
> Tests run: 1, Failures: 0, Errors: 0, Skipped: 0, Time elapsed: 43.393 sec
> Running org.apache.hadoop.hbase.util.hbck.TestOfflineMetaRebuildBase
> Tests run: 1, Failures: 0, Errors: 0, Skipped: 0, Time elapsed: 41.214 sec
> Running org.apache.hadoop.hbase.util.TestPoolMap$TestRoundRobinPoolType
> Tests run: 3, Failures: 0, Errors: 0, Skipped: 0, Time elapsed: 0.013 sec
> Running org.apache.hadoop.hbase.util.TestPoolMap$TestThreadLocalPoolType
> Tests run: 3, Failures: 0, Errors: 0, Skipped: 0, Time elapsed: 0.011 sec
> Running org.apache.hadoop.hbase.util.TestPoolMap$TestReusablePoolType
> Tests run: 3, Failures: 0, Errors: 0, Skipped: 0, Time elapsed: 0.041 sec
> Running org.apache.hadoop.hbase.util.hbck.TestOfflineMetaRebuildHole
> Tests run: 1, Failures: 0, Errors: 0, Skipped: 0, Time elapsed: 35.077 sec
> Running org.apache.hadoop.hbase.util.TestIdLock
> Tests run: 1, Failures: 0, Errors: 0, Skipped: 0, Time elapsed: 15.338 sec
> Running org.apache.hadoop.hbase.util.TestDefaultEnvironmentEdge
> Tests run: 1, Failures: 0, Errors: 0, Skipped: 0, Time elapsed: 0.206 sec
> Running org.apache.hadoop.hbase.util.TestMiniClusterLoadEncoded
> Tests run: 4, Failures: 0, Errors: 0, Skipped: 0, Time elapsed: 123.981 sec
> Running org.apache.hadoop.hbase.util.TestFSTableDescriptors
> Tests run: 10, Failures: 0, Errors: 0, Skipped: 0, Time elapsed: 1.409 sec
> Running org.apache.hadoop.hbase.util.TestEnvironmentEdgeManager
> Tests run: 2, Failures: 0, Errors: 0, Skipped: 0, Time elapsed: 1.175 sec
> Running org.apache.hadoop.hbase.util.TestMergeTool
> Tests run: 1, Failures: 0, Errors: 0, Skipped: 0, Time elapsed: 102.401 sec
> Running org.apache.hadoop.hbase.util.TestProcessBasedCluster
> Tests run: 1, Failures: 0, Errors: 0, Skipped: 0, Time elapsed: 0.542 sec
> Running org.apache.hadoop.hbase.util.TestRegionSplitter
> Tests run: 5, Failures: 0, Errors: 0, Skipped: 0, Time elapsed: 172.839 sec
> Running org.apache.hadoop.hbase.util.TestMiniClusterLoadSequential
> Tests run: 4, Failures: 0, Errors: 0, Skipped: 0, Time elapsed: 349.988 sec
> Running org.apache.hadoop.hbase.util.TestMiniClusterLoadParallel
> Tests run: 4, Failures: 0, Errors: 0, Skipped: 0, Time elapsed: 371.415 sec
> Running org.apache.hadoop.hbase.mapred.TestTableInputFormat
> Tests run: 6, Failures: 0, Errors: 0, Skipped: 0, Time elapsed: 111.588 sec
> Running org.apache.hadoop.hbase.regionserver.TestStore
> Tests run: 12, Failures: 0, Errors: 0, Skipped: 0, Time elapsed: 9.482 sec
> Running org.apache.hadoop.hbase.regionserver.TestStoreFileBlockCacheSummary
> Tests run: 1, Failures: 0, Errors: 0, Skipped: 0, Time elapsed: 23.175 sec
> Running org.apache.hadoop.hbase.regionserver.TestSplitTransactionOnCluster
> Tests run: 4, Failures: 0, Errors: 0, Skipped: 0, Time elapsed: 54.68 sec
> Running org.apache.hadoop.hbase.regionserver.handler.TestOpenRegionHandler
> Tests run: 3, Failures: 0, Errors: 0, Skipped: 0, Time elapsed: 1.265 sec
> Running org.apache.hadoop.hbase.regionserver.handler.TestCloseRegionHandler
> Tests run: 3, Failures: 0, Errors: 0, Skipped: 0, Time elapsed: 1.443 sec
> Running org.apache.hadoop.hbase.regionserver.TestParallelPut
> Tests run: 2, Failures: 0, Errors: 0, Skipped: 0, Time elapsed: 5.323 sec
> Running org.apache.hadoop.hbase.mapred.TestTableMapReduce
> Tests run: 1, Failures: 0, Errors: 0, Skipped: 0, Time elapsed: 144.126 sec
> Running org.apache.hadoop.hbase.regionserver.TestRegionServerMetrics
> Tests run: 3, Failures: 0, Errors: 0, Skipped: 0, Time elapsed: 82.918 sec
> Running org.apache.hadoop.hbase.regionserver.TestServerCustomProtocol
> Tests run: 7, Failures: 0, Errors: 0, Skipped: 0, Time elapsed: 19.099 sec
> Running org.apache.hadoop.hbase.regionserver.TestHRegionOnCluster
> Tests run: 1, Failures: 0, Errors: 0, Skipped: 0, Time elapsed: 26.406 sec
> Running org.apache.hadoop.hbase.regionserver.TestBlocksRead
> Tests run: 4, Failures: 0, Errors: 0, Skipped: 0, Time elapsed: 1.148 sec
> Running org.apache.hadoop.hbase.regionserver.TestMasterAddressManager
> Tests run: 1, Failures: 0, Errors: 0, Skipped: 0, Time elapsed: 2.054 sec
> Running org.apache.hadoop.hbase.regionserver.TestAtomicOperation
> Tests run: 5, Failures: 0, Errors: 0, Skipped: 0, Time elapsed: 28.076 sec
> Running org.apache.hadoop.hbase.regionserver.TestRSKilledWhenMasterInitializing
> Tests run: 1, Failures: 0, Errors: 0, Skipped: 0, Time elapsed: 42.77 sec
> Running org.apache.hadoop.hbase.regionserver.wal.TestWALReplayCompressed
> Tests run: 5, Failures: 0, Errors: 0, Skipped: 0, Time elapsed: 58.126 sec
> Running org.apache.hadoop.hbase.regionserver.wal.TestWALReplay
> Tests run: 5, Failures: 0, Errors: 0, Skipped: 0, Time elapsed: 49.803 sec
> Running org.apache.hadoop.hbase.regionserver.wal.TestHLog
> Tests run: 10, Failures: 0, Errors: 0, Skipped: 0, Time elapsed: 74.314 sec
> Running org.apache.hadoop.hbase.regionserver.wal.TestLogRollingNoCluster
> Tests run: 1, Failures: 0, Errors: 0, Skipped: 0, Time elapsed: 2.03 sec
> Running org.apache.hadoop.hbase.regionserver.wal.TestLogRollAbort
> Tests run: 1, Failures: 0, Errors: 0, Skipped: 0, Time elapsed: 20.564 sec
> Running org.apache.hadoop.hbase.regionserver.TestMXBean
> Tests run: 1, Failures: 0, Errors: 0, Skipped: 0, Time elapsed: 12.925 sec
> Running org.apache.hadoop.hbase.regionserver.metrics.TestSchemaMetrics
> Tests run: 6, Failures: 0, Errors: 0, Skipped: 0, Time elapsed: 15.062 sec
> Running org.apache.hadoop.hbase.regionserver.TestRpcMetrics
> Tests run: 1, Failures: 0, Errors: 0, Skipped: 0, Time elapsed: 2.13 sec
> Running org.apache.hadoop.hbase.regionserver.TestStoreScanner
> Tests run: 16, Failures: 0, Errors: 0, Skipped: 0, Time elapsed: 0.113 sec
> Running org.apache.hadoop.hbase.regionserver.TestSeekOptimizations
> Tests run: 6, Failures: 0, Errors: 0, Skipped: 0, Time elapsed: 2.754 sec
> Running org.apache.hadoop.hbase.regionserver.TestFSErrorsExposed
> Tests run: 3, Failures: 0, Errors: 0, Skipped: 0, Time elapsed: 30.902 sec
> Running org.apache.hadoop.hbase.util.TestHBaseFsck
> Tests run: 16, Failures: 0, Errors: 0, Skipped: 0, Time elapsed: 763.691 sec
> Running org.apache.hadoop.hbase.regionserver.TestSplitLogWorker
> Tests run: 5, Failures: 0, Errors: 0, Skipped: 0, Time elapsed: 2.633 sec
> Running org.apache.hadoop.hbase.regionserver.TestHRegionServerBulkLoad
> Tests run: 1, Failures: 0, Errors: 0, Skipped: 0, Time elapsed: 51.8 sec
> Running org.apache.hadoop.hbase.regionserver.TestMultiColumnScanner
> Tests run: 12, Failures: 0, Errors: 0, Skipped: 0, Time elapsed: 42.798 sec
> Running org.apache.hadoop.hbase.regionserver.TestHRegion
> Tests run: 61, Failures: 0, Errors: 0, Skipped: 0, Time elapsed: 41.97 sec
> Running org.apache.hadoop.hbase.client.replication.TestReplicationAdmin
> Tests run: 1, Failures: 0, Errors: 0, Skipped: 0, Time elapsed: 0.992 sec
> Running org.apache.hadoop.hbase.regionserver.TestEndToEndSplitTransaction
> Tests run: 1, Failures: 0, Errors: 0, Skipped: 0, Time elapsed: 47.826 sec
> Running org.apache.hadoop.hbase.client.TestTimestampsFilter
> Tests run: 3, Failures: 0, Errors: 0, Skipped: 0, Time elapsed: 24.204 sec
> Running org.apache.hadoop.hbase.client.TestMultipleTimestamps
> Tests run: 8, Failures: 0, Errors: 0, Skipped: 0, Time elapsed: 35.927 sec
> Running org.apache.hadoop.hbase.client.TestHCM
> Tests run: 7, Failures: 0, Errors: 0, Skipped: 0, Time elapsed: 25.176 sec
> Running org.apache.hadoop.hbase.client.TestHTablePool$TestHTableReusablePool
> Tests run: 9, Failures: 0, Errors: 0, Skipped: 0, Time elapsed: 7.663 sec
> Running org.apache.hadoop.hbase.regionserver.wal.TestHLogSplit
> Tests run: 30, Failures: 0, Errors: 0, Skipped: 1, Time elapsed: 262.995 sec
> Running org.apache.hadoop.hbase.client.TestHTablePool$TestHTableThreadLocalPool
> Tests run: 9, Failures: 0, Errors: 0, Skipped: 0, Time elapsed: 28.853 sec
> Running org.apache.hadoop.hbase.client.TestHTableUtil
> Tests run: 2, Failures: 0, Errors: 0, Skipped: 0, Time elapsed: 21.187 sec
> Running org.apache.hadoop.hbase.client.TestFromClientSide3
> Tests run: 1, Failures: 0, Errors: 0, Skipped: 0, Time elapsed: 30.842 sec
> Running org.apache.hadoop.hbase.client.TestMetaScanner
> Tests run: 1, Failures: 0, Errors: 0, Skipped: 0, Time elapsed: 18.801 sec
> Running org.apache.hadoop.hbase.regionserver.wal.TestLogRolling
> Tests run: 3, Failures: 0, Errors: 0, Skipped: 0, Time elapsed: 455.853 sec
> Running org.apache.hadoop.hbase.client.TestFromClientSide
> Tests run: 56, Failures: 0, Errors: 0, Skipped: 3, Time elapsed: 237.322 sec
> Running org.apache.hadoop.hbase.client.TestScannerTimeout
> Tests run: 4, Failures: 0, Errors: 0, Skipped: 0, Time elapsed: 51.003 sec
> Running org.apache.hadoop.hbase.client.TestShell
> Tests run: 1, Failures: 0, Errors: 0, Skipped: 0, Time elapsed: 133.946 sec
> Running org.apache.hadoop.hbase.client.TestMetaMigrationRemovingHTD
> Tests run: 3, Failures: 0, Errors: 0, Skipped: 0, Time elapsed: 35.835 sec
> Running org.apache.hadoop.hbase.TestMultiVersions
> Tests run: 3, Failures: 0, Errors: 0, Skipped: 0, Time elapsed: 32.616 sec
> Running org.apache.hadoop.hbase.client.TestMultiParallel
> Tests run: 11, Failures: 0, Errors: 0, Skipped: 0, Time elapsed: 56.487 sec
> Running org.apache.hadoop.hbase.client.TestAdmin
> Tests run: 39, Failures: 0, Errors: 0, Skipped: 0, Time elapsed: 215.831 sec
> Running org.apache.hadoop.hbase.master.TestActiveMasterManager
> Tests run: 2, Failures: 0, Errors: 0, Skipped: 0, Time elapsed: 1.285 sec
> Running org.apache.hadoop.hbase.master.TestMasterNoCluster
> Tests run: 3, Failures: 0, Errors: 0, Skipped: 0, Time elapsed: 9.007 sec
> Running org.apache.hadoop.hbase.master.TestLogsCleaner
> Tests run: 1, Failures: 0, Errors: 0, Skipped: 0, Time elapsed: 4.763 sec
> Running org.apache.hadoop.hbase.master.TestZKBasedOpenCloseRegion
> Tests run: 4, Failures: 0, Errors: 0, Skipped: 0, Time elapsed: 27.305 sec
> Running org.apache.hadoop.hbase.thrift.TestThriftServer
> Tests run: 1, Failures: 0, Errors: 0, Skipped: 0, Time elapsed: 77.593 sec
> Running org.apache.hadoop.hbase.master.TestRollingRestart
> Tests run: 1, Failures: 0, Errors: 0, Skipped: 0, Time elapsed: 64.485 sec
> Running org.apache.hadoop.hbase.master.TestMaster
> Tests run: 1, Failures: 0, Errors: 0, Skipped: 0, Time elapsed: 21.254 sec
> Running org.apache.hadoop.hbase.master.TestClockSkewDetection
> Tests run: 1, Failures: 0, Errors: 0, Skipped: 0, Time elapsed: 0.296 sec
> Running org.apache.hadoop.hbase.master.TestOpenedRegionHandler
> Tests run: 2, Failures: 0, Errors: 0, Skipped: 0, Time elapsed: 19.776 sec
> Running org.apache.hadoop.hbase.master.TestMasterTransitions
> Tests run: 3, Failures: 0, Errors: 0, Skipped: 3, Time elapsed: 31.54 sec
> Running org.apache.hadoop.hbase.master.TestMXBean
> Tests run: 1, Failures: 0, Errors: 0, Skipped: 0, Time elapsed: 20.137 sec
> Running org.apache.hadoop.hbase.master.TestSplitLogManager
> Tests run: 12, Failures: 1, Errors: 0, Skipped: 0, Time elapsed: 14.093 sec <<<
FAILURE!
> Running org.apache.hadoop.hbase.master.TestAssignmentManager
> Tests run: 7, Failures: 0, Errors: 0, Skipped: 0, Time elapsed: 2.551 sec
> Running org.apache.hadoop.hbase.master.TestDefaultLoadBalancer
> Tests run: 4, Failures: 0, Errors: 0, Skipped: 0, Time elapsed: 1.451 sec
> Running org.apache.hadoop.hbase.master.TestMasterStatusServlet
> Tests run: 5, Failures: 0, Errors: 0, Skipped: 0, Time elapsed: 1.221 sec
> Running org.apache.hadoop.hbase.master.TestHMasterRPCException
> Tests run: 1, Failures: 0, Errors: 0, Skipped: 0, Time elapsed: 1.375 sec
> Running org.apache.hadoop.hbase.master.TestMasterRestartAfterDisablingTable
> Tests run: 1, Failures: 0, Errors: 0, Skipped: 0, Time elapsed: 23.04 sec
> Running org.apache.hadoop.hbase.master.TestMasterShutdown
> Tests run: 1, Failures: 0, Errors: 0, Skipped: 0, Time elapsed: 21.702 sec
> Running org.apache.hadoop.hbase.master.TestRestartCluster
> Tests run: 2, Failures: 0, Errors: 0, Skipped: 0, Time elapsed: 42.585 sec
> Running org.apache.hadoop.hbase.TestRegionRebalancing
> Tests run: 1, Failures: 0, Errors: 1, Skipped: 0, Time elapsed: 16.165 sec <<<
FAILURE!
> Running org.apache.hadoop.hbase.master.TestMasterFailover
> Tests run: 4, Failures: 0, Errors: 0, Skipped: 0, Time elapsed: 102.191 sec
> Running org.apache.hadoop.hbase.avro.TestAvroServer
> Tests run: 3, Failures: 0, Errors: 0, Skipped: 0, Time elapsed: 35.775 sec
> Running org.apache.hadoop.hbase.master.TestDistributedLogSplitting
> Tests run: 4, Failures: 0, Errors: 0, Skipped: 0, Time elapsed: 150.305 sec
> Running org.apache.hadoop.hbase.ipc.TestPBOnWritableRpc
> Tests run: 1, Failures: 0, Errors: 0, Skipped: 0, Time elapsed: 1.171 sec
> Running org.apache.hadoop.hbase.ipc.TestDelayedRpc
> Tests run: 4, Failures: 0, Errors: 0, Skipped: 0, Time elapsed: 2.676 sec
> Running org.apache.hadoop.hbase.thrift2.TestThriftHBaseServiceHandler
> Tests run: 12, Failures: 0, Errors: 0, Skipped: 0, Time elapsed: 18.667 sec
> Running org.apache.hadoop.hbase.TestInfoServers
> Tests run: 2, Failures: 0, Errors: 0, Skipped: 0, Time elapsed: 12.925 sec
> Running org.apache.hadoop.hbase.TestZooKeeper
> Tests run: 9, Failures: 0, Errors: 0, Skipped: 0, Time elapsed: 72.824 sec
> Running org.apache.hadoop.hbase.TestAcidGuarantees
> Tests run: 3, Failures: 0, Errors: 0, Skipped: 0, Time elapsed: 104.828 sec
> Running org.apache.hadoop.hbase.thrift.TestThriftServerCmdLine
> Tests run: 20, Failures: 0, Errors: 0, Skipped: 0, Time elapsed: 570.345 sec
>
> Results :
>
> Failed tests:   queueFailover(org.apache.hadoop.hbase.replication.TestReplication):
Waited too much time for queueFailover replication. Waited 57871ms.
>  testMultipleResubmits(org.apache.hadoop.hbase.master.TestSplitLogManager)
>
> Tests in error:
>  testRebalanceOnRegionServerNumberChange(org.apache.hadoop.hbase.TestRegionRebalancing):
Empty split key must not be passed in the split keys.
>
> Tests run: 943, Failures: 2, Errors: 1, Skipped: 9
>
> [INFO] ------------------------------------------------------------------------
> [INFO] BUILD FAILURE
> [INFO] ------------------------------------------------------------------------
> [INFO] Total time: 54:23.018s
> [INFO] Finished at: Tue Apr 24 18:24:24 UTC 2012
> [INFO] Final Memory: 57M/487M
> [INFO] ------------------------------------------------------------------------
> [ERROR] Failed to execute goal org.apache.maven.plugins:maven-surefire-plugin:2.12-TRUNK-HBASE-2:test
(secondPartTestsExecution) on project hbase: There are test failures.
> [ERROR]
> [ERROR] Please refer to <https://builds.apache.org/job/HBase-TRUNK/ws/trunk/target/surefire-reports>
for the individual test results.
> [ERROR] -> [Help 1]
> [ERROR]
> [ERROR] To see the full stack trace of the errors, re-run Maven with the -e switch.
> [ERROR] Re-run Maven using the -X switch to enable full debug logging.
> [ERROR]
> [ERROR] For more information about the errors and possible solutions, please read the
following articles:
> [ERROR] [Help 1] http://cwiki.apache.org/confluence/display/MAVEN/MojoFailureException
> Build step 'Invoke top-level Maven targets' marked build as failure
> Archiving artifacts
> Recording test results
> Updating HBASE-5848

Mime
View raw message