hbase-dev mailing list archives

Site index · List index
Message view « Date » · « Thread »
Top « Date » · « Thread »
From Apache Jenkins Server <jenk...@builds.apache.org>
Subject Build failed in Jenkins: HBase-TRUNK #2704
Date Mon, 02 Apr 2012 23:31:24 GMT
See <https://builds.apache.org/job/HBase-TRUNK/2704/changes>

Changes:

[stack] HBASE-5688 Convert zk root-region-server znode content to pb

[stack] HBASE-5665 Repeated split causes HRegionServer failures and breaks table

[stack] HBASE-5693 When creating a region, the master initializes it and creates a memstore
within the master server

[stack] HBASE-5694 getRowsWithColumnsTs() in Thrift service handles timestamps incorrectly

------------------------------------------
[...truncated 12840 lines...]
Setting project property: maven.dependency.org.apache.velocity.velocity.jar.path -> /home/jenkins/.m2/repository/org/apache/velocity/velocity/1.7/velocity-1.7.jar
Setting project property: maven.dependency.org.apache.zookeeper.zookeeper.jar.path -> /home/jenkins/.m2/repository/org/apache/zookeeper/zookeeper/3.4.3/zookeeper-3.4.3.jar
Setting project property: maven.dependency.org.apache.thrift.libthrift.jar.path -> /home/jenkins/.m2/repository/org/apache/thrift/libthrift/0.8.0/libthrift-0.8.0.jar
Setting project property: maven.dependency.org.apache.httpcomponents.httpclient.jar.path ->
/home/jenkins/.m2/repository/org/apache/httpcomponents/httpclient/4.1.2/httpclient-4.1.2.jar
Setting project property: maven.dependency.org.apache.httpcomponents.httpcore.jar.path ->
/home/jenkins/.m2/repository/org/apache/httpcomponents/httpcore/4.1.3/httpcore-4.1.3.jar
Setting project property: maven.dependency.org.jruby.jruby-complete.jar.path -> /home/jenkins/.m2/repository/org/jruby/jruby-complete/1.6.5/jruby-complete-1.6.5.jar
Setting project property: maven.dependency.org.mortbay.jetty.jetty.jar.path -> /home/jenkins/.m2/repository/org/mortbay/jetty/jetty/6.1.26/jetty-6.1.26.jar
Setting project property: maven.dependency.org.mortbay.jetty.jetty-util.jar.path -> /home/jenkins/.m2/repository/org/mortbay/jetty/jetty-util/6.1.26/jetty-util-6.1.26.jar
Setting project property: maven.dependency.org.mortbay.jetty.jsp-2.1.jar.path -> /home/jenkins/.m2/repository/org/mortbay/jetty/jsp-2.1/6.1.14/jsp-2.1-6.1.14.jar
Setting project property: maven.dependency.org.eclipse.jdt.core.jar.path -> /home/jenkins/.m2/repository/org/eclipse/jdt/core/3.1.1/core-3.1.1.jar
Setting project property: maven.dependency.org.mortbay.jetty.jsp-api-2.1.jar.path -> /home/jenkins/.m2/repository/org/mortbay/jetty/jsp-api-2.1/6.1.14/jsp-api-2.1-6.1.14.jar
Setting project property: maven.dependency.org.mortbay.jetty.servlet-api-2.5.jar.path ->
/home/jenkins/.m2/repository/org/mortbay/jetty/servlet-api-2.5/6.1.14/servlet-api-2.5-6.1.14.jar
Setting project property: maven.dependency.org.codehaus.jackson.jackson-core-asl.jar.path
-> /home/jenkins/.m2/repository/org/codehaus/jackson/jackson-core-asl/1.5.5/jackson-core-asl-1.5.5.jar
Setting project property: maven.dependency.org.codehaus.jackson.jackson-mapper-asl.jar.path
-> /home/jenkins/.m2/repository/org/codehaus/jackson/jackson-mapper-asl/1.5.5/jackson-mapper-asl-1.5.5.jar
Setting project property: maven.dependency.org.codehaus.jackson.jackson-jaxrs.jar.path ->
/home/jenkins/.m2/repository/org/codehaus/jackson/jackson-jaxrs/1.5.5/jackson-jaxrs-1.5.5.jar
Setting project property: maven.dependency.org.codehaus.jackson.jackson-xc.jar.path ->
/home/jenkins/.m2/repository/org/codehaus/jackson/jackson-xc/1.5.5/jackson-xc-1.5.5.jar
Setting project property: maven.dependency.org.slf4j.slf4j-api.jar.path -> /home/jenkins/.m2/repository/org/slf4j/slf4j-api/1.5.8/slf4j-api-1.5.8.jar
Setting project property: maven.dependency.org.slf4j.slf4j-log4j12.jar.path -> /home/jenkins/.m2/repository/org/slf4j/slf4j-log4j12/1.5.8/slf4j-log4j12-1.5.8.jar
Setting project property: maven.dependency.tomcat.jasper-compiler.jar.path -> /home/jenkins/.m2/repository/tomcat/jasper-compiler/5.5.23/jasper-compiler-5.5.23.jar
Setting project property: maven.dependency.tomcat.jasper-runtime.jar.path -> /home/jenkins/.m2/repository/tomcat/jasper-runtime/5.5.23/jasper-runtime-5.5.23.jar
Setting project property: maven.dependency.commons-el.commons-el.jar.path -> /home/jenkins/.m2/repository/commons-el/commons-el/1.0/commons-el-1.0.jar
Setting project property: maven.dependency.org.jamon.jamon-runtime.jar.path -> /home/jenkins/.m2/repository/org/jamon/jamon-runtime/2.3.1/jamon-runtime-2.3.1.jar
Setting project property: maven.dependency.com.google.protobuf.protobuf-java.jar.path ->
/home/jenkins/.m2/repository/com/google/protobuf/protobuf-java/2.4.0a/protobuf-java-2.4.0a.jar
Setting project property: maven.dependency.com.sun.jersey.jersey-core.jar.path -> /home/jenkins/.m2/repository/com/sun/jersey/jersey-core/1.4/jersey-core-1.4.jar
Setting project property: maven.dependency.com.sun.jersey.jersey-json.jar.path -> /home/jenkins/.m2/repository/com/sun/jersey/jersey-json/1.4/jersey-json-1.4.jar
Setting project property: maven.dependency.org.codehaus.jettison.jettison.jar.path -> /home/jenkins/.m2/repository/org/codehaus/jettison/jettison/1.1/jettison-1.1.jar
Setting project property: maven.dependency.com.sun.xml.bind.jaxb-impl.jar.path -> /home/jenkins/.m2/repository/com/sun/xml/bind/jaxb-impl/2.1.12/jaxb-impl-2.1.12.jar
Setting project property: maven.dependency.com.sun.jersey.jersey-server.jar.path -> /home/jenkins/.m2/repository/com/sun/jersey/jersey-server/1.4/jersey-server-1.4.jar
Setting project property: maven.dependency.asm.asm.jar.path -> /home/jenkins/.m2/repository/asm/asm/3.1/asm-3.1.jar
Setting project property: maven.dependency.javax.xml.bind.jaxb-api.jar.path -> /home/jenkins/.m2/repository/javax/xml/bind/jaxb-api/2.1/jaxb-api-2.1.jar
Setting project property: maven.dependency.javax.activation.activation.jar.path -> /home/jenkins/.m2/repository/javax/activation/activation/1.1/activation-1.1.jar
Setting project property: maven.dependency.stax.stax-api.jar.path -> /home/jenkins/.m2/repository/stax/stax-api/1.0.1/stax-api-1.0.1.jar
Setting project property: maven.dependency.junit.junit.jar.path -> /home/jenkins/.m2/repository/junit/junit/4.10-HBASE-1/junit-4.10-HBASE-1.jar
Setting project property: maven.dependency.org.mockito.mockito-all.jar.path -> /home/jenkins/.m2/repository/org/mockito/mockito-all/1.8.5/mockito-all-1.8.5.jar
Setting project property: maven.dependency.org.apache.commons.commons-math.jar.path ->
/home/jenkins/.m2/repository/org/apache/commons/commons-math/2.1/commons-math-2.1.jar
Setting project property: maven.dependency.org.apache.hadoop.hadoop-core.jar.path -> /home/jenkins/.m2/repository/org/apache/hadoop/hadoop-core/1.0.0/hadoop-core-1.0.0.jar
Setting project property: maven.dependency.xmlenc.xmlenc.jar.path -> /home/jenkins/.m2/repository/xmlenc/xmlenc/0.52/xmlenc-0.52.jar
Setting project property: maven.dependency.commons-net.commons-net.jar.path -> /home/jenkins/.m2/repository/commons-net/commons-net/1.4.1/commons-net-1.4.1.jar
Setting project property: maven.dependency.org.apache.hadoop.hadoop-test.jar.path -> /home/jenkins/.m2/repository/org/apache/hadoop/hadoop-test/1.0.0/hadoop-test-1.0.0.jar
Setting project property: maven.dependency.org.apache.ftpserver.ftplet-api.jar.path ->
/home/jenkins/.m2/repository/org/apache/ftpserver/ftplet-api/1.0.0/ftplet-api-1.0.0.jar
Setting project property: maven.dependency.org.apache.mina.mina-core.jar.path -> /home/jenkins/.m2/repository/org/apache/mina/mina-core/2.0.0-M5/mina-core-2.0.0-M5.jar
Setting project property: maven.dependency.org.apache.ftpserver.ftpserver-core.jar.path ->
/home/jenkins/.m2/repository/org/apache/ftpserver/ftpserver-core/1.0.0/ftpserver-core-1.0.0.jar
Setting project property: maven.dependency.org.apache.ftpserver.ftpserver-deprecated.jar.path
-> /home/jenkins/.m2/repository/org/apache/ftpserver/ftpserver-deprecated/1.0.0-M2/ftpserver-deprecated-1.0.0-M2.jar
[INFO] Executing tasks
Build sequence for target(s) `main' is [main]
Complete build sequence is [main, ]

main:
    [mkdir] Created dir: <https://builds.apache.org/job/HBase-TRUNK/ws/trunk/target/hbase-0.95-SNAPSHOT/hbase-0.95-SNAPSHOT/lib/native/Linux-i386-32>
     [exec] Current OS is Linux
     [exec] Executing 'sh' with arguments:
     [exec] './copynativelibs.sh'
     [exec] 
     [exec] The ' characters around the executable and arguments are
     [exec] not part of the command.
Execute:Java13CommandLauncher: Executing 'sh' with arguments:
'./copynativelibs.sh'

The ' characters around the executable and arguments are
not part of the command.
     [exec] Current OS is Linux
     [exec] Executing 'tar' with arguments:
     [exec] 'czf'
     [exec] '<https://builds.apache.org/job/HBase-TRUNK/ws/trunk/target/hbase-0.95-SNAPSHOT.tar.gz'>
     [exec] 'hbase-0.95-SNAPSHOT/'
     [exec] 
     [exec] The ' characters around the executable and arguments are
     [exec] not part of the command.
Execute:Java13CommandLauncher: Executing 'tar' with arguments:
'czf'
'<https://builds.apache.org/job/HBase-TRUNK/ws/trunk/target/hbase-0.95-SNAPSHOT.tar.gz'>
'hbase-0.95-SNAPSHOT/'

The ' characters around the executable and arguments are
not part of the command.
[INFO] Executed tasks
[INFO] 
[INFO] --- apache-rat-plugin:0.8:check (default) @ hbase ---
[DEBUG] org.apache.rat:apache-rat-plugin:jar:0.8:
[DEBUG]    org.apache.rat:apache-rat-core:jar:0.8:compile
[DEBUG]       commons-collections:commons-collections:jar:3.2:compile
[DEBUG]       commons-lang:commons-lang:jar:2.1:compile
[DEBUG]       commons-io:commons-io:jar:1.4:compile
[DEBUG]       org.apache.commons:commons-compress:jar:1.0:compile
[DEBUG]       commons-cli:commons-cli:jar:1.2:compile
[DEBUG]    org.codehaus.plexus:plexus-utils:jar:1.4:compile
[DEBUG]    org.apache.maven:maven-plugin-api:jar:2.0.4:compile
[DEBUG]    org.apache.maven.doxia:doxia-site-renderer:jar:1.0-alpha-8:compile
[DEBUG]       org.apache.maven.doxia:doxia-core:jar:1.0-alpha-8:compile
[DEBUG]          org.apache.maven.doxia:doxia-sink-api:jar:1.0-alpha-8:compile
[DEBUG]       org.codehaus.plexus:plexus-i18n:jar:1.0-beta-6:compile
[DEBUG]       org.codehaus.plexus:plexus-velocity:jar:1.1.3:compile
[DEBUG]          velocity:velocity:jar:1.4:compile
[DEBUG]             velocity:velocity-dep:jar:1.4:runtime
[DEBUG]       org.apache.maven.doxia:doxia-decoration-model:jar:1.0-alpha-8:compile
[DEBUG]    org.apache.maven.reporting:maven-reporting-impl:jar:2.0.4:compile
[DEBUG]       org.apache.maven:maven-project:jar:2.0.4:compile
[DEBUG]          org.apache.maven:maven-settings:jar:2.0.4:compile
[DEBUG]          org.apache.maven:maven-profile:jar:2.0.4:compile
[DEBUG]          org.apache.maven:maven-model:jar:2.0.4:compile
[DEBUG]       commons-validator:commons-validator:jar:1.2.0:compile
[DEBUG]          commons-beanutils:commons-beanutils:jar:1.7.0:compile
[DEBUG]          commons-digester:commons-digester:jar:1.6:compile
[DEBUG]          commons-logging:commons-logging:jar:1.0.4:compile
[DEBUG]          xml-apis:xml-apis:jar:1.0.b2:compile
[DEBUG]       oro:oro:jar:2.0.7:compile
[DEBUG]       org.apache.maven.reporting:maven-reporting-api:jar:2.0.4:compile
[DEBUG]    org.apache.maven:maven-artifact-manager:jar:2.0.4:compile
[DEBUG]       org.apache.maven:maven-repository-metadata:jar:2.0.4:compile
[DEBUG]       org.apache.maven:maven-artifact:jar:2.0.4:compile
[DEBUG]       org.codehaus.plexus:plexus-container-default:jar:1.0-alpha-9:compile
[DEBUG]          classworlds:classworlds:jar:1.1-alpha-2:compile
[DEBUG]    org.apache.maven.shared:maven-plugin-testing-harness:jar:1.1:compile
[DEBUG]       org.apache.maven:maven-core:jar:2.0:compile
[DEBUG]          org.apache.maven:maven-plugin-parameter-documenter:jar:2.0:compile
[DEBUG]          org.apache.maven:maven-error-diagnostics:jar:2.0:compile
[DEBUG]          org.apache.maven:maven-plugin-registry:jar:2.0:compile
[DEBUG]          org.apache.maven:maven-plugin-descriptor:jar:2.0:compile
[DEBUG]          org.codehaus.plexus:plexus-interactivity-api:jar:1.0-alpha-4:compile
[DEBUG]          org.apache.maven:maven-monitor:jar:2.0:compile
[DEBUG]       junit:junit:jar:3.8.2:test (scope managed from compile) (version managed from
3.8.1)
[DEBUG]       org.codehaus.plexus:plexus-archiver:jar:1.0-alpha-7:compile
[DEBUG] Created new class realm plugin>org.apache.rat:apache-rat-plugin:0.8
[DEBUG] Importing foreign packages into class realm plugin>org.apache.rat:apache-rat-plugin:0.8
[DEBUG]   Imported:  < maven.api
[DEBUG] Populating class realm plugin>org.apache.rat:apache-rat-plugin:0.8
[DEBUG]   Included: org.apache.rat:apache-rat-plugin:jar:0.8
[DEBUG]   Included: org.apache.rat:apache-rat-core:jar:0.8
[DEBUG]   Included: commons-collections:commons-collections:jar:3.2
[DEBUG]   Included: commons-lang:commons-lang:jar:2.1
[DEBUG]   Included: commons-io:commons-io:jar:1.4
[DEBUG]   Included: org.apache.commons:commons-compress:jar:1.0
[DEBUG]   Included: commons-cli:commons-cli:jar:1.2
[DEBUG]   Included: org.codehaus.plexus:plexus-utils:jar:1.4
[DEBUG]   Included: org.apache.maven.doxia:doxia-site-renderer:jar:1.0-alpha-8
[DEBUG]   Included: org.apache.maven.doxia:doxia-core:jar:1.0-alpha-8
[DEBUG]   Included: org.apache.maven.doxia:doxia-sink-api:jar:1.0-alpha-8
[DEBUG]   Included: org.codehaus.plexus:plexus-i18n:jar:1.0-beta-6
[DEBUG]   Included: org.codehaus.plexus:plexus-velocity:jar:1.1.3
[DEBUG]   Included: velocity:velocity:jar:1.4
[DEBUG]   Included: velocity:velocity-dep:jar:1.4
[DEBUG]   Included: org.apache.maven.doxia:doxia-decoration-model:jar:1.0-alpha-8
[DEBUG]   Included: org.apache.maven.reporting:maven-reporting-impl:jar:2.0.4
[DEBUG]   Included: commons-validator:commons-validator:jar:1.2.0
[DEBUG]   Included: commons-beanutils:commons-beanutils:jar:1.7.0
[DEBUG]   Included: commons-digester:commons-digester:jar:1.6
[DEBUG]   Included: commons-logging:commons-logging:jar:1.0.4
[DEBUG]   Included: xml-apis:xml-apis:jar:1.0.b2
[DEBUG]   Included: oro:oro:jar:2.0.7
[DEBUG]   Included: org.apache.maven.reporting:maven-reporting-api:jar:2.0.4
[DEBUG]   Included: org.apache.maven.shared:maven-plugin-testing-harness:jar:1.1
[DEBUG]   Included: org.codehaus.plexus:plexus-interactivity-api:jar:1.0-alpha-4
[DEBUG]   Included: org.codehaus.plexus:plexus-archiver:jar:1.0-alpha-7
[DEBUG]   Excluded: org.apache.maven:maven-plugin-api:jar:2.0.4
[DEBUG]   Excluded: org.apache.maven:maven-project:jar:2.0.4
[DEBUG]   Excluded: org.apache.maven:maven-settings:jar:2.0.4
[DEBUG]   Excluded: org.apache.maven:maven-profile:jar:2.0.4
[DEBUG]   Excluded: org.apache.maven:maven-model:jar:2.0.4
[DEBUG]   Excluded: org.apache.maven:maven-artifact-manager:jar:2.0.4
[DEBUG]   Excluded: org.apache.maven:maven-repository-metadata:jar:2.0.4
[DEBUG]   Excluded: org.apache.maven:maven-artifact:jar:2.0.4
[DEBUG]   Excluded: org.codehaus.plexus:plexus-container-default:jar:1.0-alpha-9
[DEBUG]   Excluded: classworlds:classworlds:jar:1.1-alpha-2
[DEBUG]   Excluded: org.apache.maven:maven-core:jar:2.0
[DEBUG]   Excluded: org.apache.maven:maven-plugin-parameter-documenter:jar:2.0
[DEBUG]   Excluded: org.apache.maven:maven-error-diagnostics:jar:2.0
[DEBUG]   Excluded: org.apache.maven:maven-plugin-registry:jar:2.0
[DEBUG]   Excluded: org.apache.maven:maven-plugin-descriptor:jar:2.0
[DEBUG]   Excluded: org.apache.maven:maven-monitor:jar:2.0
[DEBUG]   Excluded: junit:junit:jar:3.8.2
[DEBUG] Configuring mojo org.apache.rat:apache-rat-plugin:0.8:check from plugin realm ClassRealm[plugin>org.apache.rat:apache-rat-plugin:0.8,
parent: sun.misc.Launcher$AppClassLoader@192d342]
[DEBUG] Configuring mojo 'org.apache.rat:apache-rat-plugin:0.8:check' with basic configurator
-->
[DEBUG]   (f) addDefaultLicenseMatchers = true
[DEBUG]   (f) addLicenseHeaders = false
[DEBUG]   (f) basedir = <https://builds.apache.org/job/HBase-TRUNK/ws/trunk>
[DEBUG]   (f) excludeSubProjects = true
[DEBUG]   (f) excludes = [**/.*, **/*.tgz, **/*.orig, **/test/**, **/8e8ab58dcf39412da19833fcd8f687ac,
**/.git/**, **/target/**, **/CHANGES.txt, **/generated/**, **/conf/*, **/*.avpr, **/*.svg,
**/*.vm, **/control, **/conffile, docs/*, **/src/site/resources/css/freebsd_docbook.css]
[DEBUG]   (f) numUnapprovedLicenses = 0
[DEBUG]   (f) project = MavenProject: org.apache.hbase:hbase:0.95-SNAPSHOT @ <https://builds.apache.org/job/HBase-TRUNK/ws/trunk/pom.xml>
[DEBUG]   (f) reportFile = <https://builds.apache.org/job/HBase-TRUNK/ws/trunk/target/rat.txt>
[DEBUG]   (f) reportStyle = plain
[DEBUG]   (f) useDefaultExcludes = true
[DEBUG]   (f) useEclipseDefaultExcludes = true
[DEBUG]   (f) useIdeaDefaultExcludes = true
[DEBUG]   (f) useMavenDefaultExcludes = true
[DEBUG] -- end configuration --
[INFO] Exclude: **/.*
[INFO] Exclude: **/*.tgz
[INFO] Exclude: **/*.orig
[INFO] Exclude: **/test/**
[INFO] Exclude: **/8e8ab58dcf39412da19833fcd8f687ac
[INFO] Exclude: **/.git/**
[INFO] Exclude: **/target/**
[INFO] Exclude: **/CHANGES.txt
[INFO] Exclude: **/generated/**
[INFO] Exclude: **/conf/*
[INFO] Exclude: **/*.avpr
[INFO] Exclude: **/*.svg
[INFO] Exclude: **/*.vm
[INFO] Exclude: **/control
[INFO] Exclude: **/conffile
[INFO] Exclude: docs/*
[INFO] Exclude: **/src/site/resources/css/freebsd_docbook.css
[INFO] ------------------------------------------------------------------------
[INFO] BUILD FAILURE
[INFO] ------------------------------------------------------------------------
[INFO] Total time: 27:19.437s
[INFO] Finished at: Mon Apr 02 23:29:25 UTC 2012
[INFO] Final Memory: 50M/1188M
[INFO] ------------------------------------------------------------------------
[ERROR] Failed to execute goal org.apache.rat:apache-rat-plugin:0.8:check (default) on project
hbase: Too many unapproved licenses: 1 -> [Help 1]
org.apache.maven.lifecycle.LifecycleExecutionException: Failed to execute goal org.apache.rat:apache-rat-plugin:0.8:check
(default) on project hbase: Too many unapproved licenses: 1
	at org.apache.maven.lifecycle.internal.MojoExecutor.execute(MojoExecutor.java:213)
	at org.apache.maven.lifecycle.internal.MojoExecutor.execute(MojoExecutor.java:153)
	at org.apache.maven.lifecycle.internal.MojoExecutor.execute(MojoExecutor.java:145)
	at org.apache.maven.lifecycle.internal.LifecycleModuleBuilder.buildProject(LifecycleModuleBuilder.java:84)
	at org.apache.maven.lifecycle.internal.LifecycleModuleBuilder.buildProject(LifecycleModuleBuilder.java:59)
	at org.apache.maven.lifecycle.internal.LifecycleStarter.singleThreadedBuild(LifecycleStarter.java:183)
	at org.apache.maven.lifecycle.internal.LifecycleStarter.execute(LifecycleStarter.java:161)
	at org.apache.maven.DefaultMaven.doExecute(DefaultMaven.java:319)
	at org.apache.maven.DefaultMaven.execute(DefaultMaven.java:156)
	at org.apache.maven.cli.MavenCli.execute(MavenCli.java:537)
	at org.apache.maven.cli.MavenCli.doMain(MavenCli.java:196)
	at org.apache.maven.cli.MavenCli.main(MavenCli.java:141)
	at sun.reflect.NativeMethodAccessorImpl.invoke0(Native Method)
	at sun.reflect.NativeMethodAccessorImpl.invoke(NativeMethodAccessorImpl.java:39)
	at sun.reflect.DelegatingMethodAccessorImpl.invoke(DelegatingMethodAccessorImpl.java:25)
	at java.lang.reflect.Method.invoke(Method.java:597)
	at org.codehaus.plexus.classworlds.launcher.Launcher.launchEnhanced(Launcher.java:290)
	at org.codehaus.plexus.classworlds.launcher.Launcher.launch(Launcher.java:230)
	at org.codehaus.plexus.classworlds.launcher.Launcher.mainWithExitCode(Launcher.java:409)
	at org.codehaus.plexus.classworlds.launcher.Launcher.main(Launcher.java:352)
Caused by: org.apache.rat.mp.RatCheckException: Too many unapproved licenses: 1
	at org.apache.rat.mp.RatCheckMojo.check(RatCheckMojo.java:167)
	at org.apache.rat.mp.RatCheckMojo.execute(RatCheckMojo.java:159)
	at org.apache.maven.plugin.DefaultBuildPluginManager.executeMojo(DefaultBuildPluginManager.java:101)
	at org.apache.maven.lifecycle.internal.MojoExecutor.execute(MojoExecutor.java:209)
	... 19 more
[ERROR] 
[ERROR] 
[ERROR] For more information about the errors and possible solutions, please read the following
articles:
[ERROR] [Help 1] http://cwiki.apache.org/confluence/display/MAVEN/MojoFailureException
Build step 'Invoke top-level Maven targets' marked build as failure
Archiving artifacts
Updating HBASE-5688
Updating HBASE-5694
Updating HBASE-5693
Updating HBASE-5665
Recording test results

Mime
View raw message