hbase-dev mailing list archives

Site index · List index
Message view « Date » · « Thread »
Top « Date » · « Thread »
From Apache Jenkins Server <jenk...@builds.apache.org>
Subject Build failed in Jenkins: HBase-TRUNK #2753
Date Fri, 13 Apr 2012 19:35:59 GMT
See <https://builds.apache.org/job/HBase-TRUNK/2753/changes>

Changes:

[stack] HBASE-5772 Unable to open the few links in http://hbase.apache.org/

------------------------------------------
[...truncated 18375 lines...]
Running org.apache.hadoop.hbase.regionserver.TestAtomicOperation
Tests run: 5, Failures: 0, Errors: 0, Skipped: 0, Time elapsed: 18.406 sec
Forking command line: /bin/sh -c cd /x1/jenkins/jenkins-slave/workspace/HBase-TRUNK/trunk
&& /x1/jenkins/tools/java/jdk1.6.0_27-32/jre/bin/java -enableassertions -Xmx1900m
-Djava.security.egd=file:/dev/./urandom -jar /x1/jenkins/jenkins-slave/workspace/HBase-TRUNK/trunk/target/surefire/surefirebooter5946836847749178531.jar
/x1/jenkins/jenkins-slave/workspace/HBase-TRUNK/trunk/target/surefire/surefire5698837714124438542tmp
/x1/jenkins/jenkins-slave/workspace/HBase-TRUNK/trunk/target/surefire/surefire_575316908032552715973tmp
Running org.apache.hadoop.hbase.regionserver.TestFSErrorsExposed
Tests run: 3, Failures: 0, Errors: 0, Skipped: 0, Time elapsed: 28.653 sec
Forking command line: /bin/sh -c cd /x1/jenkins/jenkins-slave/workspace/HBase-TRUNK/trunk
&& /x1/jenkins/tools/java/jdk1.6.0_27-32/jre/bin/java -enableassertions -Xmx1900m
-Djava.security.egd=file:/dev/./urandom -jar /x1/jenkins/jenkins-slave/workspace/HBase-TRUNK/trunk/target/surefire/surefirebooter4045453758457539439.jar
/x1/jenkins/jenkins-slave/workspace/HBase-TRUNK/trunk/target/surefire/surefire7660093489139407307tmp
/x1/jenkins/jenkins-slave/workspace/HBase-TRUNK/trunk/target/surefire/surefire_588490796508248906006tmp
Running org.apache.hadoop.hbase.regionserver.TestServerCustomProtocol
Tests run: 7, Failures: 0, Errors: 0, Skipped: 0, Time elapsed: 14.875 sec
Forking command line: /bin/sh -c cd /x1/jenkins/jenkins-slave/workspace/HBase-TRUNK/trunk
&& /x1/jenkins/tools/java/jdk1.6.0_27-32/jre/bin/java -enableassertions -Xmx1900m
-Djava.security.egd=file:/dev/./urandom -jar /x1/jenkins/jenkins-slave/workspace/HBase-TRUNK/trunk/target/surefire/surefirebooter2890590404945359682.jar
/x1/jenkins/jenkins-slave/workspace/HBase-TRUNK/trunk/target/surefire/surefire2623624212044295993tmp
/x1/jenkins/jenkins-slave/workspace/HBase-TRUNK/trunk/target/surefire/surefire_597703805816223798397tmp
Running org.apache.hadoop.hbase.regionserver.TestParallelPut
Tests run: 2, Failures: 0, Errors: 0, Skipped: 0, Time elapsed: 2.943 sec
Forking command line: /bin/sh -c cd /x1/jenkins/jenkins-slave/workspace/HBase-TRUNK/trunk
&& /x1/jenkins/tools/java/jdk1.6.0_27-32/jre/bin/java -enableassertions -Xmx1900m
-Djava.security.egd=file:/dev/./urandom -jar /x1/jenkins/jenkins-slave/workspace/HBase-TRUNK/trunk/target/surefire/surefirebooter7535355497518373920.jar
/x1/jenkins/jenkins-slave/workspace/HBase-TRUNK/trunk/target/surefire/surefire5608292885820166145tmp
/x1/jenkins/jenkins-slave/workspace/HBase-TRUNK/trunk/target/surefire/surefire_606237833594800404161tmp
Running org.apache.hadoop.hbase.regionserver.TestRpcMetrics
Tests run: 1, Failures: 0, Errors: 0, Skipped: 0, Time elapsed: 2.066 sec
Forking command line: /bin/sh -c cd /x1/jenkins/jenkins-slave/workspace/HBase-TRUNK/trunk
&& /x1/jenkins/tools/java/jdk1.6.0_27-32/jre/bin/java -enableassertions -Xmx1900m
-Djava.security.egd=file:/dev/./urandom -jar /x1/jenkins/jenkins-slave/workspace/HBase-TRUNK/trunk/target/surefire/surefirebooter3964972450913186820.jar
/x1/jenkins/jenkins-slave/workspace/HBase-TRUNK/trunk/target/surefire/surefire7686712164363132021tmp
/x1/jenkins/jenkins-slave/workspace/HBase-TRUNK/trunk/target/surefire/surefire_617684657350043315882tmp
Running org.apache.hadoop.hbase.regionserver.TestSeekOptimizations
Tests run: 6, Failures: 0, Errors: 0, Skipped: 0, Time elapsed: 2.267 sec
Forking command line: /bin/sh -c cd /x1/jenkins/jenkins-slave/workspace/HBase-TRUNK/trunk
&& /x1/jenkins/tools/java/jdk1.6.0_27-32/jre/bin/java -enableassertions -Xmx1900m
-Djava.security.egd=file:/dev/./urandom -jar /x1/jenkins/jenkins-slave/workspace/HBase-TRUNK/trunk/target/surefire/surefirebooter1599437768845940591.jar
/x1/jenkins/jenkins-slave/workspace/HBase-TRUNK/trunk/target/surefire/surefire7071217157064411865tmp
/x1/jenkins/jenkins-slave/workspace/HBase-TRUNK/trunk/target/surefire/surefire_622656036680440698308tmp
Running org.apache.hadoop.hbase.regionserver.handler.TestCloseRegionHandler
Tests run: 3, Failures: 0, Errors: 0, Skipped: 0, Time elapsed: 1.126 sec
Forking command line: /bin/sh -c cd /x1/jenkins/jenkins-slave/workspace/HBase-TRUNK/trunk
&& /x1/jenkins/tools/java/jdk1.6.0_27-32/jre/bin/java -enableassertions -Xmx1900m
-Djava.security.egd=file:/dev/./urandom -jar /x1/jenkins/jenkins-slave/workspace/HBase-TRUNK/trunk/target/surefire/surefirebooter7586866149467896528.jar
/x1/jenkins/jenkins-slave/workspace/HBase-TRUNK/trunk/target/surefire/surefire882781670043658132tmp
/x1/jenkins/jenkins-slave/workspace/HBase-TRUNK/trunk/target/surefire/surefire_631620645852192202814tmp
Running org.apache.hadoop.hbase.regionserver.handler.TestOpenRegionHandler
Tests run: 3, Failures: 0, Errors: 0, Skipped: 0, Time elapsed: 0.892 sec
Forking command line: /bin/sh -c cd /x1/jenkins/jenkins-slave/workspace/HBase-TRUNK/trunk
&& /x1/jenkins/tools/java/jdk1.6.0_27-32/jre/bin/java -enableassertions -Xmx1900m
-Djava.security.egd=file:/dev/./urandom -jar /x1/jenkins/jenkins-slave/workspace/HBase-TRUNK/trunk/target/surefire/surefirebooter5044855340060185706.jar
/x1/jenkins/jenkins-slave/workspace/HBase-TRUNK/trunk/target/surefire/surefire8522407840306161178tmp
/x1/jenkins/jenkins-slave/workspace/HBase-TRUNK/trunk/target/surefire/surefire_643437839135301943027tmp
Running org.apache.hadoop.hbase.regionserver.TestBlocksRead
Tests run: 4, Failures: 0, Errors: 0, Skipped: 0, Time elapsed: 0.738 sec
Forking command line: /bin/sh -c cd /x1/jenkins/jenkins-slave/workspace/HBase-TRUNK/trunk
&& /x1/jenkins/tools/java/jdk1.6.0_27-32/jre/bin/java -enableassertions -Xmx1900m
-Djava.security.egd=file:/dev/./urandom -jar /x1/jenkins/jenkins-slave/workspace/HBase-TRUNK/trunk/target/surefire/surefirebooter6500944028522911431.jar
/x1/jenkins/jenkins-slave/workspace/HBase-TRUNK/trunk/target/surefire/surefire1085662172177704810tmp
/x1/jenkins/jenkins-slave/workspace/HBase-TRUNK/trunk/target/surefire/surefire_65823818011284193087tmp
Forking command line: /bin/sh -c cd /x1/jenkins/jenkins-slave/workspace/HBase-TRUNK/trunk
&& /x1/jenkins/tools/java/jdk1.6.0_27-32/jre/bin/java -enableassertions -Xmx1900m
-Djava.security.egd=file:/dev/./urandom -jar /x1/jenkins/jenkins-slave/workspace/HBase-TRUNK/trunk/target/surefire/surefirebooter6444215153586433063.jar
/x1/jenkins/jenkins-slave/workspace/HBase-TRUNK/trunk/target/surefire/surefire2295565045639533986tmp
/x1/jenkins/jenkins-slave/workspace/HBase-TRUNK/trunk/target/surefire/surefire_664100122279304175548tmp
Running org.apache.hadoop.hbase.regionserver.TestStoreScanner
Tests run: 16, Failures: 0, Errors: 0, Skipped: 0, Time elapsed: 0.038 sec
Forking command line: /bin/sh -c cd /x1/jenkins/jenkins-slave/workspace/HBase-TRUNK/trunk
&& /x1/jenkins/tools/java/jdk1.6.0_27-32/jre/bin/java -enableassertions -Xmx1900m
-Djava.security.egd=file:/dev/./urandom -jar /x1/jenkins/jenkins-slave/workspace/HBase-TRUNK/trunk/target/surefire/surefirebooter8869103140979452186.jar
/x1/jenkins/jenkins-slave/workspace/HBase-TRUNK/trunk/target/surefire/surefire6299419339035128707tmp
/x1/jenkins/jenkins-slave/workspace/HBase-TRUNK/trunk/target/surefire/surefire_675689029667449737267tmp
Running org.apache.hadoop.hbase.regionserver.TestSplitLogWorker
Tests run: 5, Failures: 0, Errors: 0, Skipped: 0, Time elapsed: 2.087 sec
Forking command line: /bin/sh -c cd /x1/jenkins/jenkins-slave/workspace/HBase-TRUNK/trunk
&& /x1/jenkins/tools/java/jdk1.6.0_27-32/jre/bin/java -enableassertions -Xmx1900m
-Djava.security.egd=file:/dev/./urandom -jar /x1/jenkins/jenkins-slave/workspace/HBase-TRUNK/trunk/target/surefire/surefirebooter7067175043886318902.jar
/x1/jenkins/jenkins-slave/workspace/HBase-TRUNK/trunk/target/surefire/surefire2778194548876518373tmp
/x1/jenkins/jenkins-slave/workspace/HBase-TRUNK/trunk/target/surefire/surefire_685154085680471736537tmp
Running org.apache.hadoop.hbase.regionserver.metrics.TestSchemaMetrics
Tests run: 6, Failures: 0, Errors: 0, Skipped: 0, Time elapsed: 11.111 sec
Forking command line: /bin/sh -c cd /x1/jenkins/jenkins-slave/workspace/HBase-TRUNK/trunk
&& /x1/jenkins/tools/java/jdk1.6.0_27-32/jre/bin/java -enableassertions -Xmx1900m
-Djava.security.egd=file:/dev/./urandom -jar /x1/jenkins/jenkins-slave/workspace/HBase-TRUNK/trunk/target/surefire/surefirebooter3538630422391673389.jar
/x1/jenkins/jenkins-slave/workspace/HBase-TRUNK/trunk/target/surefire/surefire4860339555348376652tmp
/x1/jenkins/jenkins-slave/workspace/HBase-TRUNK/trunk/target/surefire/surefire_695933096459460787382tmp
Running org.apache.hadoop.hbase.regionserver.TestStoreFileBlockCacheSummary
Tests run: 1, Failures: 0, Errors: 0, Skipped: 0, Time elapsed: 12.939 sec
Forking command line: /bin/sh -c cd /x1/jenkins/jenkins-slave/workspace/HBase-TRUNK/trunk
&& /x1/jenkins/tools/java/jdk1.6.0_27-32/jre/bin/java -enableassertions -Xmx1900m
-Djava.security.egd=file:/dev/./urandom -jar /x1/jenkins/jenkins-slave/workspace/HBase-TRUNK/trunk/target/surefire/surefirebooter7903713069577061274.jar
/x1/jenkins/jenkins-slave/workspace/HBase-TRUNK/trunk/target/surefire/surefire4391968291796385593tmp
/x1/jenkins/jenkins-slave/workspace/HBase-TRUNK/trunk/target/surefire/surefire_707036382457500007635tmp
Running org.apache.hadoop.hbase.regionserver.TestMasterAddressManager
Tests run: 1, Failures: 0, Errors: 0, Skipped: 0, Time elapsed: 0.592 sec
Forking command line: /bin/sh -c cd /x1/jenkins/jenkins-slave/workspace/HBase-TRUNK/trunk
&& /x1/jenkins/tools/java/jdk1.6.0_27-32/jre/bin/java -enableassertions -Xmx1900m
-Djava.security.egd=file:/dev/./urandom -jar /x1/jenkins/jenkins-slave/workspace/HBase-TRUNK/trunk/target/surefire/surefirebooter1323313030799323622.jar
/x1/jenkins/jenkins-slave/workspace/HBase-TRUNK/trunk/target/surefire/surefire8352278535397626511tmp
/x1/jenkins/jenkins-slave/workspace/HBase-TRUNK/trunk/target/surefire/surefire_714810286360749349539tmp
Running org.apache.hadoop.hbase.regionserver.TestMultiColumnScanner
Tests run: 12, Failures: 0, Errors: 0, Skipped: 0, Time elapsed: 28.51 sec
Forking command line: /bin/sh -c cd /x1/jenkins/jenkins-slave/workspace/HBase-TRUNK/trunk
&& /x1/jenkins/tools/java/jdk1.6.0_27-32/jre/bin/java -enableassertions -Xmx1900m
-Djava.security.egd=file:/dev/./urandom -jar /x1/jenkins/jenkins-slave/workspace/HBase-TRUNK/trunk/target/surefire/surefirebooter2988556245420781451.jar
/x1/jenkins/jenkins-slave/workspace/HBase-TRUNK/trunk/target/surefire/surefire4175762132433619068tmp
/x1/jenkins/jenkins-slave/workspace/HBase-TRUNK/trunk/target/surefire/surefire_728557374440201062906tmp
Running org.apache.hadoop.hbase.ipc.TestDelayedRpc
Tests run: 4, Failures: 0, Errors: 0, Skipped: 0, Time elapsed: 2.395 sec
Forking command line: /bin/sh -c cd /x1/jenkins/jenkins-slave/workspace/HBase-TRUNK/trunk
&& /x1/jenkins/tools/java/jdk1.6.0_27-32/jre/bin/java -enableassertions -Xmx1900m
-Djava.security.egd=file:/dev/./urandom -jar /x1/jenkins/jenkins-slave/workspace/HBase-TRUNK/trunk/target/surefire/surefirebooter7056815066493547352.jar
/x1/jenkins/jenkins-slave/workspace/HBase-TRUNK/trunk/target/surefire/surefire8398228772674430421tmp
/x1/jenkins/jenkins-slave/workspace/HBase-TRUNK/trunk/target/surefire/surefire_735074018586787637248tmp
Running org.apache.hadoop.hbase.TestGlobalMemStoreSize
Tests run: 1, Failures: 0, Errors: 0, Skipped: 0, Time elapsed: 14.48 sec
Forking command line: /bin/sh -c cd /x1/jenkins/jenkins-slave/workspace/HBase-TRUNK/trunk
&& /x1/jenkins/tools/java/jdk1.6.0_27-32/jre/bin/java -enableassertions -Xmx1900m
-Djava.security.egd=file:/dev/./urandom -jar /x1/jenkins/jenkins-slave/workspace/HBase-TRUNK/trunk/target/surefire/surefirebooter2942391265040216335.jar
/x1/jenkins/jenkins-slave/workspace/HBase-TRUNK/trunk/target/surefire/surefire5809204720137308202tmp
/x1/jenkins/jenkins-slave/workspace/HBase-TRUNK/trunk/target/surefire/surefire_747593613187495786326tmp
Running org.apache.hadoop.hbase.regionserver.TestHRegion
Tests run: 62, Failures: 0, Errors: 0, Skipped: 0, Time elapsed: 46.7 sec
Forking command line: /bin/sh -c cd /x1/jenkins/jenkins-slave/workspace/HBase-TRUNK/trunk
&& /x1/jenkins/tools/java/jdk1.6.0_27-32/jre/bin/java -enableassertions -Xmx1900m
-Djava.security.egd=file:/dev/./urandom -jar /x1/jenkins/jenkins-slave/workspace/HBase-TRUNK/trunk/target/surefire/surefirebooter7077778339651156455.jar
/x1/jenkins/jenkins-slave/workspace/HBase-TRUNK/trunk/target/surefire/surefire5134487571125529256tmp
/x1/jenkins/jenkins-slave/workspace/HBase-TRUNK/trunk/target/surefire/surefire_754028939549626666679tmp
Running org.apache.hadoop.hbase.rest.TestSchemaResource
Tests run: 2, Failures: 0, Errors: 0, Skipped: 0, Time elapsed: 19.746 sec
Forking command line: /bin/sh -c cd /x1/jenkins/jenkins-slave/workspace/HBase-TRUNK/trunk
&& /x1/jenkins/tools/java/jdk1.6.0_27-32/jre/bin/java -enableassertions -Xmx1900m
-Djava.security.egd=file:/dev/./urandom -jar /x1/jenkins/jenkins-slave/workspace/HBase-TRUNK/trunk/target/surefire/surefirebooter5920450079209493893.jar
/x1/jenkins/jenkins-slave/workspace/HBase-TRUNK/trunk/target/surefire/surefire6845093774696560628tmp
/x1/jenkins/jenkins-slave/workspace/HBase-TRUNK/trunk/target/surefire/surefire_769119662094735628385tmp
Running org.apache.hadoop.hbase.constraint.TestConstraint
Tests run: 5, Failures: 0, Errors: 0, Skipped: 0, Time elapsed: 28.703 sec
Forking command line: /bin/sh -c cd /x1/jenkins/jenkins-slave/workspace/HBase-TRUNK/trunk
&& /x1/jenkins/tools/java/jdk1.6.0_27-32/jre/bin/java -enableassertions -Xmx1900m
-Djava.security.egd=file:/dev/./urandom -jar /x1/jenkins/jenkins-slave/workspace/HBase-TRUNK/trunk/target/surefire/surefirebooter479095087211659069.jar
/x1/jenkins/jenkins-slave/workspace/HBase-TRUNK/trunk/target/surefire/surefire6117751460935261195tmp
/x1/jenkins/jenkins-slave/workspace/HBase-TRUNK/trunk/target/surefire/surefire_775515462336963124422tmp
Running org.apache.hadoop.hbase.rest.client.TestRemoteAdmin
Tests run: 1, Failures: 0, Errors: 0, Skipped: 0, Time elapsed: 15.22 sec
Forking command line: /bin/sh -c cd /x1/jenkins/jenkins-slave/workspace/HBase-TRUNK/trunk
&& /x1/jenkins/tools/java/jdk1.6.0_27-32/jre/bin/java -enableassertions -Xmx1900m
-Djava.security.egd=file:/dev/./urandom -jar /x1/jenkins/jenkins-slave/workspace/HBase-TRUNK/trunk/target/surefire/surefirebooter3624868568969838635.jar
/x1/jenkins/jenkins-slave/workspace/HBase-TRUNK/trunk/target/surefire/surefire793608297449475603tmp
/x1/jenkins/jenkins-slave/workspace/HBase-TRUNK/trunk/target/surefire/surefire_784762570556794526601tmp
Running org.apache.hadoop.hbase.rest.client.TestRemoteTable
Tests run: 3, Failures: 0, Errors: 0, Skipped: 0, Time elapsed: 14.94 sec
Forking command line: /bin/sh -c cd /x1/jenkins/jenkins-slave/workspace/HBase-TRUNK/trunk
&& /x1/jenkins/tools/java/jdk1.6.0_27-32/jre/bin/java -enableassertions -Xmx1900m
-Djava.security.egd=file:/dev/./urandom -jar /x1/jenkins/jenkins-slave/workspace/HBase-TRUNK/trunk/target/surefire/surefirebooter5184394313715430295.jar
/x1/jenkins/jenkins-slave/workspace/HBase-TRUNK/trunk/target/surefire/surefire618708642762511889tmp
/x1/jenkins/jenkins-slave/workspace/HBase-TRUNK/trunk/target/surefire/surefire_794949567637391006913tmp
Running org.apache.hadoop.hbase.rest.TestMultiRowResource
Tests run: 3, Failures: 0, Errors: 0, Skipped: 0, Time elapsed: 12.769 sec
Forking command line: /bin/sh -c cd /x1/jenkins/jenkins-slave/workspace/HBase-TRUNK/trunk
&& /x1/jenkins/tools/java/jdk1.6.0_27-32/jre/bin/java -enableassertions -Xmx1900m
-Djava.security.egd=file:/dev/./urandom -jar /x1/jenkins/jenkins-slave/workspace/HBase-TRUNK/trunk/target/surefire/surefirebooter7934369345012706415.jar
/x1/jenkins/jenkins-slave/workspace/HBase-TRUNK/trunk/target/surefire/surefire6593052291976354687tmp
/x1/jenkins/jenkins-slave/workspace/HBase-TRUNK/trunk/target/surefire/surefire_804211619604763641591tmp
Running org.apache.hadoop.hbase.rest.TestTableResource
Tests run: 8, Failures: 0, Errors: 0, Skipped: 0, Time elapsed: 21.524 sec
Forking command line: /bin/sh -c cd /x1/jenkins/jenkins-slave/workspace/HBase-TRUNK/trunk
&& /x1/jenkins/tools/java/jdk1.6.0_27-32/jre/bin/java -enableassertions -Xmx1900m
-Djava.security.egd=file:/dev/./urandom -jar /x1/jenkins/jenkins-slave/workspace/HBase-TRUNK/trunk/target/surefire/surefirebooter1312286379731529234.jar
/x1/jenkins/jenkins-slave/workspace/HBase-TRUNK/trunk/target/surefire/surefire2764984125848153838tmp
/x1/jenkins/jenkins-slave/workspace/HBase-TRUNK/trunk/target/surefire/surefire_815207622111264101352tmp
Running org.apache.hadoop.hbase.rest.TestGzipFilter
Tests run: 3, Failures: 0, Errors: 0, Skipped: 0, Time elapsed: 12.285 sec
Forking command line: /bin/sh -c cd /x1/jenkins/jenkins-slave/workspace/HBase-TRUNK/trunk
&& /x1/jenkins/tools/java/jdk1.6.0_27-32/jre/bin/java -enableassertions -Xmx1900m
-Djava.security.egd=file:/dev/./urandom -jar /x1/jenkins/jenkins-slave/workspace/HBase-TRUNK/trunk/target/surefire/surefirebooter5552591991884724984.jar
/x1/jenkins/jenkins-slave/workspace/HBase-TRUNK/trunk/target/surefire/surefire2597474201072648341tmp
/x1/jenkins/jenkins-slave/workspace/HBase-TRUNK/trunk/target/surefire/surefire_826728931486841469781tmp
Running org.apache.hadoop.hbase.rest.TestRowResource
Tests run: 11, Failures: 0, Errors: 0, Skipped: 0, Time elapsed: 15.135 sec
Forking command line: /bin/sh -c cd /x1/jenkins/jenkins-slave/workspace/HBase-TRUNK/trunk
&& /x1/jenkins/tools/java/jdk1.6.0_27-32/jre/bin/java -enableassertions -Xmx1900m
-Djava.security.egd=file:/dev/./urandom -jar /x1/jenkins/jenkins-slave/workspace/HBase-TRUNK/trunk/target/surefire/surefirebooter6438519330115869902.jar
/x1/jenkins/jenkins-slave/workspace/HBase-TRUNK/trunk/target/surefire/surefire5840433518398243956tmp
/x1/jenkins/jenkins-slave/workspace/HBase-TRUNK/trunk/target/surefire/surefire_834476863123286259697tmp
Running org.apache.hadoop.hbase.rest.TestVersionResource
Tests run: 7, Failures: 0, Errors: 0, Skipped: 0, Time elapsed: 11.185 sec
Forking command line: /bin/sh -c cd /x1/jenkins/jenkins-slave/workspace/HBase-TRUNK/trunk
&& /x1/jenkins/tools/java/jdk1.6.0_27-32/jre/bin/java -enableassertions -Xmx1900m
-Djava.security.egd=file:/dev/./urandom -jar /x1/jenkins/jenkins-slave/workspace/HBase-TRUNK/trunk/target/surefire/surefirebooter8670882450187759460.jar
/x1/jenkins/jenkins-slave/workspace/HBase-TRUNK/trunk/target/surefire/surefire5796167389390340442tmp
/x1/jenkins/jenkins-slave/workspace/HBase-TRUNK/trunk/target/surefire/surefire_841286540448423646830tmp
Running org.apache.hadoop.hbase.rest.TestScannerResource
Tests run: 5, Failures: 0, Errors: 0, Skipped: 0, Time elapsed: 27.274 sec
Forking command line: /bin/sh -c cd /x1/jenkins/jenkins-slave/workspace/HBase-TRUNK/trunk
&& /x1/jenkins/tools/java/jdk1.6.0_27-32/jre/bin/java -enableassertions -Xmx1900m
-Djava.security.egd=file:/dev/./urandom -jar /x1/jenkins/jenkins-slave/workspace/HBase-TRUNK/trunk/target/surefire/surefirebooter3022342249875309977.jar
/x1/jenkins/jenkins-slave/workspace/HBase-TRUNK/trunk/target/surefire/surefire2220361636108904187tmp
/x1/jenkins/jenkins-slave/workspace/HBase-TRUNK/trunk/target/surefire/surefire_852134032148878806180tmp
Running org.apache.hadoop.hbase.rest.TestStatusResource
Tests run: 2, Failures: 0, Errors: 0, Skipped: 0, Time elapsed: 10.898 sec
Forking command line: /bin/sh -c cd /x1/jenkins/jenkins-slave/workspace/HBase-TRUNK/trunk
&& /x1/jenkins/tools/java/jdk1.6.0_27-32/jre/bin/java -enableassertions -Xmx1900m
-Djava.security.egd=file:/dev/./urandom -jar /x1/jenkins/jenkins-slave/workspace/HBase-TRUNK/trunk/target/surefire/surefirebooter4917300906332199344.jar
/x1/jenkins/jenkins-slave/workspace/HBase-TRUNK/trunk/target/surefire/surefire7002417615827417497tmp
/x1/jenkins/jenkins-slave/workspace/HBase-TRUNK/trunk/target/surefire/surefire_863395968732939345882tmp
Running org.apache.hadoop.hbase.metrics.TestMetricsMBeanBase
Tests run: 2, Failures: 0, Errors: 0, Skipped: 0, Time elapsed: 1.121 sec
Forking command line: /bin/sh -c cd /x1/jenkins/jenkins-slave/workspace/HBase-TRUNK/trunk
&& /x1/jenkins/tools/java/jdk1.6.0_27-32/jre/bin/java -enableassertions -Xmx1900m
-Djava.security.egd=file:/dev/./urandom -jar /x1/jenkins/jenkins-slave/workspace/HBase-TRUNK/trunk/target/surefire/surefirebooter5302190674532622513.jar
/x1/jenkins/jenkins-slave/workspace/HBase-TRUNK/trunk/target/surefire/surefire8178810244767725433tmp
/x1/jenkins/jenkins-slave/workspace/HBase-TRUNK/trunk/target/surefire/surefire_87440684145851618194tmp
Running org.apache.hadoop.hbase.io.hfile.TestHFileBlockIndex
Tests run: 10, Failures: 0, Errors: 0, Skipped: 0, Time elapsed: 6.872 sec
Forking command line: /bin/sh -c cd /x1/jenkins/jenkins-slave/workspace/HBase-TRUNK/trunk
&& /x1/jenkins/tools/java/jdk1.6.0_27-32/jre/bin/java -enableassertions -Xmx1900m
-Djava.security.egd=file:/dev/./urandom -jar /x1/jenkins/jenkins-slave/workspace/HBase-TRUNK/trunk/target/surefire/surefirebooter254299888162009316.jar
/x1/jenkins/jenkins-slave/workspace/HBase-TRUNK/trunk/target/surefire/surefire3097656509802318520tmp
/x1/jenkins/jenkins-slave/workspace/HBase-TRUNK/trunk/target/surefire/surefire_887901381159272329430tmp
Running org.apache.hadoop.hbase.rest.TestScannersWithFilters
Tests run: 10, Failures: 0, Errors: 0, Skipped: 0, Time elapsed: 17.847 sec
Forking command line: /bin/sh -c cd /x1/jenkins/jenkins-slave/workspace/HBase-TRUNK/trunk
&& /x1/jenkins/tools/java/jdk1.6.0_27-32/jre/bin/java -enableassertions -Xmx1900m
-Djava.security.egd=file:/dev/./urandom -jar /x1/jenkins/jenkins-slave/workspace/HBase-TRUNK/trunk/target/surefire/surefirebooter8353466998082542979.jar
/x1/jenkins/jenkins-slave/workspace/HBase-TRUNK/trunk/target/surefire/surefire1368753834072151826tmp
/x1/jenkins/jenkins-slave/workspace/HBase-TRUNK/trunk/target/surefire/surefire_899210464715850807943tmp
Running org.apache.hadoop.hbase.io.hfile.TestHFileSeek
Tests run: 1, Failures: 0, Errors: 0, Skipped: 0, Time elapsed: 6.314 sec
Forking command line: /bin/sh -c cd /x1/jenkins/jenkins-slave/workspace/HBase-TRUNK/trunk
&& /x1/jenkins/tools/java/jdk1.6.0_27-32/jre/bin/java -enableassertions -Xmx1900m
-Djava.security.egd=file:/dev/./urandom -jar /x1/jenkins/jenkins-slave/workspace/HBase-TRUNK/trunk/target/surefire/surefirebooter7580876586275746717.jar
/x1/jenkins/jenkins-slave/workspace/HBase-TRUNK/trunk/target/surefire/surefire4738969199177268169tmp
/x1/jenkins/jenkins-slave/workspace/HBase-TRUNK/trunk/target/surefire/surefire_907785614903755537286tmp
Running org.apache.hadoop.hbase.io.hfile.TestLruBlockCache
Tests run: 16, Failures: 0, Errors: 0, Skipped: 0, Time elapsed: 0.86 sec
Forking command line: /bin/sh -c cd /x1/jenkins/jenkins-slave/workspace/HBase-TRUNK/trunk
&& /x1/jenkins/tools/java/jdk1.6.0_27-32/jre/bin/java -enableassertions -Xmx1900m
-Djava.security.egd=file:/dev/./urandom -jar /x1/jenkins/jenkins-slave/workspace/HBase-TRUNK/trunk/target/surefire/surefirebooter2902292472657347178.jar
/x1/jenkins/jenkins-slave/workspace/HBase-TRUNK/trunk/target/surefire/surefire2380602000988506581tmp
/x1/jenkins/jenkins-slave/workspace/HBase-TRUNK/trunk/target/surefire/surefire_917543881650476100960tmp
Running org.apache.hadoop.hbase.io.hfile.TestFixedFileTrailer
Tests run: 2, Failures: 0, Errors: 0, Skipped: 0, Time elapsed: 0.531 sec
Forking command line: /bin/sh -c cd /x1/jenkins/jenkins-slave/workspace/HBase-TRUNK/trunk
&& /x1/jenkins/tools/java/jdk1.6.0_27-32/jre/bin/java -enableassertions -Xmx1900m
-Djava.security.egd=file:/dev/./urandom -jar /x1/jenkins/jenkins-slave/workspace/HBase-TRUNK/trunk/target/surefire/surefirebooter2429501721347957604.jar
/x1/jenkins/jenkins-slave/workspace/HBase-TRUNK/trunk/target/surefire/surefire423341176534978247tmp
/x1/jenkins/jenkins-slave/workspace/HBase-TRUNK/trunk/target/surefire/surefire_927516336848506304816tmp
Running org.apache.hadoop.hbase.io.hfile.TestHFilePerformance
Tests run: 1, Failures: 0, Errors: 0, Skipped: 0, Time elapsed: 4.656 sec
Forking command line: /bin/sh -c cd /x1/jenkins/jenkins-slave/workspace/HBase-TRUNK/trunk
&& /x1/jenkins/tools/java/jdk1.6.0_27-32/jre/bin/java -enableassertions -Xmx1900m
-Djava.security.egd=file:/dev/./urandom -jar /x1/jenkins/jenkins-slave/workspace/HBase-TRUNK/trunk/target/surefire/surefirebooter2288148111204315901.jar
/x1/jenkins/jenkins-slave/workspace/HBase-TRUNK/trunk/target/surefire/surefire3745118918968716202tmp
/x1/jenkins/jenkins-slave/workspace/HBase-TRUNK/trunk/target/surefire/surefire_934489795050250371373tmp
Running org.apache.hadoop.hbase.io.hfile.TestHFileBlockCompatibility
Tests run: 10, Failures: 0, Errors: 0, Skipped: 0, Time elapsed: 0.889 sec
Forking command line: /bin/sh -c cd /x1/jenkins/jenkins-slave/workspace/HBase-TRUNK/trunk
&& /x1/jenkins/tools/java/jdk1.6.0_27-32/jre/bin/java -enableassertions -Xmx1900m
-Djava.security.egd=file:/dev/./urandom -jar /x1/jenkins/jenkins-slave/workspace/HBase-TRUNK/trunk/target/surefire/surefirebooter8277648053037222461.jar
/x1/jenkins/jenkins-slave/workspace/HBase-TRUNK/trunk/target/surefire/surefire5624622597601873292tmp
/x1/jenkins/jenkins-slave/workspace/HBase-TRUNK/trunk/target/surefire/surefire_942667146900891841271tmp
Running org.apache.hadoop.hbase.io.hfile.TestCacheOnWrite
Tests run: 36, Failures: 0, Errors: 0, Skipped: 0, Time elapsed: 24.352 sec
Forking command line: /bin/sh -c cd /x1/jenkins/jenkins-slave/workspace/HBase-TRUNK/trunk
&& /x1/jenkins/tools/java/jdk1.6.0_27-32/jre/bin/java -enableassertions -Xmx1900m
-Djava.security.egd=file:/dev/./urandom -jar /x1/jenkins/jenkins-slave/workspace/HBase-TRUNK/trunk/target/surefire/surefirebooter3683186022524221505.jar
/x1/jenkins/jenkins-slave/workspace/HBase-TRUNK/trunk/target/surefire/surefire5866189481994597088tmp
/x1/jenkins/jenkins-slave/workspace/HBase-TRUNK/trunk/target/surefire/surefire_951139139253411322856tmp
Running org.apache.hadoop.hbase.io.hfile.TestForceCacheImportantBlocks
Tests run: 4, Failures: 0, Errors: 0, Skipped: 0, Time elapsed: 34.386 sec
Running org.apache.hadoop.hbase.io.hfile.TestChecksum
Tests run: 3, Failures: 0, Errors: 0, Skipped: 0, Time elapsed: 0.702 sec
Forking command line: /bin/sh -c cd /x1/jenkins/jenkins-slave/workspace/HBase-TRUNK/trunk
&& /x1/jenkins/tools/java/jdk1.6.0_27-32/jre/bin/java -enableassertions -Xmx1900m
-Djava.security.egd=file:/dev/./urandom -jar /x1/jenkins/jenkins-slave/workspace/HBase-TRUNK/trunk/target/surefire/surefirebooter3797235764238044005.jar
/x1/jenkins/jenkins-slave/workspace/HBase-TRUNK/trunk/target/surefire/surefire1154471961630503397tmp
/x1/jenkins/jenkins-slave/workspace/HBase-TRUNK/trunk/target/surefire/surefire_967166232843359657110tmp
Forking command line: /bin/sh -c cd /x1/jenkins/jenkins-slave/workspace/HBase-TRUNK/trunk
&& /x1/jenkins/tools/java/jdk1.6.0_27-32/jre/bin/java -enableassertions -Xmx1900m
-Djava.security.egd=file:/dev/./urandom -jar /x1/jenkins/jenkins-slave/workspace/HBase-TRUNK/trunk/target/surefire/surefirebooter8349973644943191472.jar
/x1/jenkins/jenkins-slave/workspace/HBase-TRUNK/trunk/target/surefire/surefire5227892712077822114tmp
/x1/jenkins/jenkins-slave/workspace/HBase-TRUNK/trunk/target/surefire/surefire_974683075019222628973tmp
Running org.apache.hadoop.hbase.io.hfile.slab.TestSlabCache
Tests run: 7, Failures: 0, Errors: 0, Skipped: 0, Time elapsed: 9.359 sec
Forking command line: /bin/sh -c cd /x1/jenkins/jenkins-slave/workspace/HBase-TRUNK/trunk
&& /x1/jenkins/tools/java/jdk1.6.0_27-32/jre/bin/java -enableassertions -Xmx1900m
-Djava.security.egd=file:/dev/./urandom -jar /x1/jenkins/jenkins-slave/workspace/HBase-TRUNK/trunk/target/surefire/surefirebooter829325540521732466.jar
/x1/jenkins/jenkins-slave/workspace/HBase-TRUNK/trunk/target/surefire/surefire3420862183896672187tmp
/x1/jenkins/jenkins-slave/workspace/HBase-TRUNK/trunk/target/surefire/surefire_988362870971719856327tmp
Running org.apache.hadoop.hbase.io.hfile.slab.TestSingleSizeCache
Tests run: 5, Failures: 0, Errors: 0, Skipped: 0, Time elapsed: 15.711 sec
Forking command line: /bin/sh -c cd /x1/jenkins/jenkins-slave/workspace/HBase-TRUNK/trunk
&& /x1/jenkins/tools/java/jdk1.6.0_27-32/jre/bin/java -enableassertions -Xmx1900m
-Djava.security.egd=file:/dev/./urandom -jar /x1/jenkins/jenkins-slave/workspace/HBase-TRUNK/trunk/target/surefire/surefirebooter6171163739373083010.jar
/x1/jenkins/jenkins-slave/workspace/HBase-TRUNK/trunk/target/surefire/surefire8144755857467808227tmp
/x1/jenkins/jenkins-slave/workspace/HBase-TRUNK/trunk/target/surefire/surefire_991670638187885693837tmp
Running org.apache.hadoop.hbase.io.hfile.TestHFileBlock
Tests run: 16, Failures: 0, Errors: 0, Skipped: 0, Time elapsed: 45.835 sec
Forking command line: /bin/sh -c cd /x1/jenkins/jenkins-slave/workspace/HBase-TRUNK/trunk
&& /x1/jenkins/tools/java/jdk1.6.0_27-32/jre/bin/java -enableassertions -Xmx1900m
-Djava.security.egd=file:/dev/./urandom -jar /x1/jenkins/jenkins-slave/workspace/HBase-TRUNK/trunk/target/surefire/surefirebooter7585604409975056465.jar
/x1/jenkins/jenkins-slave/workspace/HBase-TRUNK/trunk/target/surefire/surefire8684823528198256916tmp
/x1/jenkins/jenkins-slave/workspace/HBase-TRUNK/trunk/target/surefire/surefire_1008718352846723567784tmp
Running org.apache.hadoop.hbase.replication.TestReplicationZookeeper
Tests run: 1, Failures: 0, Errors: 0, Skipped: 0, Time elapsed: 0.581 sec
Forking command line: /bin/sh -c cd /x1/jenkins/jenkins-slave/workspace/HBase-TRUNK/trunk
&& /x1/jenkins/tools/java/jdk1.6.0_27-32/jre/bin/java -enableassertions -Xmx1900m
-Djava.security.egd=file:/dev/./urandom -jar /x1/jenkins/jenkins-slave/workspace/HBase-TRUNK/trunk/target/surefire/surefirebooter2316553995992295898.jar
/x1/jenkins/jenkins-slave/workspace/HBase-TRUNK/trunk/target/surefire/surefire2883677879699284070tmp
/x1/jenkins/jenkins-slave/workspace/HBase-TRUNK/trunk/target/surefire/surefire_101990351134456413240tmp
Running org.apache.hadoop.hbase.io.encoding.TestLoadAndSwitchEncodeOnDisk
Tests run: 1, Failures: 0, Errors: 0, Skipped: 0, Time elapsed: 22.096 sec
Forking command line: /bin/sh -c cd /x1/jenkins/jenkins-slave/workspace/HBase-TRUNK/trunk
&& /x1/jenkins/tools/java/jdk1.6.0_27-32/jre/bin/java -enableassertions -Xmx1900m
-Djava.security.egd=file:/dev/./urandom -jar /x1/jenkins/jenkins-slave/workspace/HBase-TRUNK/trunk/target/surefire/surefirebooter7269103007968972848.jar
/x1/jenkins/jenkins-slave/workspace/HBase-TRUNK/trunk/target/surefire/surefire4959401817434178496tmp
/x1/jenkins/jenkins-slave/workspace/HBase-TRUNK/trunk/target/surefire/surefire_1026563196080636118246tmp
Running org.apache.hadoop.hbase.replication.regionserver.TestReplicationSourceManager
Tests run: 1, Failures: 0, Errors: 0, Skipped: 0, Time elapsed: 0.881 sec
Forking command line: /bin/sh -c cd /x1/jenkins/jenkins-slave/workspace/HBase-TRUNK/trunk
&& /x1/jenkins/tools/java/jdk1.6.0_27-32/jre/bin/java -enableassertions -Xmx1900m
-Djava.security.egd=file:/dev/./urandom -jar /x1/jenkins/jenkins-slave/workspace/HBase-TRUNK/trunk/target/surefire/surefirebooter4604577189211295710.jar
/x1/jenkins/jenkins-slave/workspace/HBase-TRUNK/trunk/target/surefire/surefire5724559579497587989tmp
/x1/jenkins/jenkins-slave/workspace/HBase-TRUNK/trunk/target/surefire/surefire_103765134759483087981tmp
Running org.apache.hadoop.hbase.replication.TestReplicationSource
Tests run: 1, Failures: 0, Errors: 0, Skipped: 0, Time elapsed: 2.438 sec
Forking command line: /bin/sh -c cd /x1/jenkins/jenkins-slave/workspace/HBase-TRUNK/trunk
&& /x1/jenkins/tools/java/jdk1.6.0_27-32/jre/bin/java -enableassertions -Xmx1900m
-Djava.security.egd=file:/dev/./urandom -jar /x1/jenkins/jenkins-slave/workspace/HBase-TRUNK/trunk/target/surefire/surefirebooter3436828039890551448.jar
/x1/jenkins/jenkins-slave/workspace/HBase-TRUNK/trunk/target/surefire/surefire7201973368784870343tmp
/x1/jenkins/jenkins-slave/workspace/HBase-TRUNK/trunk/target/surefire/surefire_1044420807082654175425tmp
Running org.apache.hadoop.hbase.replication.TestReplicationPeer
Tests run: 1, Failures: 0, Errors: 0, Skipped: 0, Time elapsed: 1.427 sec
Forking command line: /bin/sh -c cd /x1/jenkins/jenkins-slave/workspace/HBase-TRUNK/trunk
&& /x1/jenkins/tools/java/jdk1.6.0_27-32/jre/bin/java -enableassertions -Xmx1900m
-Djava.security.egd=file:/dev/./urandom -jar /x1/jenkins/jenkins-slave/workspace/HBase-TRUNK/trunk/target/surefire/surefirebooter7191523534111098588.jar
/x1/jenkins/jenkins-slave/workspace/HBase-TRUNK/trunk/target/surefire/surefire3632669746727477622tmp
/x1/jenkins/jenkins-slave/workspace/HBase-TRUNK/trunk/target/surefire/surefire_1053961334340686977568tmp
Running org.apache.hadoop.hbase.util.TestFSTableDescriptors
Tests run: 10, Failures: 0, Errors: 0, Skipped: 0, Time elapsed: 0.833 sec
Forking command line: /bin/sh -c cd /x1/jenkins/jenkins-slave/workspace/HBase-TRUNK/trunk
&& /x1/jenkins/tools/java/jdk1.6.0_27-32/jre/bin/java -enableassertions -Xmx1900m
-Djava.security.egd=file:/dev/./urandom -jar /x1/jenkins/jenkins-slave/workspace/HBase-TRUNK/trunk/target/surefire/surefirebooter7149790206467454842.jar
/x1/jenkins/jenkins-slave/workspace/HBase-TRUNK/trunk/target/surefire/surefire1098099325140032720tmp
/x1/jenkins/jenkins-slave/workspace/HBase-TRUNK/trunk/target/surefire/surefire_1066662326697031948937tmp
Running org.apache.hadoop.hbase.util.TestIdLock
Tests run: 1, Failures: 0, Errors: 0, Skipped: 0, Time elapsed: 15.311 sec
Forking command line: /bin/sh -c cd /x1/jenkins/jenkins-slave/workspace/HBase-TRUNK/trunk
&& /x1/jenkins/tools/java/jdk1.6.0_27-32/jre/bin/java -enableassertions -Xmx1900m
-Djava.security.egd=file:/dev/./urandom -jar /x1/jenkins/jenkins-slave/workspace/HBase-TRUNK/trunk/target/surefire/surefirebooter728030444525344846.jar
/x1/jenkins/jenkins-slave/workspace/HBase-TRUNK/trunk/target/surefire/surefire6905070277936097602tmp
/x1/jenkins/jenkins-slave/workspace/HBase-TRUNK/trunk/target/surefire/surefire_107329001798427342058tmp
Running org.apache.hadoop.hbase.util.TestEnvironmentEdgeManager
Tests run: 2, Failures: 0, Errors: 0, Skipped: 0, Time elapsed: 0.292 sec
Forking command line: /bin/sh -c cd /x1/jenkins/jenkins-slave/workspace/HBase-TRUNK/trunk
&& /x1/jenkins/tools/java/jdk1.6.0_27-32/jre/bin/java -enableassertions -Xmx1900m
-Djava.security.egd=file:/dev/./urandom -jar /x1/jenkins/jenkins-slave/workspace/HBase-TRUNK/trunk/target/surefire/surefirebooter2177722222234841097.jar
/x1/jenkins/jenkins-slave/workspace/HBase-TRUNK/trunk/target/surefire/surefire7148198786661542091tmp
/x1/jenkins/jenkins-slave/workspace/HBase-TRUNK/trunk/target/surefire/surefire_1082830604478925545636tmp
Running org.apache.hadoop.hbase.replication.regionserver.TestReplicationSink
Tests run: 5, Failures: 0, Errors: 0, Skipped: 0, Time elapsed: 28.754 sec
Forking command line: /bin/sh -c cd /x1/jenkins/jenkins-slave/workspace/HBase-TRUNK/trunk
&& /x1/jenkins/tools/java/jdk1.6.0_27-32/jre/bin/java -enableassertions -Xmx1900m
-Djava.security.egd=file:/dev/./urandom -jar /x1/jenkins/jenkins-slave/workspace/HBase-TRUNK/trunk/target/surefire/surefirebooter5999981671318594559.jar
/x1/jenkins/jenkins-slave/workspace/HBase-TRUNK/trunk/target/surefire/surefire3945803691250201553tmp
/x1/jenkins/jenkins-slave/workspace/HBase-TRUNK/trunk/target/surefire/surefire_1094538294237210833040tmp
Running org.apache.hadoop.hbase.util.TestMergeTable
Tests run: 1, Failures: 0, Errors: 0, Skipped: 0, Time elapsed: 25.678 sec
Forking command line: /bin/sh -c cd /x1/jenkins/jenkins-slave/workspace/HBase-TRUNK/trunk
&& /x1/jenkins/tools/java/jdk1.6.0_27-32/jre/bin/java -enableassertions -Xmx1900m
-Djava.security.egd=file:/dev/./urandom -jar /x1/jenkins/jenkins-slave/workspace/HBase-TRUNK/trunk/target/surefire/surefirebooter4692533210653343486.jar
/x1/jenkins/jenkins-slave/workspace/HBase-TRUNK/trunk/target/surefire/surefire1093205482836178881tmp
/x1/jenkins/jenkins-slave/workspace/HBase-TRUNK/trunk/target/surefire/surefire_1105040831622600034853tmp
Running org.apache.hadoop.hbase.util.TestFSUtils
Tests run: 3, Failures: 1, Errors: 0, Skipped: 0, Time elapsed: 18.678 sec <<< FAILURE!
Forking command line: /bin/sh -c cd /x1/jenkins/jenkins-slave/workspace/HBase-TRUNK/trunk
&& /x1/jenkins/tools/java/jdk1.6.0_27-32/jre/bin/java -enableassertions -Xmx1900m
-Djava.security.egd=file:/dev/./urandom -jar /x1/jenkins/jenkins-slave/workspace/HBase-TRUNK/trunk/target/surefire/surefirebooter2320742023730321674.jar
/x1/jenkins/jenkins-slave/workspace/HBase-TRUNK/trunk/target/surefire/surefire2803130780678714459tmp
/x1/jenkins/jenkins-slave/workspace/HBase-TRUNK/trunk/target/surefire/surefire_1117123718535427253240tmp
Running org.apache.hadoop.hbase.util.TestPoolMap$TestRoundRobinPoolType
Tests run: 3, Failures: 0, Errors: 0, Skipped: 0, Time elapsed: 0.006 sec
Running org.apache.hadoop.hbase.util.TestPoolMap$TestThreadLocalPoolType
Tests run: 3, Failures: 0, Errors: 0, Skipped: 0, Time elapsed: 0.001 sec
Running org.apache.hadoop.hbase.util.TestPoolMap$TestReusablePoolType
Tests run: 3, Failures: 0, Errors: 0, Skipped: 0, Time elapsed: 0.018 sec
Forking command line: /bin/sh -c cd /x1/jenkins/jenkins-slave/workspace/HBase-TRUNK/trunk
&& /x1/jenkins/tools/java/jdk1.6.0_27-32/jre/bin/java -enableassertions -Xmx1900m
-Djava.security.egd=file:/dev/./urandom -jar /x1/jenkins/jenkins-slave/workspace/HBase-TRUNK/trunk/target/surefire/surefirebooter7541315513375408400.jar
/x1/jenkins/jenkins-slave/workspace/HBase-TRUNK/trunk/target/surefire/surefire8149778994576691836tmp
/x1/jenkins/jenkins-slave/workspace/HBase-TRUNK/trunk/target/surefire/surefire_1122181229859887343244tmp
Running org.apache.hadoop.hbase.util.TestRegionSplitter
Tests run: 5, Failures: 0, Errors: 0, Skipped: 0, Time elapsed: 17.967 sec
Forking command line: /bin/sh -c cd /x1/jenkins/jenkins-slave/workspace/HBase-TRUNK/trunk
&& /x1/jenkins/tools/java/jdk1.6.0_27-32/jre/bin/java -enableassertions -Xmx1900m
-Djava.security.egd=file:/dev/./urandom -jar /x1/jenkins/jenkins-slave/workspace/HBase-TRUNK/trunk/target/surefire/surefirebooter1577132877572373543.jar
/x1/jenkins/jenkins-slave/workspace/HBase-TRUNK/trunk/target/surefire/surefire1676872692892419630tmp
/x1/jenkins/jenkins-slave/workspace/HBase-TRUNK/trunk/target/surefire/surefire_1134067227074365631099tmp
Running org.apache.hadoop.hbase.util.hbck.TestOfflineMetaRebuildBase
Tests run: 1, Failures: 0, Errors: 0, Skipped: 0, Time elapsed: 18.855 sec
Forking command line: /bin/sh -c cd /x1/jenkins/jenkins-slave/workspace/HBase-TRUNK/trunk
&& /x1/jenkins/tools/java/jdk1.6.0_27-32/jre/bin/java -enableassertions -Xmx1900m
-Djava.security.egd=file:/dev/./urandom -jar /x1/jenkins/jenkins-slave/workspace/HBase-TRUNK/trunk/target/surefire/surefirebooter5490694186945447146.jar
/x1/jenkins/jenkins-slave/workspace/HBase-TRUNK/trunk/target/surefire/surefire5256780638616707518tmp
/x1/jenkins/jenkins-slave/workspace/HBase-TRUNK/trunk/target/surefire/surefire_1144077569793885734527tmp
Running org.apache.hadoop.hbase.util.hbck.TestOfflineMetaRebuildOverlap
Tests run: 1, Failures: 0, Errors: 0, Skipped: 0, Time elapsed: 17.783 sec
Forking command line: /bin/sh -c cd /x1/jenkins/jenkins-slave/workspace/HBase-TRUNK/trunk
&& /x1/jenkins/tools/java/jdk1.6.0_27-32/jre/bin/java -enableassertions -Xmx1900m
-Djava.security.egd=file:/dev/./urandom -jar /x1/jenkins/jenkins-slave/workspace/HBase-TRUNK/trunk/target/surefire/surefirebooter4233002996798329380.jar
/x1/jenkins/jenkins-slave/workspace/HBase-TRUNK/trunk/target/surefire/surefire903609018834031850tmp
/x1/jenkins/jenkins-slave/workspace/HBase-TRUNK/trunk/target/surefire/surefire_1151391269191017542645tmp
Running org.apache.hadoop.hbase.util.hbck.TestOfflineMetaRebuildHole
Tests run: 1, Failures: 0, Errors: 0, Skipped: 0, Time elapsed: 17.637 sec
Forking command line: /bin/sh -c cd /x1/jenkins/jenkins-slave/workspace/HBase-TRUNK/trunk
&& /x1/jenkins/tools/java/jdk1.6.0_27-32/jre/bin/java -enableassertions -Xmx1900m
-Djava.security.egd=file:/dev/./urandom -jar /x1/jenkins/jenkins-slave/workspace/HBase-TRUNK/trunk/target/surefire/surefirebooter8417181598232871497.jar
/x1/jenkins/jenkins-slave/workspace/HBase-TRUNK/trunk/target/surefire/surefire3117382412311200851tmp
/x1/jenkins/jenkins-slave/workspace/HBase-TRUNK/trunk/target/surefire/surefire_1164499798286320802397tmp
Running org.apache.hadoop.hbase.util.TestDefaultEnvironmentEdge
Tests run: 1, Failures: 0, Errors: 0, Skipped: 0, Time elapsed: 0.203 sec
Forking command line: /bin/sh -c cd /x1/jenkins/jenkins-slave/workspace/HBase-TRUNK/trunk
&& /x1/jenkins/tools/java/jdk1.6.0_27-32/jre/bin/java -enableassertions -Xmx1900m
-Djava.security.egd=file:/dev/./urandom -jar /x1/jenkins/jenkins-slave/workspace/HBase-TRUNK/trunk/target/surefire/surefirebooter6679593196780046275.jar
/x1/jenkins/jenkins-slave/workspace/HBase-TRUNK/trunk/target/surefire/surefire6584774023812015919tmp
/x1/jenkins/jenkins-slave/workspace/HBase-TRUNK/trunk/target/surefire/surefire_1178781284101534030076tmp
Running org.apache.hadoop.hbase.TestInfoServers
Tests run: 2, Failures: 0, Errors: 0, Skipped: 0, Time elapsed: 11.39 sec
Running org.apache.hadoop.hbase.util.TestHBaseFsck
Tests run: 16, Failures: 0, Errors: 0, Skipped: 0, Time elapsed: 163.172 sec

Results :

Failed tests:   testcomputeHDFSBlocksDistribution(org.apache.hadoop.hbase.util.TestFSUtils):
Wrong number of hosts distributing blocks. expected:<3> but was:<2>

Tests run: 621, Failures: 1, Errors: 0, Skipped: 2

[INFO] ------------------------------------------------------------------------
[INFO] BUILD FAILURE
[INFO] ------------------------------------------------------------------------
[INFO] Total time: 26:21.631s
[INFO] Finished at: Fri Apr 13 19:35:53 UTC 2012
[INFO] Final Memory: 59M/982M
[INFO] ------------------------------------------------------------------------
[ERROR] Failed to execute goal org.apache.maven.plugins:maven-surefire-plugin:2.12-TRUNK-HBASE-2:test
(secondPartTestsExecution) on project hbase: There are test failures.
[ERROR] 
[ERROR] Please refer to /x1/jenkins/jenkins-slave/workspace/HBase-TRUNK/trunk/target/surefire-reports
for the individual test results.
[ERROR] -> [Help 1]
org.apache.maven.lifecycle.LifecycleExecutionException: Failed to execute goal org.apache.maven.plugins:maven-surefire-plugin:2.12-TRUNK-HBASE-2:test
(secondPartTestsExecution) on project hbase: There are test failures.

Please refer to /x1/jenkins/jenkins-slave/workspace/HBase-TRUNK/trunk/target/surefire-reports
for the individual test results.
	at org.apache.maven.lifecycle.internal.MojoExecutor.execute(MojoExecutor.java:213)
	at org.apache.maven.lifecycle.internal.MojoExecutor.execute(MojoExecutor.java:153)
	at org.apache.maven.lifecycle.internal.MojoExecutor.execute(MojoExecutor.java:145)
	at org.apache.maven.lifecycle.internal.LifecycleModuleBuilder.buildProject(LifecycleModuleBuilder.java:84)
	at org.apache.maven.lifecycle.internal.LifecycleModuleBuilder.buildProject(LifecycleModuleBuilder.java:59)
	at org.apache.maven.lifecycle.internal.LifecycleStarter.singleThreadedBuild(LifecycleStarter.java:183)
	at org.apache.maven.lifecycle.internal.LifecycleStarter.execute(LifecycleStarter.java:161)
	at org.apache.maven.DefaultMaven.doExecute(DefaultMaven.java:319)
	at org.apache.maven.DefaultMaven.execute(DefaultMaven.java:156)
	at org.apache.maven.cli.MavenCli.execute(MavenCli.java:537)
	at org.apache.maven.cli.MavenCli.doMain(MavenCli.java:196)
	at org.apache.maven.cli.MavenCli.main(MavenCli.java:141)
	at sun.reflect.NativeMethodAccessorImpl.invoke0(Native Method)
	at sun.reflect.NativeMethodAccessorImpl.invoke(NativeMethodAccessorImpl.java:39)
	at sun.reflect.DelegatingMethodAccessorImpl.invoke(DelegatingMethodAccessorImpl.java:25)
	at java.lang.reflect.Method.invoke(Method.java:597)
	at org.codehaus.plexus.classworlds.launcher.Launcher.launchEnhanced(Launcher.java:290)
	at org.codehaus.plexus.classworlds.launcher.Launcher.launch(Launcher.java:230)
	at org.codehaus.plexus.classworlds.launcher.Launcher.mainWithExitCode(Launcher.java:409)
	at org.codehaus.plexus.classworlds.launcher.Launcher.main(Launcher.java:352)
Caused by: org.apache.maven.plugin.MojoFailureException: There are test failures.

Please refer to /x1/jenkins/jenkins-slave/workspace/HBase-TRUNK/trunk/target/surefire-reports
for the individual test results.
	at org.apache.maven.plugin.surefire.SurefireHelper.reportExecution(SurefireHelper.java:87)
	at org.apache.maven.plugin.surefire.SurefirePlugin.writeSummary(SurefirePlugin.java:651)
	at org.apache.maven.plugin.surefire.SurefirePlugin.handleSummary(SurefirePlugin.java:625)
	at org.apache.maven.plugin.surefire.AbstractSurefireMojo.executeAfterPreconditionsChecked(AbstractSurefireMojo.java:137)
	at org.apache.maven.plugin.surefire.AbstractSurefireMojo.execute(AbstractSurefireMojo.java:98)
	at org.apache.maven.plugin.DefaultBuildPluginManager.executeMojo(DefaultBuildPluginManager.java:101)
	at org.apache.maven.lifecycle.internal.MojoExecutor.execute(MojoExecutor.java:209)
	... 19 more
[ERROR] 
[ERROR] 
[ERROR] For more information about the errors and possible solutions, please read the following
articles:
[ERROR] [Help 1] http://cwiki.apache.org/confluence/display/MAVEN/MojoFailureException
Build step 'Invoke top-level Maven targets' marked build as failure
Archiving artifacts
Recording test results
Updating HBASE-5772

Mime
View raw message