hbase-dev mailing list archives

Site index · List index
Message view « Date » · « Thread »
Top « Date » · « Thread »
From Apache Jenkins Server <jenk...@builds.apache.org>
Subject Build failed in Jenkins: HBase-0.92 #349
Date Mon, 02 Apr 2012 06:13:13 GMT
See <https://builds.apache.org/job/HBase-0.92/349/changes>

Changes:

[tedyu] HBASE-5436  Right-size the map when reading attributes (Benoit)

------------------------------------------
[...truncated 7035 lines...]
Running org.apache.hadoop.hbase.regionserver.TestHRegion
Tests run: 60, Failures: 0, Errors: 0, Skipped: 0, Time elapsed: 40.566 sec
Forking command line: /bin/sh -c cd <https://builds.apache.org/job/HBase-0.92/ws/trunk>
&& /home/jenkins/tools/java/jdk1.6.0_27-32/jre/bin/java -enableassertions -Xmx1400m
-Djava.security.egd=file:/dev/./urandom -jar <https://builds.apache.org/job/HBase-0.92/ws/trunk/target/surefire/surefirebooter5255384335223492693.jar>
<https://builds.apache.org/job/HBase-0.92/ws/trunk/target/surefire/surefire7341072576069345603tmp>
<https://builds.apache.org/job/HBase-0.92/ws/trunk/target/surefire/surefire5142520052789447756tmp>
Running org.apache.hadoop.hbase.regionserver.TestMasterAddressManager
Tests run: 1, Failures: 0, Errors: 0, Skipped: 0, Time elapsed: 0.639 sec
Forking command line: /bin/sh -c cd <https://builds.apache.org/job/HBase-0.92/ws/trunk>
&& /home/jenkins/tools/java/jdk1.6.0_27-32/jre/bin/java -enableassertions -Xmx1400m
-Djava.security.egd=file:/dev/./urandom -jar <https://builds.apache.org/job/HBase-0.92/ws/trunk/target/surefire/surefirebooter4131231609932028641.jar>
<https://builds.apache.org/job/HBase-0.92/ws/trunk/target/surefire/surefire6377887131898911196tmp>
<https://builds.apache.org/job/HBase-0.92/ws/trunk/target/surefire/surefire2218945127931883956tmp>
Running org.apache.hadoop.hbase.regionserver.TestCompoundBloomFilter
Tests run: 3, Failures: 0, Errors: 0, Skipped: 0, Time elapsed: 21.09 sec
Forking command line: /bin/sh -c cd <https://builds.apache.org/job/HBase-0.92/ws/trunk>
&& /home/jenkins/tools/java/jdk1.6.0_27-32/jre/bin/java -enableassertions -Xmx1400m
-Djava.security.egd=file:/dev/./urandom -jar <https://builds.apache.org/job/HBase-0.92/ws/trunk/target/surefire/surefirebooter9022063451753734290.jar>
<https://builds.apache.org/job/HBase-0.92/ws/trunk/target/surefire/surefire7092638360968042667tmp>
<https://builds.apache.org/job/HBase-0.92/ws/trunk/target/surefire/surefire8527284068727865328tmp>
Running org.apache.hadoop.hbase.regionserver.TestSplitLogWorker
Tests run: 5, Failures: 0, Errors: 0, Skipped: 0, Time elapsed: 2.187 sec
Forking command line: /bin/sh -c cd <https://builds.apache.org/job/HBase-0.92/ws/trunk>
&& /home/jenkins/tools/java/jdk1.6.0_27-32/jre/bin/java -enableassertions -Xmx1400m
-Djava.security.egd=file:/dev/./urandom -jar <https://builds.apache.org/job/HBase-0.92/ws/trunk/target/surefire/surefirebooter6015342970897899238.jar>
<https://builds.apache.org/job/HBase-0.92/ws/trunk/target/surefire/surefire5362186264665867002tmp>
<https://builds.apache.org/job/HBase-0.92/ws/trunk/target/surefire/surefire3867237733910655638tmp>
Running org.apache.hadoop.hbase.regionserver.TestServerCustomProtocol
Tests run: 7, Failures: 0, Errors: 0, Skipped: 0, Time elapsed: 21.08 sec
Forking command line: /bin/sh -c cd <https://builds.apache.org/job/HBase-0.92/ws/trunk>
&& /home/jenkins/tools/java/jdk1.6.0_27-32/jre/bin/java -enableassertions -Xmx1400m
-Djava.security.egd=file:/dev/./urandom -jar <https://builds.apache.org/job/HBase-0.92/ws/trunk/target/surefire/surefirebooter5969048176965570937.jar>
<https://builds.apache.org/job/HBase-0.92/ws/trunk/target/surefire/surefire3678072483678173225tmp>
<https://builds.apache.org/job/HBase-0.92/ws/trunk/target/surefire/surefire4667817587446383051tmp>
Running org.apache.hadoop.hbase.regionserver.TestScanWithBloomError
Tests run: 3, Failures: 0, Errors: 0, Skipped: 0, Time elapsed: 1.1 sec
Forking command line: /bin/sh -c cd <https://builds.apache.org/job/HBase-0.92/ws/trunk>
&& /home/jenkins/tools/java/jdk1.6.0_27-32/jre/bin/java -enableassertions -Xmx1400m
-Djava.security.egd=file:/dev/./urandom -jar <https://builds.apache.org/job/HBase-0.92/ws/trunk/target/surefire/surefirebooter7227006285956401456.jar>
<https://builds.apache.org/job/HBase-0.92/ws/trunk/target/surefire/surefire7752743650366933150tmp>
<https://builds.apache.org/job/HBase-0.92/ws/trunk/target/surefire/surefire958718252108348741tmp>
Running org.apache.hadoop.hbase.regionserver.TestStoreFileBlockCacheSummary
Tests run: 1, Failures: 0, Errors: 0, Skipped: 0, Time elapsed: 20.461 sec
Forking command line: /bin/sh -c cd <https://builds.apache.org/job/HBase-0.92/ws/trunk>
&& /home/jenkins/tools/java/jdk1.6.0_27-32/jre/bin/java -enableassertions -Xmx1400m
-Djava.security.egd=file:/dev/./urandom -jar <https://builds.apache.org/job/HBase-0.92/ws/trunk/target/surefire/surefirebooter243956098995527092.jar>
<https://builds.apache.org/job/HBase-0.92/ws/trunk/target/surefire/surefire4125375070239216813tmp>
<https://builds.apache.org/job/HBase-0.92/ws/trunk/target/surefire/surefire8893256638092780234tmp>
Running org.apache.hadoop.hbase.regionserver.TestStore
Tests run: 11, Failures: 0, Errors: 0, Skipped: 0, Time elapsed: 1.827 sec
Forking command line: /bin/sh -c cd <https://builds.apache.org/job/HBase-0.92/ws/trunk>
&& /home/jenkins/tools/java/jdk1.6.0_27-32/jre/bin/java -enableassertions -Xmx1400m
-Djava.security.egd=file:/dev/./urandom -jar <https://builds.apache.org/job/HBase-0.92/ws/trunk/target/surefire/surefirebooter6489903794527696843.jar>
<https://builds.apache.org/job/HBase-0.92/ws/trunk/target/surefire/surefire5448253500129968560tmp>
<https://builds.apache.org/job/HBase-0.92/ws/trunk/target/surefire/surefire1210398087676458616tmp>
Running org.apache.hadoop.hbase.regionserver.TestBlocksRead
Tests run: 3, Failures: 0, Errors: 0, Skipped: 0, Time elapsed: 1.066 sec
Forking command line: /bin/sh -c cd <https://builds.apache.org/job/HBase-0.92/ws/trunk>
&& /home/jenkins/tools/java/jdk1.6.0_27-32/jre/bin/java -enableassertions -Xmx1400m
-Djava.security.egd=file:/dev/./urandom -jar <https://builds.apache.org/job/HBase-0.92/ws/trunk/target/surefire/surefirebooter2192495811591045959.jar>
<https://builds.apache.org/job/HBase-0.92/ws/trunk/target/surefire/surefire7248861926537902920tmp>
<https://builds.apache.org/job/HBase-0.92/ws/trunk/target/surefire/surefire5978951707353773381tmp>
Running org.apache.hadoop.hbase.regionserver.TestRSKilledWhenMasterInitializing
Tests run: 1, Failures: 0, Errors: 0, Skipped: 0, Time elapsed: 75.594 sec
Forking command line: /bin/sh -c cd <https://builds.apache.org/job/HBase-0.92/ws/trunk>
&& /home/jenkins/tools/java/jdk1.6.0_27-32/jre/bin/java -enableassertions -Xmx1400m
-Djava.security.egd=file:/dev/./urandom -jar <https://builds.apache.org/job/HBase-0.92/ws/trunk/target/surefire/surefirebooter3591170054955633662.jar>
<https://builds.apache.org/job/HBase-0.92/ws/trunk/target/surefire/surefire6442756819036204573tmp>
<https://builds.apache.org/job/HBase-0.92/ws/trunk/target/surefire/surefire7228407622881671825tmp>
Running org.apache.hadoop.hbase.regionserver.TestFSErrorsExposed
Tests run: 3, Failures: 0, Errors: 0, Skipped: 0, Time elapsed: 32.679 sec
Forking command line: /bin/sh -c cd <https://builds.apache.org/job/HBase-0.92/ws/trunk>
&& /home/jenkins/tools/java/jdk1.6.0_27-32/jre/bin/java -enableassertions -Xmx1400m
-Djava.security.egd=file:/dev/./urandom -jar <https://builds.apache.org/job/HBase-0.92/ws/trunk/target/surefire/surefirebooter2705594429738105159.jar>
<https://builds.apache.org/job/HBase-0.92/ws/trunk/target/surefire/surefire6750266988030109497tmp>
<https://builds.apache.org/job/HBase-0.92/ws/trunk/target/surefire/surefire5712862142318071160tmp>
Running org.apache.hadoop.hbase.regionserver.handler.TestCloseRegionHandler
Tests run: 3, Failures: 0, Errors: 0, Skipped: 0, Time elapsed: 1.266 sec
Forking command line: /bin/sh -c cd <https://builds.apache.org/job/HBase-0.92/ws/trunk>
&& /home/jenkins/tools/java/jdk1.6.0_27-32/jre/bin/java -enableassertions -Xmx1400m
-Djava.security.egd=file:/dev/./urandom -jar <https://builds.apache.org/job/HBase-0.92/ws/trunk/target/surefire/surefirebooter7235753005900802896.jar>
<https://builds.apache.org/job/HBase-0.92/ws/trunk/target/surefire/surefire4786095729273232589tmp>
<https://builds.apache.org/job/HBase-0.92/ws/trunk/target/surefire/surefire8989212921948231728tmp>
Running org.apache.hadoop.hbase.regionserver.handler.TestOpenRegionHandler
Tests run: 3, Failures: 0, Errors: 0, Skipped: 0, Time elapsed: 1.046 sec
Forking command line: /bin/sh -c cd <https://builds.apache.org/job/HBase-0.92/ws/trunk>
&& /home/jenkins/tools/java/jdk1.6.0_27-32/jre/bin/java -enableassertions -Xmx1400m
-Djava.security.egd=file:/dev/./urandom -jar <https://builds.apache.org/job/HBase-0.92/ws/trunk/target/surefire/surefirebooter7854065799989265654.jar>
<https://builds.apache.org/job/HBase-0.92/ws/trunk/target/surefire/surefire5384484438572265900tmp>
<https://builds.apache.org/job/HBase-0.92/ws/trunk/target/surefire/surefire5587011776809697945tmp>
Running org.apache.hadoop.hbase.regionserver.TestScanDeleteTracker
Tests run: 6, Failures: 0, Errors: 0, Skipped: 0, Time elapsed: 0.595 sec
Forking command line: /bin/sh -c cd <https://builds.apache.org/job/HBase-0.92/ws/trunk>
&& /home/jenkins/tools/java/jdk1.6.0_27-32/jre/bin/java -enableassertions -Xmx1400m
-Djava.security.egd=file:/dev/./urandom -jar <https://builds.apache.org/job/HBase-0.92/ws/trunk/target/surefire/surefirebooter2758443019162365460.jar>
<https://builds.apache.org/job/HBase-0.92/ws/trunk/target/surefire/surefire3212964513889052976tmp>
<https://builds.apache.org/job/HBase-0.92/ws/trunk/target/surefire/surefire5957133743376266653tmp>
Running org.apache.hadoop.hbase.regionserver.TestSplitTransactionOnCluster
Tests run: 4, Failures: 0, Errors: 0, Skipped: 0, Time elapsed: 47.114 sec
Forking command line: /bin/sh -c cd <https://builds.apache.org/job/HBase-0.92/ws/trunk>
&& /home/jenkins/tools/java/jdk1.6.0_27-32/jre/bin/java -enableassertions -Xmx1400m
-Djava.security.egd=file:/dev/./urandom -jar <https://builds.apache.org/job/HBase-0.92/ws/trunk/target/surefire/surefirebooter8766385884864652203.jar>
<https://builds.apache.org/job/HBase-0.92/ws/trunk/target/surefire/surefire7912416293950301809tmp>
<https://builds.apache.org/job/HBase-0.92/ws/trunk/target/surefire/surefire4436607856686589148tmp>
Running org.apache.hadoop.hbase.regionserver.TestHRegionServerBulkLoad
Tests run: 1, Failures: 0, Errors: 0, Skipped: 0, Time elapsed: 48.917 sec
Forking command line: /bin/sh -c cd <https://builds.apache.org/job/HBase-0.92/ws/trunk>
&& /home/jenkins/tools/java/jdk1.6.0_27-32/jre/bin/java -enableassertions -Xmx1400m
-Djava.security.egd=file:/dev/./urandom -jar <https://builds.apache.org/job/HBase-0.92/ws/trunk/target/surefire/surefirebooter4392238781698448679.jar>
<https://builds.apache.org/job/HBase-0.92/ws/trunk/target/surefire/surefire1440772377031849266tmp>
<https://builds.apache.org/job/HBase-0.92/ws/trunk/target/surefire/surefire2088849646233641563tmp>
Running org.apache.hadoop.hbase.regionserver.TestSplitTransaction
Tests run: 6, Failures: 0, Errors: 0, Skipped: 0, Time elapsed: 3.811 sec
Forking command line: /bin/sh -c cd <https://builds.apache.org/job/HBase-0.92/ws/trunk>
&& /home/jenkins/tools/java/jdk1.6.0_27-32/jre/bin/java -enableassertions -Xmx1400m
-Djava.security.egd=file:/dev/./urandom -jar <https://builds.apache.org/job/HBase-0.92/ws/trunk/target/surefire/surefirebooter1596035010507969020.jar>
<https://builds.apache.org/job/HBase-0.92/ws/trunk/target/surefire/surefire2771721020558935546tmp>
<https://builds.apache.org/job/HBase-0.92/ws/trunk/target/surefire/surefire3700609990615065438tmp>
Running org.apache.hadoop.hbase.regionserver.TestReadWriteConsistencyControl
Tests run: 1, Failures: 0, Errors: 0, Skipped: 0, Time elapsed: 10.107 sec
Forking command line: /bin/sh -c cd <https://builds.apache.org/job/HBase-0.92/ws/trunk>
&& /home/jenkins/tools/java/jdk1.6.0_27-32/jre/bin/java -enableassertions -Xmx1400m
-Djava.security.egd=file:/dev/./urandom -jar <https://builds.apache.org/job/HBase-0.92/ws/trunk/target/surefire/surefirebooter664641058629064566.jar>
<https://builds.apache.org/job/HBase-0.92/ws/trunk/target/surefire/surefire8735682403616637234tmp>
<https://builds.apache.org/job/HBase-0.92/ws/trunk/target/surefire/surefire3476194137477950253tmp>
Running org.apache.hadoop.hbase.regionserver.TestKeyValueHeap
Tests run: 3, Failures: 0, Errors: 0, Skipped: 0, Time elapsed: 0.502 sec
Forking command line: /bin/sh -c cd <https://builds.apache.org/job/HBase-0.92/ws/trunk>
&& /home/jenkins/tools/java/jdk1.6.0_27-32/jre/bin/java -enableassertions -Xmx1400m
-Djava.security.egd=file:/dev/./urandom -jar <https://builds.apache.org/job/HBase-0.92/ws/trunk/target/surefire/surefirebooter5816685122078492238.jar>
<https://builds.apache.org/job/HBase-0.92/ws/trunk/target/surefire/surefire2434641107700991423tmp>
<https://builds.apache.org/job/HBase-0.92/ws/trunk/target/surefire/surefire5718665033890990658tmp>
Running org.apache.hadoop.hbase.regionserver.TestCompactSelection
Tests run: 1, Failures: 0, Errors: 0, Skipped: 0, Time elapsed: 0.728 sec
Forking command line: /bin/sh -c cd <https://builds.apache.org/job/HBase-0.92/ws/trunk>
&& /home/jenkins/tools/java/jdk1.6.0_27-32/jre/bin/java -enableassertions -Xmx1400m
-Djava.security.egd=file:/dev/./urandom -jar <https://builds.apache.org/job/HBase-0.92/ws/trunk/target/surefire/surefirebooter8105632664659739707.jar>
<https://builds.apache.org/job/HBase-0.92/ws/trunk/target/surefire/surefire6094753695213989776tmp>
<https://builds.apache.org/job/HBase-0.92/ws/trunk/target/surefire/surefire257865282732511778tmp>
Running org.apache.hadoop.hbase.regionserver.TestMinVersions
Tests run: 6, Failures: 0, Errors: 0, Skipped: 0, Time elapsed: 1.21 sec
Forking command line: /bin/sh -c cd <https://builds.apache.org/job/HBase-0.92/ws/trunk>
&& /home/jenkins/tools/java/jdk1.6.0_27-32/jre/bin/java -enableassertions -Xmx1400m
-Djava.security.egd=file:/dev/./urandom -jar <https://builds.apache.org/job/HBase-0.92/ws/trunk/target/surefire/surefirebooter7017237366324631224.jar>
<https://builds.apache.org/job/HBase-0.92/ws/trunk/target/surefire/surefire6570953931637024172tmp>
<https://builds.apache.org/job/HBase-0.92/ws/trunk/target/surefire/surefire4159715218912931613tmp>
Running org.apache.hadoop.hbase.regionserver.TestWideScanner
Tests run: 1, Failures: 0, Errors: 0, Skipped: 0, Time elapsed: 1.931 sec
Forking command line: /bin/sh -c cd <https://builds.apache.org/job/HBase-0.92/ws/trunk>
&& /home/jenkins/tools/java/jdk1.6.0_27-32/jre/bin/java -enableassertions -Xmx1400m
-Djava.security.egd=file:/dev/./urandom -jar <https://builds.apache.org/job/HBase-0.92/ws/trunk/target/surefire/surefirebooter4398314096355052278.jar>
<https://builds.apache.org/job/HBase-0.92/ws/trunk/target/surefire/surefire8671973147099428966tmp>
<https://builds.apache.org/job/HBase-0.92/ws/trunk/target/surefire/surefire2119353182976506800tmp>
Running org.apache.hadoop.hbase.regionserver.TestColumnSeeking
Tests run: 2, Failures: 0, Errors: 0, Skipped: 0, Time elapsed: 4.303 sec
Forking command line: /bin/sh -c cd <https://builds.apache.org/job/HBase-0.92/ws/trunk>
&& /home/jenkins/tools/java/jdk1.6.0_27-32/jre/bin/java -enableassertions -Xmx1400m
-Djava.security.egd=file:/dev/./urandom -jar <https://builds.apache.org/job/HBase-0.92/ws/trunk/target/surefire/surefirebooter6016471387657344798.jar>
<https://builds.apache.org/job/HBase-0.92/ws/trunk/target/surefire/surefire6983147945361706938tmp>
<https://builds.apache.org/job/HBase-0.92/ws/trunk/target/surefire/surefire4668494966572473281tmp>
Running org.apache.hadoop.hbase.regionserver.TestGetClosestAtOrBefore
Tests run: 3, Failures: 0, Errors: 0, Skipped: 0, Time elapsed: 1.257 sec
Forking command line: /bin/sh -c cd <https://builds.apache.org/job/HBase-0.92/ws/trunk>
&& /home/jenkins/tools/java/jdk1.6.0_27-32/jre/bin/java -enableassertions -Xmx1400m
-Djava.security.egd=file:/dev/./urandom -jar <https://builds.apache.org/job/HBase-0.92/ws/trunk/target/surefire/surefirebooter2771541412618177213.jar>
<https://builds.apache.org/job/HBase-0.92/ws/trunk/target/surefire/surefire3707636573377146421tmp>
<https://builds.apache.org/job/HBase-0.92/ws/trunk/target/surefire/surefire3157512171970831511tmp>
Running org.apache.hadoop.hbase.regionserver.TestExplicitColumnTracker
Tests run: 4, Failures: 0, Errors: 0, Skipped: 0, Time elapsed: 0.903 sec
Forking command line: /bin/sh -c cd <https://builds.apache.org/job/HBase-0.92/ws/trunk>
&& /home/jenkins/tools/java/jdk1.6.0_27-32/jre/bin/java -enableassertions -Xmx1400m
-Djava.security.egd=file:/dev/./urandom -jar <https://builds.apache.org/job/HBase-0.92/ws/trunk/target/surefire/surefirebooter7817053724135776869.jar>
<https://builds.apache.org/job/HBase-0.92/ws/trunk/target/surefire/surefire3361668612499448075tmp>
<https://builds.apache.org/job/HBase-0.92/ws/trunk/target/surefire/surefire8927185541761827037tmp>
Running org.apache.hadoop.hbase.regionserver.TestMemStoreLAB
Tests run: 3, Failures: 0, Errors: 0, Skipped: 0, Time elapsed: 1.372 sec
Forking command line: /bin/sh -c cd <https://builds.apache.org/job/HBase-0.92/ws/trunk>
&& /home/jenkins/tools/java/jdk1.6.0_27-32/jre/bin/java -enableassertions -Xmx1400m
-Djava.security.egd=file:/dev/./urandom -jar <https://builds.apache.org/job/HBase-0.92/ws/trunk/target/surefire/surefirebooter5041255160945241212.jar>
<https://builds.apache.org/job/HBase-0.92/ws/trunk/target/surefire/surefire5639270729316830081tmp>
<https://builds.apache.org/job/HBase-0.92/ws/trunk/target/surefire/surefire2389263931718467926tmp>
Running org.apache.hadoop.hbase.regionserver.TestKeyValueScanFixture
Tests run: 1, Failures: 0, Errors: 0, Skipped: 0, Time elapsed: 0.116 sec
Forking command line: /bin/sh -c cd <https://builds.apache.org/job/HBase-0.92/ws/trunk>
&& /home/jenkins/tools/java/jdk1.6.0_27-32/jre/bin/java -enableassertions -Xmx1400m
-Djava.security.egd=file:/dev/./urandom -jar <https://builds.apache.org/job/HBase-0.92/ws/trunk/target/surefire/surefirebooter5201701978718768338.jar>
<https://builds.apache.org/job/HBase-0.92/ws/trunk/target/surefire/surefire5548126654814383299tmp>
<https://builds.apache.org/job/HBase-0.92/ws/trunk/target/surefire/surefire8576661953897551148tmp>
Running org.apache.hadoop.hbase.regionserver.wal.TestLogRollAbort
Tests run: 1, Failures: 0, Errors: 0, Skipped: 0, Time elapsed: 28.419 sec
Forking command line: /bin/sh -c cd <https://builds.apache.org/job/HBase-0.92/ws/trunk>
&& /home/jenkins/tools/java/jdk1.6.0_27-32/jre/bin/java -enableassertions -Xmx1400m
-Djava.security.egd=file:/dev/./urandom -jar <https://builds.apache.org/job/HBase-0.92/ws/trunk/target/surefire/surefirebooter3422184250575791985.jar>
<https://builds.apache.org/job/HBase-0.92/ws/trunk/target/surefire/surefire3089857731937615304tmp>
<https://builds.apache.org/job/HBase-0.92/ws/trunk/target/surefire/surefire2164816179463308228tmp>
Running org.apache.hadoop.hbase.regionserver.wal.TestWALActionsListener
Tests run: 1, Failures: 0, Errors: 0, Skipped: 0, Time elapsed: 0.723 sec
Forking command line: /bin/sh -c cd <https://builds.apache.org/job/HBase-0.92/ws/trunk>
&& /home/jenkins/tools/java/jdk1.6.0_27-32/jre/bin/java -enableassertions -Xmx1400m
-Djava.security.egd=file:/dev/./urandom -jar <https://builds.apache.org/job/HBase-0.92/ws/trunk/target/surefire/surefirebooter2530750519123374199.jar>
<https://builds.apache.org/job/HBase-0.92/ws/trunk/target/surefire/surefire6203844624431250075tmp>
<https://builds.apache.org/job/HBase-0.92/ws/trunk/target/surefire/surefire6887624743295150447tmp>
Running org.apache.hadoop.hbase.regionserver.wal.TestLogRolling
Tests run: 3, Failures: 0, Errors: 0, Skipped: 0, Time elapsed: 452.449 sec
Forking command line: /bin/sh -c cd <https://builds.apache.org/job/HBase-0.92/ws/trunk>
&& /home/jenkins/tools/java/jdk1.6.0_27-32/jre/bin/java -enableassertions -Xmx1400m
-Djava.security.egd=file:/dev/./urandom -jar <https://builds.apache.org/job/HBase-0.92/ws/trunk/target/surefire/surefirebooter9201918531310802318.jar>
<https://builds.apache.org/job/HBase-0.92/ws/trunk/target/surefire/surefire8111156579723078471tmp>
<https://builds.apache.org/job/HBase-0.92/ws/trunk/target/surefire/surefire9134684668446302695tmp>
Running org.apache.hadoop.hbase.regionserver.wal.TestHLog
Tests run: 9, Failures: 0, Errors: 0, Skipped: 0, Time elapsed: 65.672 sec
Forking command line: /bin/sh -c cd <https://builds.apache.org/job/HBase-0.92/ws/trunk>
&& /home/jenkins/tools/java/jdk1.6.0_27-32/jre/bin/java -enableassertions -Xmx1400m
-Djava.security.egd=file:/dev/./urandom -jar <https://builds.apache.org/job/HBase-0.92/ws/trunk/target/surefire/surefirebooter7434300638011403762.jar>
<https://builds.apache.org/job/HBase-0.92/ws/trunk/target/surefire/surefire6899550329903762719tmp>
<https://builds.apache.org/job/HBase-0.92/ws/trunk/target/surefire/surefire2510121485701474171tmp>
Running org.apache.hadoop.hbase.regionserver.wal.TestHLogSplit
Tests run: 30, Failures: 0, Errors: 0, Skipped: 1, Time elapsed: 248.259 sec
Forking command line: /bin/sh -c cd <https://builds.apache.org/job/HBase-0.92/ws/trunk>
&& /home/jenkins/tools/java/jdk1.6.0_27-32/jre/bin/java -enableassertions -Xmx1400m
-Djava.security.egd=file:/dev/./urandom -jar <https://builds.apache.org/job/HBase-0.92/ws/trunk/target/surefire/surefirebooter201917795817871763.jar>
<https://builds.apache.org/job/HBase-0.92/ws/trunk/target/surefire/surefire4504578417201224547tmp>
<https://builds.apache.org/job/HBase-0.92/ws/trunk/target/surefire/surefire183392038536792292tmp>
Running org.apache.hadoop.hbase.regionserver.wal.TestWALReplay
Tests run: 5, Failures: 0, Errors: 0, Skipped: 0, Time elapsed: 27.483 sec
Forking command line: /bin/sh -c cd <https://builds.apache.org/job/HBase-0.92/ws/trunk>
&& /home/jenkins/tools/java/jdk1.6.0_27-32/jre/bin/java -enableassertions -Xmx1400m
-Djava.security.egd=file:/dev/./urandom -jar <https://builds.apache.org/job/HBase-0.92/ws/trunk/target/surefire/surefirebooter1949832774833935139.jar>
<https://builds.apache.org/job/HBase-0.92/ws/trunk/target/surefire/surefire8397996929511136257tmp>
<https://builds.apache.org/job/HBase-0.92/ws/trunk/target/surefire/surefire7184555546655892906tmp>
Running org.apache.hadoop.hbase.regionserver.wal.TestHLogMethods
Tests run: 3, Failures: 0, Errors: 0, Skipped: 0, Time elapsed: 0.903 sec
Forking command line: /bin/sh -c cd <https://builds.apache.org/job/HBase-0.92/ws/trunk>
&& /home/jenkins/tools/java/jdk1.6.0_27-32/jre/bin/java -enableassertions -Xmx1400m
-Djava.security.egd=file:/dev/./urandom -jar <https://builds.apache.org/job/HBase-0.92/ws/trunk/target/surefire/surefirebooter2842597358160342145.jar>
<https://builds.apache.org/job/HBase-0.92/ws/trunk/target/surefire/surefire6737237655661596777tmp>
<https://builds.apache.org/job/HBase-0.92/ws/trunk/target/surefire/surefire1064338969126623988tmp>
Running org.apache.hadoop.hbase.regionserver.TestRSStatusServlet
Tests run: 2, Failures: 0, Errors: 0, Skipped: 0, Time elapsed: 0.689 sec
Forking command line: /bin/sh -c cd <https://builds.apache.org/job/HBase-0.92/ws/trunk>
&& /home/jenkins/tools/java/jdk1.6.0_27-32/jre/bin/java -enableassertions -Xmx1400m
-Djava.security.egd=file:/dev/./urandom -jar <https://builds.apache.org/job/HBase-0.92/ws/trunk/target/surefire/surefirebooter5913576698137165228.jar>
<https://builds.apache.org/job/HBase-0.92/ws/trunk/target/surefire/surefire2309914507738041407tmp>
<https://builds.apache.org/job/HBase-0.92/ws/trunk/target/surefire/surefire7919988780709721692tmp>
Running org.apache.hadoop.hbase.regionserver.TestStoreScanner
Tests run: 14, Failures: 0, Errors: 0, Skipped: 0, Time elapsed: 0.143 sec
Forking command line: /bin/sh -c cd <https://builds.apache.org/job/HBase-0.92/ws/trunk>
&& /home/jenkins/tools/java/jdk1.6.0_27-32/jre/bin/java -enableassertions -Xmx1400m
-Djava.security.egd=file:/dev/./urandom -jar <https://builds.apache.org/job/HBase-0.92/ws/trunk/target/surefire/surefirebooter6513383304663318062.jar>
<https://builds.apache.org/job/HBase-0.92/ws/trunk/target/surefire/surefire5827600618732983022tmp>
<https://builds.apache.org/job/HBase-0.92/ws/trunk/target/surefire/surefire5237366387787109312tmp>
Running org.apache.hadoop.hbase.regionserver.TestResettingCounters
Tests run: 1, Failures: 0, Errors: 0, Skipped: 0, Time elapsed: 0.808 sec
Forking command line: /bin/sh -c cd <https://builds.apache.org/job/HBase-0.92/ws/trunk>
&& /home/jenkins/tools/java/jdk1.6.0_27-32/jre/bin/java -enableassertions -Xmx1400m
-Djava.security.egd=file:/dev/./urandom -jar <https://builds.apache.org/job/HBase-0.92/ws/trunk/target/surefire/surefirebooter1364458220307006560.jar>
<https://builds.apache.org/job/HBase-0.92/ws/trunk/target/surefire/surefire1873240291696116255tmp>
<https://builds.apache.org/job/HBase-0.92/ws/trunk/target/surefire/surefire7190752834742703090tmp>
Running org.apache.hadoop.hbase.regionserver.TestStoreFile
Tests run: 8, Failures: 0, Errors: 0, Skipped: 0, Time elapsed: 1.727 sec
Forking command line: /bin/sh -c cd <https://builds.apache.org/job/HBase-0.92/ws/trunk>
&& /home/jenkins/tools/java/jdk1.6.0_27-32/jre/bin/java -enableassertions -Xmx1400m
-Djava.security.egd=file:/dev/./urandom -jar <https://builds.apache.org/job/HBase-0.92/ws/trunk/target/surefire/surefirebooter8500973864495925368.jar>
<https://builds.apache.org/job/HBase-0.92/ws/trunk/target/surefire/surefire7505653191339108254tmp>
<https://builds.apache.org/job/HBase-0.92/ws/trunk/target/surefire/surefire7992702484176871710tmp>
Running org.apache.hadoop.hbase.regionserver.TestEndToEndSplitTransaction
Tests run: 1, Failures: 0, Errors: 0, Skipped: 0, Time elapsed: 46.709 sec
Forking command line: /bin/sh -c cd <https://builds.apache.org/job/HBase-0.92/ws/trunk>
&& /home/jenkins/tools/java/jdk1.6.0_27-32/jre/bin/java -enableassertions -Xmx1400m
-Djava.security.egd=file:/dev/./urandom -jar <https://builds.apache.org/job/HBase-0.92/ws/trunk/target/surefire/surefirebooter8818731282612343034.jar>
<https://builds.apache.org/job/HBase-0.92/ws/trunk/target/surefire/surefire8601332840030782092tmp>
<https://builds.apache.org/job/HBase-0.92/ws/trunk/target/surefire/surefire3161896971639641653tmp>
Running org.apache.hadoop.hbase.regionserver.TestScanWildcardColumnTracker
Tests run: 2, Failures: 0, Errors: 0, Skipped: 0, Time elapsed: 0.457 sec
Forking command line: /bin/sh -c cd <https://builds.apache.org/job/HBase-0.92/ws/trunk>
&& /home/jenkins/tools/java/jdk1.6.0_27-32/jre/bin/java -enableassertions -Xmx1400m
-Djava.security.egd=file:/dev/./urandom -jar <https://builds.apache.org/job/HBase-0.92/ws/trunk/target/surefire/surefirebooter1269615950827963005.jar>
<https://builds.apache.org/job/HBase-0.92/ws/trunk/target/surefire/surefire6616657177345487384tmp>
<https://builds.apache.org/job/HBase-0.92/ws/trunk/target/surefire/surefire932315642685275527tmp>
Running org.apache.hadoop.hbase.regionserver.TestCompaction
Tests run: 10, Failures: 0, Errors: 0, Skipped: 0, Time elapsed: 12.516 sec
Forking command line: /bin/sh -c cd <https://builds.apache.org/job/HBase-0.92/ws/trunk>
&& /home/jenkins/tools/java/jdk1.6.0_27-32/jre/bin/java -enableassertions -Xmx1400m
-Djava.security.egd=file:/dev/./urandom -jar <https://builds.apache.org/job/HBase-0.92/ws/trunk/target/surefire/surefirebooter988176535081490194.jar>
<https://builds.apache.org/job/HBase-0.92/ws/trunk/target/surefire/surefire479534444889794689tmp>
<https://builds.apache.org/job/HBase-0.92/ws/trunk/target/surefire/surefire6807250029704251438tmp>
Running org.apache.hadoop.hbase.regionserver.TestMXBean
Tests run: 1, Failures: 0, Errors: 0, Skipped: 0, Time elapsed: 16.846 sec
Forking command line: /bin/sh -c cd <https://builds.apache.org/job/HBase-0.92/ws/trunk>
&& /home/jenkins/tools/java/jdk1.6.0_27-32/jre/bin/java -enableassertions -Xmx1400m
-Djava.security.egd=file:/dev/./urandom -jar <https://builds.apache.org/job/HBase-0.92/ws/trunk/target/surefire/surefirebooter3372575160212998638.jar>
<https://builds.apache.org/job/HBase-0.92/ws/trunk/target/surefire/surefire5011064441918722266tmp>
<https://builds.apache.org/job/HBase-0.92/ws/trunk/target/surefire/surefire3231125981656230844tmp>
Running org.apache.hadoop.hbase.regionserver.TestQueryMatcher
Tests run: 4, Failures: 0, Errors: 0, Skipped: 0, Time elapsed: 0.533 sec
Forking command line: /bin/sh -c cd <https://builds.apache.org/job/HBase-0.92/ws/trunk>
&& /home/jenkins/tools/java/jdk1.6.0_27-32/jre/bin/java -enableassertions -Xmx1400m
-Djava.security.egd=file:/dev/./urandom -jar <https://builds.apache.org/job/HBase-0.92/ws/trunk/target/surefire/surefirebooter3975345631245018058.jar>
<https://builds.apache.org/job/HBase-0.92/ws/trunk/target/surefire/surefire5640943224721982718tmp>
<https://builds.apache.org/job/HBase-0.92/ws/trunk/target/surefire/surefire4551108207268972540tmp>
Running org.apache.hadoop.hbase.regionserver.TestRpcMetrics
Tests run: 1, Failures: 0, Errors: 0, Skipped: 0, Time elapsed: 2.142 sec
Forking command line: /bin/sh -c cd <https://builds.apache.org/job/HBase-0.92/ws/trunk>
&& /home/jenkins/tools/java/jdk1.6.0_27-32/jre/bin/java -enableassertions -Xmx1400m
-Djava.security.egd=file:/dev/./urandom -jar <https://builds.apache.org/job/HBase-0.92/ws/trunk/target/surefire/surefirebooter8825041588632751959.jar>
<https://builds.apache.org/job/HBase-0.92/ws/trunk/target/surefire/surefire7534091492881028813tmp>
<https://builds.apache.org/job/HBase-0.92/ws/trunk/target/surefire/surefire938367312537710315tmp>
Running org.apache.hadoop.hbase.regionserver.TestScanner
Tests run: 7, Failures: 0, Errors: 0, Skipped: 0, Time elapsed: 4.816 sec
Forking command line: /bin/sh -c cd <https://builds.apache.org/job/HBase-0.92/ws/trunk>
&& /home/jenkins/tools/java/jdk1.6.0_27-32/jre/bin/java -enableassertions -Xmx1400m
-Djava.security.egd=file:/dev/./urandom -jar <https://builds.apache.org/job/HBase-0.92/ws/trunk/target/surefire/surefirebooter6554565009233047322.jar>
<https://builds.apache.org/job/HBase-0.92/ws/trunk/target/surefire/surefire4078506006861941513tmp>
<https://builds.apache.org/job/HBase-0.92/ws/trunk/target/surefire/surefire8685815144129449199tmp>
Running org.apache.hadoop.hbase.regionserver.TestMultiColumnScanner
Tests run: 6, Failures: 0, Errors: 0, Skipped: 0, Time elapsed: 18.518 sec
Forking command line: /bin/sh -c cd <https://builds.apache.org/job/HBase-0.92/ws/trunk>
&& /home/jenkins/tools/java/jdk1.6.0_27-32/jre/bin/java -enableassertions -Xmx1400m
-Djava.security.egd=file:/dev/./urandom -jar <https://builds.apache.org/job/HBase-0.92/ws/trunk/target/surefire/surefirebooter7181343622959541604.jar>
<https://builds.apache.org/job/HBase-0.92/ws/trunk/target/surefire/surefire7799792743049550420tmp>
<https://builds.apache.org/job/HBase-0.92/ws/trunk/target/surefire/surefire8005997524150211732tmp>
Running org.apache.hadoop.hbase.regionserver.TestRegionSplitPolicy
Tests run: 3, Failures: 0, Errors: 0, Skipped: 0, Time elapsed: 0.705 sec
Forking command line: /bin/sh -c cd <https://builds.apache.org/job/HBase-0.92/ws/trunk>
&& /home/jenkins/tools/java/jdk1.6.0_27-32/jre/bin/java -enableassertions -Xmx1400m
-Djava.security.egd=file:/dev/./urandom -jar <https://builds.apache.org/job/HBase-0.92/ws/trunk/target/surefire/surefirebooter8652814054136943426.jar>
<https://builds.apache.org/job/HBase-0.92/ws/trunk/target/surefire/surefire2360130909659041797tmp>
<https://builds.apache.org/job/HBase-0.92/ws/trunk/target/surefire/surefire8292874754442396285tmp>
Running org.apache.hadoop.hbase.regionserver.TestKeyValueSkipListSet
Tests run: 4, Failures: 0, Errors: 0, Skipped: 0, Time elapsed: 0.121 sec
Forking command line: /bin/sh -c cd <https://builds.apache.org/job/HBase-0.92/ws/trunk>
&& /home/jenkins/tools/java/jdk1.6.0_27-32/jre/bin/java -enableassertions -Xmx1400m
-Djava.security.egd=file:/dev/./urandom -jar <https://builds.apache.org/job/HBase-0.92/ws/trunk/target/surefire/surefirebooter6115159405160988906.jar>
<https://builds.apache.org/job/HBase-0.92/ws/trunk/target/surefire/surefire3175292934124283945tmp>
<https://builds.apache.org/job/HBase-0.92/ws/trunk/target/surefire/surefire502696926048451881tmp>
Running org.apache.hadoop.hbase.mapred.TestTableMapReduce
Tests run: 1, Failures: 0, Errors: 0, Skipped: 0, Time elapsed: 70.218 sec
Forking command line: /bin/sh -c cd <https://builds.apache.org/job/HBase-0.92/ws/trunk>
&& /home/jenkins/tools/java/jdk1.6.0_27-32/jre/bin/java -enableassertions -Xmx1400m
-Djava.security.egd=file:/dev/./urandom -jar <https://builds.apache.org/job/HBase-0.92/ws/trunk/target/surefire/surefirebooter3421719846723671734.jar>
<https://builds.apache.org/job/HBase-0.92/ws/trunk/target/surefire/surefire1879643650585796843tmp>
<https://builds.apache.org/job/HBase-0.92/ws/trunk/target/surefire/surefire6269027470556356136tmp>
Running org.apache.hadoop.hbase.mapred.TestTableInputFormat
Tests run: 6, Failures: 0, Errors: 0, Skipped: 0, Time elapsed: 34.788 sec
Forking command line: /bin/sh -c cd <https://builds.apache.org/job/HBase-0.92/ws/trunk>
&& /home/jenkins/tools/java/jdk1.6.0_27-32/jre/bin/java -enableassertions -Xmx1400m
-Djava.security.egd=file:/dev/./urandom -jar <https://builds.apache.org/job/HBase-0.92/ws/trunk/target/surefire/surefirebooter1565980921761325748.jar>
<https://builds.apache.org/job/HBase-0.92/ws/trunk/target/surefire/surefire2690995153480740294tmp>
<https://builds.apache.org/job/HBase-0.92/ws/trunk/target/surefire/surefire8345678680982266248tmp>
Running org.apache.hadoop.hbase.TestDrainingServer
Tests run: 2, Failures: 0, Errors: 0, Skipped: 0, Time elapsed: 26.714 sec
Forking command line: /bin/sh -c cd <https://builds.apache.org/job/HBase-0.92/ws/trunk>
&& /home/jenkins/tools/java/jdk1.6.0_27-32/jre/bin/java -enableassertions -Xmx1400m
-Djava.security.egd=file:/dev/./urandom -jar <https://builds.apache.org/job/HBase-0.92/ws/trunk/target/surefire/surefirebooter365081879251894348.jar>
<https://builds.apache.org/job/HBase-0.92/ws/trunk/target/surefire/surefire7580069486399293822tmp>
<https://builds.apache.org/job/HBase-0.92/ws/trunk/target/surefire/surefire2691894880315700942tmp>
Running org.apache.hadoop.hbase.TestFSTableDescriptorForceCreation
Tests run: 3, Failures: 0, Errors: 0, Skipped: 0, Time elapsed: 0.648 sec
Forking command line: /bin/sh -c cd <https://builds.apache.org/job/HBase-0.92/ws/trunk>
&& /home/jenkins/tools/java/jdk1.6.0_27-32/jre/bin/java -enableassertions -Xmx1400m
-Djava.security.egd=file:/dev/./urandom -jar <https://builds.apache.org/job/HBase-0.92/ws/trunk/target/surefire/surefirebooter7840594262981115025.jar>
<https://builds.apache.org/job/HBase-0.92/ws/trunk/target/surefire/surefire6806894707410455807tmp>
<https://builds.apache.org/job/HBase-0.92/ws/trunk/target/surefire/surefire1417369430143396067tmp>
Running org.apache.hadoop.hbase.executor.TestExecutorService
Tests run: 1, Failures: 0, Errors: 0, Skipped: 0, Time elapsed: 2.444 sec
Forking command line: /bin/sh -c cd <https://builds.apache.org/job/HBase-0.92/ws/trunk>
&& /home/jenkins/tools/java/jdk1.6.0_27-32/jre/bin/java -enableassertions -Xmx1400m
-Djava.security.egd=file:/dev/./urandom -jar <https://builds.apache.org/job/HBase-0.92/ws/trunk/target/surefire/surefirebooter8342334801209164369.jar>
<https://builds.apache.org/job/HBase-0.92/ws/trunk/target/surefire/surefire6045875874593421983tmp>
<https://builds.apache.org/job/HBase-0.92/ws/trunk/target/surefire/surefire6090273089971866380tmp>
Running org.apache.hadoop.hbase.mapreduce.TestTimeRangeMapRed
Tests run: 1, Failures: 0, Errors: 0, Skipped: 0, Time elapsed: 49.909 sec
Forking command line: /bin/sh -c cd <https://builds.apache.org/job/HBase-0.92/ws/trunk>
&& /home/jenkins/tools/java/jdk1.6.0_27-32/jre/bin/java -enableassertions -Xmx1400m
-Djava.security.egd=file:/dev/./urandom -jar <https://builds.apache.org/job/HBase-0.92/ws/trunk/target/surefire/surefirebooter588966647911491952.jar>
<https://builds.apache.org/job/HBase-0.92/ws/trunk/target/surefire/surefire2224560739245493284tmp>
<https://builds.apache.org/job/HBase-0.92/ws/trunk/target/surefire/surefire6088562166286962729tmp>
Running org.apache.hadoop.hbase.mapreduce.TestHFileOutputFormat
Tests run: 8, Failures: 0, Errors: 0, Skipped: 0, Time elapsed: 170.701 sec
Forking command line: /bin/sh -c cd <https://builds.apache.org/job/HBase-0.92/ws/trunk>
&& /home/jenkins/tools/java/jdk1.6.0_27-32/jre/bin/java -enableassertions -Xmx1400m
-Djava.security.egd=file:/dev/./urandom -jar <https://builds.apache.org/job/HBase-0.92/ws/trunk/target/surefire/surefirebooter1431811681178576317.jar>
<https://builds.apache.org/job/HBase-0.92/ws/trunk/target/surefire/surefire28602994853267528tmp>
<https://builds.apache.org/job/HBase-0.92/ws/trunk/target/surefire/surefire1545864103245823844tmp>
Running org.apache.hadoop.hbase.mapreduce.TestImportTsv
Tests run: 8, Failures: 0, Errors: 0, Skipped: 0, Time elapsed: 93.727 sec
Forking command line: /bin/sh -c cd <https://builds.apache.org/job/HBase-0.92/ws/trunk>
&& /home/jenkins/tools/java/jdk1.6.0_27-32/jre/bin/java -enableassertions -Xmx1400m
-Djava.security.egd=file:/dev/./urandom -jar <https://builds.apache.org/job/HBase-0.92/ws/trunk/target/surefire/surefirebooter5151983730053625012.jar>
<https://builds.apache.org/job/HBase-0.92/ws/trunk/target/surefire/surefire8183135683360338426tmp>
<https://builds.apache.org/job/HBase-0.92/ws/trunk/target/surefire/surefire3915661293714687271tmp>
Running org.apache.hadoop.hbase.mapreduce.TestTableInputFormatScan
Tests run: 11, Failures: 0, Errors: 0, Skipped: 0, Time elapsed: 479.356 sec
Forking command line: /bin/sh -c cd <https://builds.apache.org/job/HBase-0.92/ws/trunk>
&& /home/jenkins/tools/java/jdk1.6.0_27-32/jre/bin/java -enableassertions -Xmx1400m
-Djava.security.egd=file:/dev/./urandom -jar <https://builds.apache.org/job/HBase-0.92/ws/trunk/target/surefire/surefirebooter5189614562753565859.jar>
<https://builds.apache.org/job/HBase-0.92/ws/trunk/target/surefire/surefire1332052851663298205tmp>
<https://builds.apache.org/job/HBase-0.92/ws/trunk/target/surefire/surefire3782881412135237204tmp>
Running org.apache.hadoop.hbase.mapreduce.TestLoadIncrementalHFilesSplitRecovery
Tests run: 4, Failures: 0, Errors: 0, Skipped: 0, Time elapsed: 56.757 sec
Forking command line: /bin/sh -c cd <https://builds.apache.org/job/HBase-0.92/ws/trunk>
&& /home/jenkins/tools/java/jdk1.6.0_27-32/jre/bin/java -enableassertions -Xmx1400m
-Djava.security.egd=file:/dev/./urandom -jar <https://builds.apache.org/job/HBase-0.92/ws/trunk/target/surefire/surefirebooter1287696252192925440.jar>
<https://builds.apache.org/job/HBase-0.92/ws/trunk/target/surefire/surefire427318498164639153tmp>
<https://builds.apache.org/job/HBase-0.92/ws/trunk/target/surefire/surefire6496435051582282311tmp>
Running org.apache.hadoop.hbase.mapreduce.TestTableSplit
Tests run: 1, Failures: 0, Errors: 0, Skipped: 0, Time elapsed: 0.136 sec
Forking command line: /bin/sh -c cd <https://builds.apache.org/job/HBase-0.92/ws/trunk>
&& /home/jenkins/tools/java/jdk1.6.0_27-32/jre/bin/java -enableassertions -Xmx1400m
-Djava.security.egd=file:/dev/./urandom -jar <https://builds.apache.org/job/HBase-0.92/ws/trunk/target/surefire/surefirebooter738787862814664122.jar>
<https://builds.apache.org/job/HBase-0.92/ws/trunk/target/surefire/surefire4220117825883841647tmp>
<https://builds.apache.org/job/HBase-0.92/ws/trunk/target/surefire/surefire3467702362993612269tmp>
Running org.apache.hadoop.hbase.mapreduce.TestSimpleTotalOrderPartitioner
Tests run: 1, Failures: 0, Errors: 0, Skipped: 0, Time elapsed: 0.416 sec
Forking command line: /bin/sh -c cd <https://builds.apache.org/job/HBase-0.92/ws/trunk>
&& /home/jenkins/tools/java/jdk1.6.0_27-32/jre/bin/java -enableassertions -Xmx1400m
-Djava.security.egd=file:/dev/./urandom -jar <https://builds.apache.org/job/HBase-0.92/ws/trunk/target/surefire/surefirebooter3064948930187908918.jar>
<https://builds.apache.org/job/HBase-0.92/ws/trunk/target/surefire/surefire6282551309584432636tmp>
<https://builds.apache.org/job/HBase-0.92/ws/trunk/target/surefire/surefire5372231183209427799tmp>
Running org.apache.hadoop.hbase.mapreduce.TestTableMapReduce
Tests run: 1, Failures: 0, Errors: 0, Skipped: 0, Time elapsed: 101.055 sec
Forking command line: /bin/sh -c cd <https://builds.apache.org/job/HBase-0.92/ws/trunk>
&& /home/jenkins/tools/java/jdk1.6.0_27-32/jre/bin/java -enableassertions -Xmx1400m
-Djava.security.egd=file:/dev/./urandom -jar <https://builds.apache.org/job/HBase-0.92/ws/trunk/target/surefire/surefirebooter6232569660974955711.jar>
<https://builds.apache.org/job/HBase-0.92/ws/trunk/target/surefire/surefire8924617696882983954tmp>
<https://builds.apache.org/job/HBase-0.92/ws/trunk/target/surefire/surefire6649754897890355191tmp>
Running org.apache.hadoop.hbase.mapreduce.TestLoadIncrementalHFiles
Tests run: 6, Failures: 0, Errors: 0, Skipped: 0, Time elapsed: 33.848 sec
Forking command line: /bin/sh -c cd <https://builds.apache.org/job/HBase-0.92/ws/trunk>
&& /home/jenkins/tools/java/jdk1.6.0_27-32/jre/bin/java -enableassertions -Xmx1400m
-Djava.security.egd=file:/dev/./urandom -jar <https://builds.apache.org/job/HBase-0.92/ws/trunk/target/surefire/surefirebooter334882247814891524.jar>
<https://builds.apache.org/job/HBase-0.92/ws/trunk/target/surefire/surefire3398936025068024115tmp>
<https://builds.apache.org/job/HBase-0.92/ws/trunk/target/surefire/surefire1917238620467165970tmp>
Running org.apache.hadoop.hbase.TestHRegionLocation
Tests run: 3, Failures: 0, Errors: 0, Skipped: 0, Time elapsed: 0.142 sec

Results :

Tests in error: 
  testHundredsOfTable(org.apache.hadoop.hbase.client.TestAdmin): Call to juno.apache.org/67.195.138.61:54398
failed on socket timeout exception: java.net.SocketTimeoutException: 1500 millis timeout while
waiting for channel to be ready for read. ch : java.nio.channels.SocketChannel[connected local=/67.195.138.61:42162
remote=juno.apache.org/67.195.138.61:54398]

Tests run: 1098, Failures: 0, Errors: 1, Skipped: 8

[INFO] ------------------------------------------------------------------------
[INFO] BUILD FAILURE
[INFO] ------------------------------------------------------------------------
[INFO] Total time: 1:55:48.809s
[INFO] Finished at: Mon Apr 02 06:12:38 UTC 2012
[INFO] Final Memory: 38M/446M
[INFO] ------------------------------------------------------------------------
[ERROR] Failed to execute goal org.apache.maven.plugins:maven-surefire-plugin:2.10:test (default-test)
on project hbase: There are test failures.
[ERROR] 
[ERROR] Please refer to <https://builds.apache.org/job/HBase-0.92/ws/trunk/target/surefire-reports>
for the individual test results.
[ERROR] -> [Help 1]
org.apache.maven.lifecycle.LifecycleExecutionException: Failed to execute goal org.apache.maven.plugins:maven-surefire-plugin:2.10:test
(default-test) on project hbase: There are test failures.

Please refer to <https://builds.apache.org/job/HBase-0.92/ws/trunk/target/surefire-reports>
for the individual test results.
	at org.apache.maven.lifecycle.internal.MojoExecutor.execute(MojoExecutor.java:213)
	at org.apache.maven.lifecycle.internal.MojoExecutor.execute(MojoExecutor.java:153)
	at org.apache.maven.lifecycle.internal.MojoExecutor.execute(MojoExecutor.java:145)
	at org.apache.maven.lifecycle.internal.LifecycleModuleBuilder.buildProject(LifecycleModuleBuilder.java:84)
	at org.apache.maven.lifecycle.internal.LifecycleModuleBuilder.buildProject(LifecycleModuleBuilder.java:59)
	at org.apache.maven.lifecycle.internal.LifecycleStarter.singleThreadedBuild(LifecycleStarter.java:183)
	at org.apache.maven.lifecycle.internal.LifecycleStarter.execute(LifecycleStarter.java:161)
	at org.apache.maven.DefaultMaven.doExecute(DefaultMaven.java:319)
	at org.apache.maven.DefaultMaven.execute(DefaultMaven.java:156)
	at org.apache.maven.cli.MavenCli.execute(MavenCli.java:537)
	at org.apache.maven.cli.MavenCli.doMain(MavenCli.java:196)
	at org.apache.maven.cli.MavenCli.main(MavenCli.java:141)
	at sun.reflect.NativeMethodAccessorImpl.invoke0(Native Method)
	at sun.reflect.NativeMethodAccessorImpl.invoke(NativeMethodAccessorImpl.java:39)
	at sun.reflect.DelegatingMethodAccessorImpl.invoke(DelegatingMethodAccessorImpl.java:25)
	at java.lang.reflect.Method.invoke(Method.java:597)
	at org.codehaus.plexus.classworlds.launcher.Launcher.launchEnhanced(Launcher.java:290)
	at org.codehaus.plexus.classworlds.launcher.Launcher.launch(Launcher.java:230)
	at org.codehaus.plexus.classworlds.launcher.Launcher.mainWithExitCode(Launcher.java:409)
	at org.codehaus.plexus.classworlds.launcher.Launcher.main(Launcher.java:352)
Caused by: org.apache.maven.plugin.MojoFailureException: There are test failures.

Please refer to <https://builds.apache.org/job/HBase-0.92/ws/trunk/target/surefire-reports>
for the individual test results.
	at org.apache.maven.plugin.surefire.SurefireHelper.reportExecution(SurefireHelper.java:87)
	at org.apache.maven.plugin.surefire.SurefirePlugin.writeSummary(SurefirePlugin.java:641)
	at org.apache.maven.plugin.surefire.SurefirePlugin.handleSummary(SurefirePlugin.java:615)
	at org.apache.maven.plugin.surefire.AbstractSurefireMojo.executeAfterPreconditionsChecked(AbstractSurefireMojo.java:137)
	at org.apache.maven.plugin.surefire.AbstractSurefireMojo.execute(AbstractSurefireMojo.java:98)
	at org.apache.maven.plugin.DefaultBuildPluginManager.executeMojo(DefaultBuildPluginManager.java:101)
	at org.apache.maven.lifecycle.internal.MojoExecutor.execute(MojoExecutor.java:209)
	... 19 more
[ERROR] 
[ERROR] 
[ERROR] For more information about the errors and possible solutions, please read the following
articles:
[ERROR] [Help 1] http://cwiki.apache.org/confluence/display/MAVEN/MojoFailureException
Build step 'Invoke top-level Maven targets' marked build as failure
Archiving artifacts
Updating HBASE-5436
Recording test results

Mime
View raw message