hbase-dev mailing list archives

Site index · List index
Message view « Date » · « Thread »
Top « Date » · « Thread »
From Apache Jenkins Server <jenk...@builds.apache.org>
Subject Build failed in Jenkins: HBase-TRUNK #2757
Date Fri, 13 Apr 2012 23:51:59 GMT
See <https://builds.apache.org/job/HBase-TRUNK/2757/changes>

Changes:

[larsh] HBASE-5604 Addendum. Remove test as per discussion on jira.

[stack] HBASE-5747  Forward port "hbase-5708 [89-fb] Make MiniMapRedCluster directory a subdirectory
of target/test"

------------------------------------------
[...truncated 17755 lines...]
Forking command line: /bin/sh -c cd <https://builds.apache.org/job/HBase-TRUNK/ws/trunk>
&& /home/jenkins/tools/java/jdk1.6.0_27-32/jre/bin/java -enableassertions -Xmx1900m
-Djava.security.egd=file:/dev/./urandom -jar <https://builds.apache.org/job/HBase-TRUNK/ws/trunk/target/surefire/surefirebooter600788634573168824.jar>
<https://builds.apache.org/job/HBase-TRUNK/ws/trunk/target/surefire/surefire2107440005993326904tmp>
<https://builds.apache.org/job/HBase-TRUNK/ws/trunk/target/surefire/surefire_536974935703675903516tmp>
Running org.apache.hadoop.hbase.client.TestHTablePool$TestHTableReusablePool
Tests run: 9, Failures: 0, Errors: 0, Skipped: 0, Time elapsed: 6.149 sec
Running org.apache.hadoop.hbase.client.TestHTablePool$TestHTableThreadLocalPool
Tests run: 9, Failures: 0, Errors: 0, Skipped: 0, Time elapsed: 22.62 sec
Forking command line: /bin/sh -c cd <https://builds.apache.org/job/HBase-TRUNK/ws/trunk>
&& /home/jenkins/tools/java/jdk1.6.0_27-32/jre/bin/java -enableassertions -Xmx1900m
-Djava.security.egd=file:/dev/./urandom -jar <https://builds.apache.org/job/HBase-TRUNK/ws/trunk/target/surefire/surefirebooter2603462799047924089.jar>
<https://builds.apache.org/job/HBase-TRUNK/ws/trunk/target/surefire/surefire2938657608574545885tmp>
<https://builds.apache.org/job/HBase-TRUNK/ws/trunk/target/surefire/surefire_548967521104698182970tmp>
Running org.apache.hadoop.hbase.master.TestActiveMasterManager
Tests run: 2, Failures: 0, Errors: 0, Skipped: 0, Time elapsed: 0.94 sec
Forking command line: /bin/sh -c cd <https://builds.apache.org/job/HBase-TRUNK/ws/trunk>
&& /home/jenkins/tools/java/jdk1.6.0_27-32/jre/bin/java -enableassertions -Xmx1900m
-Djava.security.egd=file:/dev/./urandom -jar <https://builds.apache.org/job/HBase-TRUNK/ws/trunk/target/surefire/surefirebooter9154442516943135390.jar>
<https://builds.apache.org/job/HBase-TRUNK/ws/trunk/target/surefire/surefire5421944505735391760tmp>
<https://builds.apache.org/job/HBase-TRUNK/ws/trunk/target/surefire/surefire_554824600277730796813tmp>
Running org.apache.hadoop.hbase.master.TestMasterStatusServlet
Tests run: 5, Failures: 0, Errors: 0, Skipped: 0, Time elapsed: 1.041 sec
Forking command line: /bin/sh -c cd <https://builds.apache.org/job/HBase-TRUNK/ws/trunk>
&& /home/jenkins/tools/java/jdk1.6.0_27-32/jre/bin/java -enableassertions -Xmx1900m
-Djava.security.egd=file:/dev/./urandom -jar <https://builds.apache.org/job/HBase-TRUNK/ws/trunk/target/surefire/surefirebooter8901546495016800828.jar>
<https://builds.apache.org/job/HBase-TRUNK/ws/trunk/target/surefire/surefire4354095656609150328tmp>
<https://builds.apache.org/job/HBase-TRUNK/ws/trunk/target/surefire/surefire_566313639523271474874tmp>
Running org.apache.hadoop.hbase.master.TestHMasterRPCException
Tests run: 1, Failures: 0, Errors: 0, Skipped: 0, Time elapsed: 1.343 sec
Forking command line: /bin/sh -c cd <https://builds.apache.org/job/HBase-TRUNK/ws/trunk>
&& /home/jenkins/tools/java/jdk1.6.0_27-32/jre/bin/java -enableassertions -Xmx1900m
-Djava.security.egd=file:/dev/./urandom -jar <https://builds.apache.org/job/HBase-TRUNK/ws/trunk/target/surefire/surefirebooter7172669604885684106.jar>
<https://builds.apache.org/job/HBase-TRUNK/ws/trunk/target/surefire/surefire6565776477398748843tmp>
<https://builds.apache.org/job/HBase-TRUNK/ws/trunk/target/surefire/surefire_57875400922184333938tmp>
Running org.apache.hadoop.hbase.master.TestLogsCleaner
Tests run: 1, Failures: 0, Errors: 0, Skipped: 0, Time elapsed: 3.108 sec
Forking command line: /bin/sh -c cd <https://builds.apache.org/job/HBase-TRUNK/ws/trunk>
&& /home/jenkins/tools/java/jdk1.6.0_27-32/jre/bin/java -enableassertions -Xmx1900m
-Djava.security.egd=file:/dev/./urandom -jar <https://builds.apache.org/job/HBase-TRUNK/ws/trunk/target/surefire/surefirebooter9045697465856379381.jar>
<https://builds.apache.org/job/HBase-TRUNK/ws/trunk/target/surefire/surefire2775234231232721993tmp>
<https://builds.apache.org/job/HBase-TRUNK/ws/trunk/target/surefire/surefire_581067505640199962923tmp>
Running org.apache.hadoop.hbase.master.TestOpenedRegionHandler
Tests run: 2, Failures: 0, Errors: 0, Skipped: 0, Time elapsed: 14.156 sec
Forking command line: /bin/sh -c cd <https://builds.apache.org/job/HBase-TRUNK/ws/trunk>
&& /home/jenkins/tools/java/jdk1.6.0_27-32/jre/bin/java -enableassertions -Xmx1900m
-Djava.security.egd=file:/dev/./urandom -jar <https://builds.apache.org/job/HBase-TRUNK/ws/trunk/target/surefire/surefirebooter8920591603261169837.jar>
<https://builds.apache.org/job/HBase-TRUNK/ws/trunk/target/surefire/surefire5997153648349855980tmp>
<https://builds.apache.org/job/HBase-TRUNK/ws/trunk/target/surefire/surefire_598885349153198712258tmp>
Running org.apache.hadoop.hbase.master.TestZKBasedOpenCloseRegion
Tests run: 3, Failures: 0, Errors: 0, Skipped: 0, Time elapsed: 18.799 sec
Forking command line: /bin/sh -c cd <https://builds.apache.org/job/HBase-TRUNK/ws/trunk>
&& /home/jenkins/tools/java/jdk1.6.0_27-32/jre/bin/java -enableassertions -Xmx1900m
-Djava.security.egd=file:/dev/./urandom -jar <https://builds.apache.org/job/HBase-TRUNK/ws/trunk/target/surefire/surefirebooter2124521869793453595.jar>
<https://builds.apache.org/job/HBase-TRUNK/ws/trunk/target/surefire/surefire5014034695197136790tmp>
<https://builds.apache.org/job/HBase-TRUNK/ws/trunk/target/surefire/surefire_608213005542827526024tmp>
Running org.apache.hadoop.hbase.master.TestDefaultLoadBalancer
Tests run: 4, Failures: 0, Errors: 0, Skipped: 0, Time elapsed: 1.469 sec
Forking command line: /bin/sh -c cd <https://builds.apache.org/job/HBase-TRUNK/ws/trunk>
&& /home/jenkins/tools/java/jdk1.6.0_27-32/jre/bin/java -enableassertions -Xmx1900m
-Djava.security.egd=file:/dev/./urandom -jar <https://builds.apache.org/job/HBase-TRUNK/ws/trunk/target/surefire/surefirebooter1299424161923056829.jar>
<https://builds.apache.org/job/HBase-TRUNK/ws/trunk/target/surefire/surefire4301288738664945447tmp>
<https://builds.apache.org/job/HBase-TRUNK/ws/trunk/target/surefire/surefire_619093123911973018649tmp>
Running org.apache.hadoop.hbase.master.TestClockSkewDetection
Tests run: 1, Failures: 0, Errors: 0, Skipped: 0, Time elapsed: 0.29 sec
Forking command line: /bin/sh -c cd <https://builds.apache.org/job/HBase-TRUNK/ws/trunk>
&& /home/jenkins/tools/java/jdk1.6.0_27-32/jre/bin/java -enableassertions -Xmx1900m
-Djava.security.egd=file:/dev/./urandom -jar <https://builds.apache.org/job/HBase-TRUNK/ws/trunk/target/surefire/surefirebooter1556111600891697252.jar>
<https://builds.apache.org/job/HBase-TRUNK/ws/trunk/target/surefire/surefire6680762975921004626tmp>
<https://builds.apache.org/job/HBase-TRUNK/ws/trunk/target/surefire/surefire_626554929020748313164tmp>
Running org.apache.hadoop.hbase.master.TestMaster
Tests run: 1, Failures: 0, Errors: 0, Skipped: 0, Time elapsed: 15.674 sec
Forking command line: /bin/sh -c cd <https://builds.apache.org/job/HBase-TRUNK/ws/trunk>
&& /home/jenkins/tools/java/jdk1.6.0_27-32/jre/bin/java -enableassertions -Xmx1900m
-Djava.security.egd=file:/dev/./urandom -jar <https://builds.apache.org/job/HBase-TRUNK/ws/trunk/target/surefire/surefirebooter924844555919761813.jar>
<https://builds.apache.org/job/HBase-TRUNK/ws/trunk/target/surefire/surefire5322385925398610931tmp>
<https://builds.apache.org/job/HBase-TRUNK/ws/trunk/target/surefire/surefire_638626007876419879941tmp>
Running org.apache.hadoop.hbase.master.TestSplitLogManager
Tests run: 12, Failures: 0, Errors: 0, Skipped: 0, Time elapsed: 14.576 sec
Forking command line: /bin/sh -c cd <https://builds.apache.org/job/HBase-TRUNK/ws/trunk>
&& /home/jenkins/tools/java/jdk1.6.0_27-32/jre/bin/java -enableassertions -Xmx1900m
-Djava.security.egd=file:/dev/./urandom -jar <https://builds.apache.org/job/HBase-TRUNK/ws/trunk/target/surefire/surefirebooter5526840627615825041.jar>
<https://builds.apache.org/job/HBase-TRUNK/ws/trunk/target/surefire/surefire3361517050884046093tmp>
<https://builds.apache.org/job/HBase-TRUNK/ws/trunk/target/surefire/surefire_64958034528866039936tmp>
Running org.apache.hadoop.hbase.metrics.TestMetricsMBeanBase
Tests run: 2, Failures: 0, Errors: 0, Skipped: 0, Time elapsed: 1.119 sec
Forking command line: /bin/sh -c cd <https://builds.apache.org/job/HBase-TRUNK/ws/trunk>
&& /home/jenkins/tools/java/jdk1.6.0_27-32/jre/bin/java -enableassertions -Xmx1900m
-Djava.security.egd=file:/dev/./urandom -jar <https://builds.apache.org/job/HBase-TRUNK/ws/trunk/target/surefire/surefirebooter7754810415069341206.jar>
<https://builds.apache.org/job/HBase-TRUNK/ws/trunk/target/surefire/surefire8238413838017193308tmp>
<https://builds.apache.org/job/HBase-TRUNK/ws/trunk/target/surefire/surefire_658959078338382640708tmp>
Running org.apache.hadoop.hbase.TestGlobalMemStoreSize
Tests run: 1, Failures: 0, Errors: 0, Skipped: 0, Time elapsed: 13.998 sec
Forking command line: /bin/sh -c cd <https://builds.apache.org/job/HBase-TRUNK/ws/trunk>
&& /home/jenkins/tools/java/jdk1.6.0_27-32/jre/bin/java -enableassertions -Xmx1900m
-Djava.security.egd=file:/dev/./urandom -jar <https://builds.apache.org/job/HBase-TRUNK/ws/trunk/target/surefire/surefirebooter4024208120448389543.jar>
<https://builds.apache.org/job/HBase-TRUNK/ws/trunk/target/surefire/surefire7950247391098845923tmp>
<https://builds.apache.org/job/HBase-TRUNK/ws/trunk/target/surefire/surefire_665665004965105885958tmp>
Running org.apache.hadoop.hbase.replication.TestReplicationZookeeper
Tests run: 1, Failures: 0, Errors: 0, Skipped: 0, Time elapsed: 0.653 sec
Forking command line: /bin/sh -c cd <https://builds.apache.org/job/HBase-TRUNK/ws/trunk>
&& /home/jenkins/tools/java/jdk1.6.0_27-32/jre/bin/java -enableassertions -Xmx1900m
-Djava.security.egd=file:/dev/./urandom -jar <https://builds.apache.org/job/HBase-TRUNK/ws/trunk/target/surefire/surefirebooter7386382358225786154.jar>
<https://builds.apache.org/job/HBase-TRUNK/ws/trunk/target/surefire/surefire7041031072012820646tmp>
<https://builds.apache.org/job/HBase-TRUNK/ws/trunk/target/surefire/surefire_675807092177986060038tmp>
Running org.apache.hadoop.hbase.replication.TestReplicationSource
Tests run: 1, Failures: 0, Errors: 0, Skipped: 0, Time elapsed: 2.352 sec
Forking command line: /bin/sh -c cd <https://builds.apache.org/job/HBase-TRUNK/ws/trunk>
&& /home/jenkins/tools/java/jdk1.6.0_27-32/jre/bin/java -enableassertions -Xmx1900m
-Djava.security.egd=file:/dev/./urandom -jar <https://builds.apache.org/job/HBase-TRUNK/ws/trunk/target/surefire/surefirebooter6996797333944703385.jar>
<https://builds.apache.org/job/HBase-TRUNK/ws/trunk/target/surefire/surefire3711008542304438163tmp>
<https://builds.apache.org/job/HBase-TRUNK/ws/trunk/target/surefire/surefire_688984150198568574858tmp>
Running org.apache.hadoop.hbase.replication.TestReplicationPeer
Tests run: 1, Failures: 0, Errors: 0, Skipped: 0, Time elapsed: 0.945 sec
Forking command line: /bin/sh -c cd <https://builds.apache.org/job/HBase-TRUNK/ws/trunk>
&& /home/jenkins/tools/java/jdk1.6.0_27-32/jre/bin/java -enableassertions -Xmx1900m
-Djava.security.egd=file:/dev/./urandom -jar <https://builds.apache.org/job/HBase-TRUNK/ws/trunk/target/surefire/surefirebooter8995028702257472278.jar>
<https://builds.apache.org/job/HBase-TRUNK/ws/trunk/target/surefire/surefire4608356561487463915tmp>
<https://builds.apache.org/job/HBase-TRUNK/ws/trunk/target/surefire/surefire_692661197871125229811tmp>
Running org.apache.hadoop.hbase.replication.regionserver.TestReplicationSink
Tests run: 5, Failures: 0, Errors: 0, Skipped: 0, Time elapsed: 31.595 sec
Forking command line: /bin/sh -c cd <https://builds.apache.org/job/HBase-TRUNK/ws/trunk>
&& /home/jenkins/tools/java/jdk1.6.0_27-32/jre/bin/java -enableassertions -Xmx1900m
-Djava.security.egd=file:/dev/./urandom -jar <https://builds.apache.org/job/HBase-TRUNK/ws/trunk/target/surefire/surefirebooter2401473896275649387.jar>
<https://builds.apache.org/job/HBase-TRUNK/ws/trunk/target/surefire/surefire5792631097250161458tmp>
<https://builds.apache.org/job/HBase-TRUNK/ws/trunk/target/surefire/surefire_704454532470372943413tmp>
Running org.apache.hadoop.hbase.replication.regionserver.TestReplicationSourceManager
Tests run: 1, Failures: 0, Errors: 0, Skipped: 0, Time elapsed: 1.048 sec
Forking command line: /bin/sh -c cd <https://builds.apache.org/job/HBase-TRUNK/ws/trunk>
&& /home/jenkins/tools/java/jdk1.6.0_27-32/jre/bin/java -enableassertions -Xmx1900m
-Djava.security.egd=file:/dev/./urandom -jar <https://builds.apache.org/job/HBase-TRUNK/ws/trunk/target/surefire/surefirebooter698891811565734586.jar>
<https://builds.apache.org/job/HBase-TRUNK/ws/trunk/target/surefire/surefire7460098466327789979tmp>
<https://builds.apache.org/job/HBase-TRUNK/ws/trunk/target/surefire/surefire_717934957392153250996tmp>
Running org.apache.hadoop.hbase.TestMultiVersions
Tests run: 3, Failures: 0, Errors: 0, Skipped: 0, Time elapsed: 23.035 sec
Forking command line: /bin/sh -c cd <https://builds.apache.org/job/HBase-TRUNK/ws/trunk>
&& /home/jenkins/tools/java/jdk1.6.0_27-32/jre/bin/java -enableassertions -Xmx1900m
-Djava.security.egd=file:/dev/./urandom -jar <https://builds.apache.org/job/HBase-TRUNK/ws/trunk/target/surefire/surefirebooter7532728439756861093.jar>
<https://builds.apache.org/job/HBase-TRUNK/ws/trunk/target/surefire/surefire8443793337880694821tmp>
<https://builds.apache.org/job/HBase-TRUNK/ws/trunk/target/surefire/surefire_724628427252107289624tmp>
Running org.apache.hadoop.hbase.catalog.TestMetaReaderEditorNoCluster
Tests run: 1, Failures: 0, Errors: 0, Skipped: 0, Time elapsed: 4.185 sec
Forking command line: /bin/sh -c cd <https://builds.apache.org/job/HBase-TRUNK/ws/trunk>
&& /home/jenkins/tools/java/jdk1.6.0_27-32/jre/bin/java -enableassertions -Xmx1900m
-Djava.security.egd=file:/dev/./urandom -jar <https://builds.apache.org/job/HBase-TRUNK/ws/trunk/target/surefire/surefirebooter3625869266640062080.jar>
<https://builds.apache.org/job/HBase-TRUNK/ws/trunk/target/surefire/surefire2659972494379593159tmp>
<https://builds.apache.org/job/HBase-TRUNK/ws/trunk/target/surefire/surefire_73900392733284890613tmp>
Running org.apache.hadoop.hbase.catalog.TestMetaReaderEditor
Tests run: 5, Failures: 0, Errors: 0, Skipped: 0, Time elapsed: 22.438 sec
Forking command line: /bin/sh -c cd <https://builds.apache.org/job/HBase-TRUNK/ws/trunk>
&& /home/jenkins/tools/java/jdk1.6.0_27-32/jre/bin/java -enableassertions -Xmx1900m
-Djava.security.egd=file:/dev/./urandom -jar <https://builds.apache.org/job/HBase-TRUNK/ws/trunk/target/surefire/surefirebooter7457369365340431257.jar>
<https://builds.apache.org/job/HBase-TRUNK/ws/trunk/target/surefire/surefire2242339191142601104tmp>
<https://builds.apache.org/job/HBase-TRUNK/ws/trunk/target/surefire/surefire_744286692142579338996tmp>
Running org.apache.hadoop.hbase.catalog.TestCatalogTracker
Tests run: 9, Failures: 0, Errors: 0, Skipped: 1, Time elapsed: 5.415 sec
Forking command line: /bin/sh -c cd <https://builds.apache.org/job/HBase-TRUNK/ws/trunk>
&& /home/jenkins/tools/java/jdk1.6.0_27-32/jre/bin/java -enableassertions -Xmx1900m
-Djava.security.egd=file:/dev/./urandom -jar <https://builds.apache.org/job/HBase-TRUNK/ws/trunk/target/surefire/surefirebooter2427402338166270700.jar>
<https://builds.apache.org/job/HBase-TRUNK/ws/trunk/target/surefire/surefire8644022735359581980tmp>
<https://builds.apache.org/job/HBase-TRUNK/ws/trunk/target/surefire/surefire_755536148836177806758tmp>
Running org.apache.hadoop.hbase.coprocessor.TestAggregateProtocol
Tests run: 45, Failures: 0, Errors: 0, Skipped: 0, Time elapsed: 17.873 sec
Forking command line: /bin/sh -c cd <https://builds.apache.org/job/HBase-TRUNK/ws/trunk>
&& /home/jenkins/tools/java/jdk1.6.0_27-32/jre/bin/java -enableassertions -Xmx1900m
-Djava.security.egd=file:/dev/./urandom -jar <https://builds.apache.org/job/HBase-TRUNK/ws/trunk/target/surefire/surefirebooter2181449570549749950.jar>
<https://builds.apache.org/job/HBase-TRUNK/ws/trunk/target/surefire/surefire696814057370355642tmp>
<https://builds.apache.org/job/HBase-TRUNK/ws/trunk/target/surefire/surefire_761332328240979162847tmp>
Running org.apache.hadoop.hbase.coprocessor.TestMasterObserver
Tests run: 3, Failures: 0, Errors: 0, Skipped: 0, Time elapsed: 28.927 sec
Forking command line: /bin/sh -c cd <https://builds.apache.org/job/HBase-TRUNK/ws/trunk>
&& /home/jenkins/tools/java/jdk1.6.0_27-32/jre/bin/java -enableassertions -Xmx1900m
-Djava.security.egd=file:/dev/./urandom -jar <https://builds.apache.org/job/HBase-TRUNK/ws/trunk/target/surefire/surefirebooter4028288209719874792.jar>
<https://builds.apache.org/job/HBase-TRUNK/ws/trunk/target/surefire/surefire7261950505419965845tmp>
<https://builds.apache.org/job/HBase-TRUNK/ws/trunk/target/surefire/surefire_771334036265471048038tmp>
Running org.apache.hadoop.hbase.coprocessor.TestCoprocessorEndpoint
Tests run: 3, Failures: 0, Errors: 0, Skipped: 1, Time elapsed: 30.246 sec
Forking command line: /bin/sh -c cd <https://builds.apache.org/job/HBase-TRUNK/ws/trunk>
&& /home/jenkins/tools/java/jdk1.6.0_27-32/jre/bin/java -enableassertions -Xmx1900m
-Djava.security.egd=file:/dev/./urandom -jar <https://builds.apache.org/job/HBase-TRUNK/ws/trunk/target/surefire/surefirebooter4134980957342241786.jar>
<https://builds.apache.org/job/HBase-TRUNK/ws/trunk/target/surefire/surefire2276072119651892130tmp>
<https://builds.apache.org/job/HBase-TRUNK/ws/trunk/target/surefire/surefire_783737132397723286742tmp>
Forking command line: /bin/sh -c cd <https://builds.apache.org/job/HBase-TRUNK/ws/trunk>
&& /home/jenkins/tools/java/jdk1.6.0_27-32/jre/bin/java -enableassertions -Xmx1900m
-Djava.security.egd=file:/dev/./urandom -jar <https://builds.apache.org/job/HBase-TRUNK/ws/trunk/target/surefire/surefirebooter89835696455332383.jar>
<https://builds.apache.org/job/HBase-TRUNK/ws/trunk/target/surefire/surefire5870151588596057052tmp>
<https://builds.apache.org/job/HBase-TRUNK/ws/trunk/target/surefire/surefire_796552257240719276630tmp>
Running org.apache.hadoop.hbase.coprocessor.TestClassLoading
Tests run: 6, Failures: 0, Errors: 0, Skipped: 0, Time elapsed: 29.613 sec
Forking command line: /bin/sh -c cd <https://builds.apache.org/job/HBase-TRUNK/ws/trunk>
&& /home/jenkins/tools/java/jdk1.6.0_27-32/jre/bin/java -enableassertions -Xmx1900m
-Djava.security.egd=file:/dev/./urandom -jar <https://builds.apache.org/job/HBase-TRUNK/ws/trunk/target/surefire/surefirebooter6330172259810928198.jar>
<https://builds.apache.org/job/HBase-TRUNK/ws/trunk/target/surefire/surefire3116150743772650757tmp>
<https://builds.apache.org/job/HBase-TRUNK/ws/trunk/target/surefire/surefire_802729770138885561521tmp>
Running org.apache.hadoop.hbase.coprocessor.TestMasterCoprocessorExceptionWithRemove
Tests run: 1, Failures: 0, Errors: 0, Skipped: 0, Time elapsed: 14.539 sec
Forking command line: /bin/sh -c cd <https://builds.apache.org/job/HBase-TRUNK/ws/trunk>
&& /home/jenkins/tools/java/jdk1.6.0_27-32/jre/bin/java -enableassertions -Xmx1900m
-Djava.security.egd=file:/dev/./urandom -jar <https://builds.apache.org/job/HBase-TRUNK/ws/trunk/target/surefire/surefirebooter3034797698651299445.jar>
<https://builds.apache.org/job/HBase-TRUNK/ws/trunk/target/surefire/surefire1872999086708679621tmp>
<https://builds.apache.org/job/HBase-TRUNK/ws/trunk/target/surefire/surefire_815912813807901992088tmp>
Running org.apache.hadoop.hbase.coprocessor.TestRegionObserverInterface
Tests run: 6, Failures: 0, Errors: 0, Skipped: 0, Time elapsed: 33.254 sec
Forking command line: /bin/sh -c cd <https://builds.apache.org/job/HBase-TRUNK/ws/trunk>
&& /home/jenkins/tools/java/jdk1.6.0_27-32/jre/bin/java -enableassertions -Xmx1900m
-Djava.security.egd=file:/dev/./urandom -jar <https://builds.apache.org/job/HBase-TRUNK/ws/trunk/target/surefire/surefirebooter3778227045817606237.jar>
<https://builds.apache.org/job/HBase-TRUNK/ws/trunk/target/surefire/surefire909542151116334391tmp>
<https://builds.apache.org/job/HBase-TRUNK/ws/trunk/target/surefire/surefire_821565004132217515453tmp>
Running org.apache.hadoop.hbase.coprocessor.TestRegionServerCoprocessorExceptionWithRemove
Tests run: 1, Failures: 0, Errors: 0, Skipped: 0, Time elapsed: 17.186 sec
Forking command line: /bin/sh -c cd <https://builds.apache.org/job/HBase-TRUNK/ws/trunk>
&& /home/jenkins/tools/java/jdk1.6.0_27-32/jre/bin/java -enableassertions -Xmx1900m
-Djava.security.egd=file:/dev/./urandom -jar <https://builds.apache.org/job/HBase-TRUNK/ws/trunk/target/surefire/surefirebooter7210362032200292286.jar>
<https://builds.apache.org/job/HBase-TRUNK/ws/trunk/target/surefire/surefire2575148249654593389tmp>
<https://builds.apache.org/job/HBase-TRUNK/ws/trunk/target/surefire/surefire_838044372792765402905tmp>
Running org.apache.hadoop.hbase.coprocessor.TestMasterCoprocessorExceptionWithAbort
Tests run: 1, Failures: 0, Errors: 0, Skipped: 0, Time elapsed: 24.884 sec
Forking command line: /bin/sh -c cd <https://builds.apache.org/job/HBase-TRUNK/ws/trunk>
&& /home/jenkins/tools/java/jdk1.6.0_27-32/jre/bin/java -enableassertions -Xmx1900m
-Djava.security.egd=file:/dev/./urandom -jar <https://builds.apache.org/job/HBase-TRUNK/ws/trunk/target/surefire/surefirebooter1208904617103087630.jar>
<https://builds.apache.org/job/HBase-TRUNK/ws/trunk/target/surefire/surefire3947480948021756037tmp>
<https://builds.apache.org/job/HBase-TRUNK/ws/trunk/target/surefire/surefire_846743244613856941557tmp>
Running org.apache.hadoop.hbase.coprocessor.TestWALObserver
Tests run: 3, Failures: 0, Errors: 0, Skipped: 0, Time elapsed: 16.103 sec
Running org.apache.hadoop.hbase.coprocessor.TestRegionServerCoprocessorExceptionWithAbort
Tests run: 1, Failures: 0, Errors: 0, Skipped: 0, Time elapsed: 14.533 sec
Forking command line: /bin/sh -c cd <https://builds.apache.org/job/HBase-TRUNK/ws/trunk>
&& /home/jenkins/tools/java/jdk1.6.0_27-32/jre/bin/java -enableassertions -Xmx1900m
-Djava.security.egd=file:/dev/./urandom -jar <https://builds.apache.org/job/HBase-TRUNK/ws/trunk/target/surefire/surefirebooter1780890022448612149.jar>
<https://builds.apache.org/job/HBase-TRUNK/ws/trunk/target/surefire/surefire5627263231842229675tmp>
<https://builds.apache.org/job/HBase-TRUNK/ws/trunk/target/surefire/surefire_856148529656597806185tmp>
Forking command line: /bin/sh -c cd <https://builds.apache.org/job/HBase-TRUNK/ws/trunk>
&& /home/jenkins/tools/java/jdk1.6.0_27-32/jre/bin/java -enableassertions -Xmx1900m
-Djava.security.egd=file:/dev/./urandom -jar <https://builds.apache.org/job/HBase-TRUNK/ws/trunk/target/surefire/surefirebooter8358823187262893307.jar>
<https://builds.apache.org/job/HBase-TRUNK/ws/trunk/target/surefire/surefire3047751889593671530tmp>
<https://builds.apache.org/job/HBase-TRUNK/ws/trunk/target/surefire/surefire_863906839570376872194tmp>
Running org.apache.hadoop.hbase.coprocessor.TestRegionObserverBypass
Tests run: 2, Failures: 0, Errors: 0, Skipped: 0, Time elapsed: 13.524 sec
Forking command line: /bin/sh -c cd <https://builds.apache.org/job/HBase-TRUNK/ws/trunk>
&& /home/jenkins/tools/java/jdk1.6.0_27-32/jre/bin/java -enableassertions -Xmx1900m
-Djava.security.egd=file:/dev/./urandom -jar <https://builds.apache.org/job/HBase-TRUNK/ws/trunk/target/surefire/surefirebooter3996414612607477637.jar>
<https://builds.apache.org/job/HBase-TRUNK/ws/trunk/target/surefire/surefire6343742680184236135tmp>
<https://builds.apache.org/job/HBase-TRUNK/ws/trunk/target/surefire/surefire_878685873632304646782tmp>
Running org.apache.hadoop.hbase.thrift2.TestThriftHBaseServiceHandler
Tests run: 12, Failures: 0, Errors: 0, Skipped: 0, Time elapsed: 14.47 sec
Forking command line: /bin/sh -c cd <https://builds.apache.org/job/HBase-TRUNK/ws/trunk>
&& /home/jenkins/tools/java/jdk1.6.0_27-32/jre/bin/java -enableassertions -Xmx1900m
-Djava.security.egd=file:/dev/./urandom -jar <https://builds.apache.org/job/HBase-TRUNK/ws/trunk/target/surefire/surefirebooter8365108853333647672.jar>
<https://builds.apache.org/job/HBase-TRUNK/ws/trunk/target/surefire/surefire6912145894391959372tmp>
<https://builds.apache.org/job/HBase-TRUNK/ws/trunk/target/surefire/surefire_882169830080025354021tmp>
Running org.apache.hadoop.hbase.avro.TestAvroServer
Tests run: 3, Failures: 0, Errors: 0, Skipped: 0, Time elapsed: 26.44 sec
Forking command line: /bin/sh -c cd <https://builds.apache.org/job/HBase-TRUNK/ws/trunk>
&& /home/jenkins/tools/java/jdk1.6.0_27-32/jre/bin/java -enableassertions -Xmx1900m
-Djava.security.egd=file:/dev/./urandom -jar <https://builds.apache.org/job/HBase-TRUNK/ws/trunk/target/surefire/surefirebooter8882504006184133495.jar>
<https://builds.apache.org/job/HBase-TRUNK/ws/trunk/target/surefire/surefire2459557996461633064tmp>
<https://builds.apache.org/job/HBase-TRUNK/ws/trunk/target/surefire/surefire_891244132145817480450tmp>
Running org.apache.hadoop.hbase.monitoring.TestTaskMonitor
Tests run: 3, Failures: 0, Errors: 0, Skipped: 0, Time elapsed: 0.31 sec
Forking command line: /bin/sh -c cd <https://builds.apache.org/job/HBase-TRUNK/ws/trunk>
&& /home/jenkins/tools/java/jdk1.6.0_27-32/jre/bin/java -enableassertions -Xmx1900m
-Djava.security.egd=file:/dev/./urandom -jar <https://builds.apache.org/job/HBase-TRUNK/ws/trunk/target/surefire/surefirebooter5227710201537448457.jar>
<https://builds.apache.org/job/HBase-TRUNK/ws/trunk/target/surefire/surefire1120190514858317274tmp>
<https://builds.apache.org/job/HBase-TRUNK/ws/trunk/target/surefire/surefire_90157656421916828285tmp>
Running org.apache.hadoop.hbase.monitoring.TestMemoryBoundedLogMessageBuffer
Tests run: 2, Failures: 0, Errors: 0, Skipped: 0, Time elapsed: 0.235 sec
Forking command line: /bin/sh -c cd <https://builds.apache.org/job/HBase-TRUNK/ws/trunk>
&& /home/jenkins/tools/java/jdk1.6.0_27-32/jre/bin/java -enableassertions -Xmx1900m
-Djava.security.egd=file:/dev/./urandom -jar <https://builds.apache.org/job/HBase-TRUNK/ws/trunk/target/surefire/surefirebooter4508762060033563573.jar>
<https://builds.apache.org/job/HBase-TRUNK/ws/trunk/target/surefire/surefire8116635003624740499tmp>
<https://builds.apache.org/job/HBase-TRUNK/ws/trunk/target/surefire/surefire_914908963844916411763tmp>
Running org.apache.hadoop.hbase.thrift.TestThriftServer
Tests run: 1, Failures: 0, Errors: 0, Skipped: 0, Time elapsed: 64.875 sec
Forking command line: /bin/sh -c cd <https://builds.apache.org/job/HBase-TRUNK/ws/trunk>
&& /home/jenkins/tools/java/jdk1.6.0_27-32/jre/bin/java -enableassertions -Xmx1900m
-Djava.security.egd=file:/dev/./urandom -jar <https://builds.apache.org/job/HBase-TRUNK/ws/trunk/target/surefire/surefirebooter6096147484635662664.jar>
<https://builds.apache.org/job/HBase-TRUNK/ws/trunk/target/surefire/surefire2005921830953914911tmp>
<https://builds.apache.org/job/HBase-TRUNK/ws/trunk/target/surefire/surefire_921807119919117515159tmp>
Running org.apache.hadoop.hbase.regionserver.TestMasterAddressManager
Tests run: 1, Failures: 0, Errors: 0, Skipped: 0, Time elapsed: 0.729 sec
Forking command line: /bin/sh -c cd <https://builds.apache.org/job/HBase-TRUNK/ws/trunk>
&& /home/jenkins/tools/java/jdk1.6.0_27-32/jre/bin/java -enableassertions -Xmx1900m
-Djava.security.egd=file:/dev/./urandom -jar <https://builds.apache.org/job/HBase-TRUNK/ws/trunk/target/surefire/surefirebooter1567618089067396830.jar>
<https://builds.apache.org/job/HBase-TRUNK/ws/trunk/target/surefire/surefire4884683211571067394tmp>
<https://builds.apache.org/job/HBase-TRUNK/ws/trunk/target/surefire/surefire_933679571788044164995tmp>
Running org.apache.hadoop.hbase.regionserver.TestHRegion
Tests run: 62, Failures: 0, Errors: 0, Skipped: 0, Time elapsed: 54.403 sec
Forking command line: /bin/sh -c cd <https://builds.apache.org/job/HBase-TRUNK/ws/trunk>
&& /home/jenkins/tools/java/jdk1.6.0_27-32/jre/bin/java -enableassertions -Xmx1900m
-Djava.security.egd=file:/dev/./urandom -jar <https://builds.apache.org/job/HBase-TRUNK/ws/trunk/target/surefire/surefirebooter6123829267327337692.jar>
<https://builds.apache.org/job/HBase-TRUNK/ws/trunk/target/surefire/surefire3883004423346660472tmp>
<https://builds.apache.org/job/HBase-TRUNK/ws/trunk/target/surefire/surefire_947525880961583528906tmp>
Running org.apache.hadoop.hbase.regionserver.TestSplitLogWorker
Tests run: 5, Failures: 0, Errors: 0, Skipped: 0, Time elapsed: 2.245 sec
Forking command line: /bin/sh -c cd <https://builds.apache.org/job/HBase-TRUNK/ws/trunk>
&& /home/jenkins/tools/java/jdk1.6.0_27-32/jre/bin/java -enableassertions -Xmx1900m
-Djava.security.egd=file:/dev/./urandom -jar <https://builds.apache.org/job/HBase-TRUNK/ws/trunk/target/surefire/surefirebooter1677539350463613247.jar>
<https://builds.apache.org/job/HBase-TRUNK/ws/trunk/target/surefire/surefire4616874181061550856tmp>
<https://builds.apache.org/job/HBase-TRUNK/ws/trunk/target/surefire/surefire_954587549890782237337tmp>
Running org.apache.hadoop.hbase.regionserver.TestServerCustomProtocol
Tests run: 7, Failures: 0, Errors: 0, Skipped: 0, Time elapsed: 16.587 sec
Forking command line: /bin/sh -c cd <https://builds.apache.org/job/HBase-TRUNK/ws/trunk>
&& /home/jenkins/tools/java/jdk1.6.0_27-32/jre/bin/java -enableassertions -Xmx1900m
-Djava.security.egd=file:/dev/./urandom -jar <https://builds.apache.org/job/HBase-TRUNK/ws/trunk/target/surefire/surefirebooter1885659721065268103.jar>
<https://builds.apache.org/job/HBase-TRUNK/ws/trunk/target/surefire/surefire6774226123519029743tmp>
<https://builds.apache.org/job/HBase-TRUNK/ws/trunk/target/surefire/surefire_96678932233178502724tmp>
Running org.apache.hadoop.hbase.regionserver.TestRegionServerMetrics
Tests run: 2, Failures: 0, Errors: 0, Skipped: 0, Time elapsed: 41.767 sec
Forking command line: /bin/sh -c cd <https://builds.apache.org/job/HBase-TRUNK/ws/trunk>
&& /home/jenkins/tools/java/jdk1.6.0_27-32/jre/bin/java -enableassertions -Xmx1900m
-Djava.security.egd=file:/dev/./urandom -jar <https://builds.apache.org/job/HBase-TRUNK/ws/trunk/target/surefire/surefirebooter2606348018217880689.jar>
<https://builds.apache.org/job/HBase-TRUNK/ws/trunk/target/surefire/surefire289905005230189042tmp>
<https://builds.apache.org/job/HBase-TRUNK/ws/trunk/target/surefire/surefire_97969650122971399295tmp>
Running org.apache.hadoop.hbase.regionserver.TestStoreFileBlockCacheSummary
Tests run: 1, Failures: 0, Errors: 0, Skipped: 0, Time elapsed: 15.339 sec
Forking command line: /bin/sh -c cd <https://builds.apache.org/job/HBase-TRUNK/ws/trunk>
&& /home/jenkins/tools/java/jdk1.6.0_27-32/jre/bin/java -enableassertions -Xmx1900m
-Djava.security.egd=file:/dev/./urandom -jar <https://builds.apache.org/job/HBase-TRUNK/ws/trunk/target/surefire/surefirebooter6747059971605302328.jar>
<https://builds.apache.org/job/HBase-TRUNK/ws/trunk/target/surefire/surefire6984201985423603878tmp>
<https://builds.apache.org/job/HBase-TRUNK/ws/trunk/target/surefire/surefire_983787650187386221764tmp>
Running org.apache.hadoop.hbase.regionserver.TestStore
Tests run: 12, Failures: 0, Errors: 0, Skipped: 0, Time elapsed: 9.707 sec
Forking command line: /bin/sh -c cd <https://builds.apache.org/job/HBase-TRUNK/ws/trunk>
&& /home/jenkins/tools/java/jdk1.6.0_27-32/jre/bin/java -enableassertions -Xmx1900m
-Djava.security.egd=file:/dev/./urandom -jar <https://builds.apache.org/job/HBase-TRUNK/ws/trunk/target/surefire/surefirebooter6522802159985175186.jar>
<https://builds.apache.org/job/HBase-TRUNK/ws/trunk/target/surefire/surefire8147889558938201470tmp>
<https://builds.apache.org/job/HBase-TRUNK/ws/trunk/target/surefire/surefire_998883343035952451901tmp>
Running org.apache.hadoop.hbase.regionserver.TestBlocksRead
Tests run: 4, Failures: 0, Errors: 0, Skipped: 0, Time elapsed: 1.153 sec
Forking command line: /bin/sh -c cd <https://builds.apache.org/job/HBase-TRUNK/ws/trunk>
&& /home/jenkins/tools/java/jdk1.6.0_27-32/jre/bin/java -enableassertions -Xmx1900m
-Djava.security.egd=file:/dev/./urandom -jar <https://builds.apache.org/job/HBase-TRUNK/ws/trunk/target/surefire/surefirebooter4577595073864688491.jar>
<https://builds.apache.org/job/HBase-TRUNK/ws/trunk/target/surefire/surefire1094671750163660105tmp>
<https://builds.apache.org/job/HBase-TRUNK/ws/trunk/target/surefire/surefire_100679110930074064432tmp>
Running org.apache.hadoop.hbase.regionserver.TestAtomicOperation
Tests run: 5, Failures: 0, Errors: 0, Skipped: 0, Time elapsed: 28.502 sec
Forking command line: /bin/sh -c cd <https://builds.apache.org/job/HBase-TRUNK/ws/trunk>
&& /home/jenkins/tools/java/jdk1.6.0_27-32/jre/bin/java -enableassertions -Xmx1900m
-Djava.security.egd=file:/dev/./urandom -jar <https://builds.apache.org/job/HBase-TRUNK/ws/trunk/target/surefire/surefirebooter6140920481360643326.jar>
<https://builds.apache.org/job/HBase-TRUNK/ws/trunk/target/surefire/surefire7995976551652520125tmp>
<https://builds.apache.org/job/HBase-TRUNK/ws/trunk/target/surefire/surefire_1014485507388846523207tmp>
Running org.apache.hadoop.hbase.regionserver.TestSeekOptimizations
Tests run: 6, Failures: 0, Errors: 0, Skipped: 0, Time elapsed: 2.848 sec
Forking command line: /bin/sh -c cd <https://builds.apache.org/job/HBase-TRUNK/ws/trunk>
&& /home/jenkins/tools/java/jdk1.6.0_27-32/jre/bin/java -enableassertions -Xmx1900m
-Djava.security.egd=file:/dev/./urandom -jar <https://builds.apache.org/job/HBase-TRUNK/ws/trunk/target/surefire/surefirebooter7087013752367103294.jar>
<https://builds.apache.org/job/HBase-TRUNK/ws/trunk/target/surefire/surefire3860786317491620549tmp>
<https://builds.apache.org/job/HBase-TRUNK/ws/trunk/target/surefire/surefire_1023775261061039883898tmp>
Running org.apache.hadoop.hbase.regionserver.TestFSErrorsExposed
Tests run: 3, Failures: 0, Errors: 0, Skipped: 0, Time elapsed: 28.768 sec
Forking command line: /bin/sh -c cd <https://builds.apache.org/job/HBase-TRUNK/ws/trunk>
&& /home/jenkins/tools/java/jdk1.6.0_27-32/jre/bin/java -enableassertions -Xmx1900m
-Djava.security.egd=file:/dev/./urandom -jar <https://builds.apache.org/job/HBase-TRUNK/ws/trunk/target/surefire/surefirebooter5494293238935682931.jar>
<https://builds.apache.org/job/HBase-TRUNK/ws/trunk/target/surefire/surefire4507091671526839436tmp>
<https://builds.apache.org/job/HBase-TRUNK/ws/trunk/target/surefire/surefire_1034092178154007388672tmp>
Running org.apache.hadoop.hbase.regionserver.handler.TestCloseRegionHandler
Tests run: 3, Failures: 0, Errors: 0, Skipped: 0, Time elapsed: 1.288 sec
Forking command line: /bin/sh -c cd <https://builds.apache.org/job/HBase-TRUNK/ws/trunk>
&& /home/jenkins/tools/java/jdk1.6.0_27-32/jre/bin/java -enableassertions -Xmx1900m
-Djava.security.egd=file:/dev/./urandom -jar <https://builds.apache.org/job/HBase-TRUNK/ws/trunk/target/surefire/surefirebooter2725522137698231005.jar>
<https://builds.apache.org/job/HBase-TRUNK/ws/trunk/target/surefire/surefire8708372196184835797tmp>
<https://builds.apache.org/job/HBase-TRUNK/ws/trunk/target/surefire/surefire_1045901187465559138892tmp>
Running org.apache.hadoop.hbase.regionserver.handler.TestOpenRegionHandler
Tests run: 3, Failures: 0, Errors: 0, Skipped: 0, Time elapsed: 1.047 sec
Forking command line: /bin/sh -c cd <https://builds.apache.org/job/HBase-TRUNK/ws/trunk>
&& /home/jenkins/tools/java/jdk1.6.0_27-32/jre/bin/java -enableassertions -Xmx1900m
-Djava.security.egd=file:/dev/./urandom -jar <https://builds.apache.org/job/HBase-TRUNK/ws/trunk/target/surefire/surefirebooter277637932959396370.jar>
<https://builds.apache.org/job/HBase-TRUNK/ws/trunk/target/surefire/surefire6479411913666817383tmp>
<https://builds.apache.org/job/HBase-TRUNK/ws/trunk/target/surefire/surefire_1053109399103758543587tmp>
Running org.apache.hadoop.hbase.regionserver.metrics.TestSchemaMetrics
Running org.apache.hadoop.hbase.regionserver.TestParallelPut
Tests run: 2, Failures: 0, Errors: 0, Skipped: 0, Time elapsed: 5.674 sec
Forking command line: /bin/sh -c cd <https://builds.apache.org/job/HBase-TRUNK/ws/trunk>
&& /home/jenkins/tools/java/jdk1.6.0_27-32/jre/bin/java -enableassertions -Xmx1900m
-Djava.security.egd=file:/dev/./urandom -jar <https://builds.apache.org/job/HBase-TRUNK/ws/trunk/target/surefire/surefirebooter6849491818162199839.jar>
<https://builds.apache.org/job/HBase-TRUNK/ws/trunk/target/surefire/surefire3805159578112896832tmp>
<https://builds.apache.org/job/HBase-TRUNK/ws/trunk/target/surefire/surefire_1067051448486874141314tmp>
Tests run: 6, Failures: 0, Errors: 0, Skipped: 0, Time elapsed: 15.38 sec
Forking command line: /bin/sh -c cd <https://builds.apache.org/job/HBase-TRUNK/ws/trunk>
&& /home/jenkins/tools/java/jdk1.6.0_27-32/jre/bin/java -enableassertions -Xmx1900m
-Djava.security.egd=file:/dev/./urandom -jar <https://builds.apache.org/job/HBase-TRUNK/ws/trunk/target/surefire/surefirebooter857121275089466919.jar>
<https://builds.apache.org/job/HBase-TRUNK/ws/trunk/target/surefire/surefire3610834226679919780tmp>
<https://builds.apache.org/job/HBase-TRUNK/ws/trunk/target/surefire/surefire_1072306093535187143727tmp>
Running org.apache.hadoop.hbase.regionserver.wal.TestHLogBench
Tests run: 1, Failures: 0, Errors: 0, Skipped: 0, Time elapsed: 1.382 sec
Forking command line: /bin/sh -c cd <https://builds.apache.org/job/HBase-TRUNK/ws/trunk>
&& /home/jenkins/tools/java/jdk1.6.0_27-32/jre/bin/java -enableassertions -Xmx1900m
-Djava.security.egd=file:/dev/./urandom -jar <https://builds.apache.org/job/HBase-TRUNK/ws/trunk/target/surefire/surefirebooter5784895980637687691.jar>
<https://builds.apache.org/job/HBase-TRUNK/ws/trunk/target/surefire/surefire4665709892275053908tmp>
<https://builds.apache.org/job/HBase-TRUNK/ws/trunk/target/surefire/surefire_1086189762409008448154tmp>
Running org.apache.hadoop.hbase.regionserver.wal.TestLogRollingNoCluster
Tests run: 1, Failures: 0, Errors: 0, Skipped: 0, Time elapsed: 2.385 sec
Forking command line: /bin/sh -c cd <https://builds.apache.org/job/HBase-TRUNK/ws/trunk>
&& /home/jenkins/tools/java/jdk1.6.0_27-32/jre/bin/java -enableassertions -Xmx1900m
-Djava.security.egd=file:/dev/./urandom -jar <https://builds.apache.org/job/HBase-TRUNK/ws/trunk/target/surefire/surefirebooter8051570641359048886.jar>
<https://builds.apache.org/job/HBase-TRUNK/ws/trunk/target/surefire/surefire3384754723618394047tmp>
<https://builds.apache.org/job/HBase-TRUNK/ws/trunk/target/surefire/surefire_1093611629297948701355tmp>
Running org.apache.hadoop.hbase.regionserver.wal.TestLogRollAbort
Tests run: 1, Failures: 0, Errors: 0, Skipped: 0, Time elapsed: 18.271 sec
Forking command line: /bin/sh -c cd <https://builds.apache.org/job/HBase-TRUNK/ws/trunk>
&& /home/jenkins/tools/java/jdk1.6.0_27-32/jre/bin/java -enableassertions -Xmx1900m
-Djava.security.egd=file:/dev/./urandom -jar <https://builds.apache.org/job/HBase-TRUNK/ws/trunk/target/surefire/surefirebooter7098771467835390299.jar>
<https://builds.apache.org/job/HBase-TRUNK/ws/trunk/target/surefire/surefire7309277385146615029tmp>
<https://builds.apache.org/job/HBase-TRUNK/ws/trunk/target/surefire/surefire_1101740008352628473048tmp>
Running org.apache.hadoop.hbase.regionserver.wal.TestWALReplay
Tests run: 5, Failures: 0, Errors: 0, Skipped: 0, Time elapsed: 28.051 sec
Running org.apache.hadoop.hbase.regionserver.wal.TestWALReplayCompressed
Tests run: 5, Failures: 0, Errors: 0, Skipped: 0, Time elapsed: 27.776 sec
Forking command line: /bin/sh -c cd <https://builds.apache.org/job/HBase-TRUNK/ws/trunk>
&& /home/jenkins/tools/java/jdk1.6.0_27-32/jre/bin/java -enableassertions -Xmx1900m
-Djava.security.egd=file:/dev/./urandom -jar <https://builds.apache.org/job/HBase-TRUNK/ws/trunk/target/surefire/surefirebooter6688165023006432925.jar>
<https://builds.apache.org/job/HBase-TRUNK/ws/trunk/target/surefire/surefire1115337816652678626tmp>
<https://builds.apache.org/job/HBase-TRUNK/ws/trunk/target/surefire/surefire_1113245398285253981167tmp>
Running org.apache.hadoop.hbase.regionserver.TestStoreScanner
Tests run: 16, Failures: 0, Errors: 0, Skipped: 0, Time elapsed: 0.051 sec
Forking command line: /bin/sh -c cd <https://builds.apache.org/job/HBase-TRUNK/ws/trunk>
&& /home/jenkins/tools/java/jdk1.6.0_27-32/jre/bin/java -enableassertions -Xmx1900m
-Djava.security.egd=file:/dev/./urandom -jar <https://builds.apache.org/job/HBase-TRUNK/ws/trunk/target/surefire/surefirebooter1539354108972477692.jar>
<https://builds.apache.org/job/HBase-TRUNK/ws/trunk/target/surefire/surefire2547662297082874826tmp>
<https://builds.apache.org/job/HBase-TRUNK/ws/trunk/target/surefire/surefire_1123636454391017490827tmp>
Running org.apache.hadoop.hbase.regionserver.TestRpcMetrics
Tests run: 1, Failures: 0, Errors: 0, Skipped: 0, Time elapsed: 2.155 sec
Forking command line: /bin/sh -c cd <https://builds.apache.org/job/HBase-TRUNK/ws/trunk>
&& /home/jenkins/tools/java/jdk1.6.0_27-32/jre/bin/java -enableassertions -Xmx1900m
-Djava.security.egd=file:/dev/./urandom -jar <https://builds.apache.org/job/HBase-TRUNK/ws/trunk/target/surefire/surefirebooter6802405827105952942.jar>
<https://builds.apache.org/job/HBase-TRUNK/ws/trunk/target/surefire/surefire183036467206931083tmp>
<https://builds.apache.org/job/HBase-TRUNK/ws/trunk/target/surefire/surefire_113220821973686431962tmp>
Forking command line: /bin/sh -c cd <https://builds.apache.org/job/HBase-TRUNK/ws/trunk>
&& /home/jenkins/tools/java/jdk1.6.0_27-32/jre/bin/java -enableassertions -Xmx1900m
-Djava.security.egd=file:/dev/./urandom -jar <https://builds.apache.org/job/HBase-TRUNK/ws/trunk/target/surefire/surefirebooter2147194221348426979.jar>
<https://builds.apache.org/job/HBase-TRUNK/ws/trunk/target/surefire/surefire7755530504900659264tmp>
<https://builds.apache.org/job/HBase-TRUNK/ws/trunk/target/surefire/surefire_1141835589960329574784tmp>
Running org.apache.hadoop.hbase.TestDrainingServer
Tests run: 2, Failures: 0, Errors: 0, Skipped: 0, Time elapsed: 21.089 sec
Forking command line: /bin/sh -c cd <https://builds.apache.org/job/HBase-TRUNK/ws/trunk>
&& /home/jenkins/tools/java/jdk1.6.0_27-32/jre/bin/java -enableassertions -Xmx1900m
-Djava.security.egd=file:/dev/./urandom -jar <https://builds.apache.org/job/HBase-TRUNK/ws/trunk/target/surefire/surefirebooter6255883913918247929.jar>
<https://builds.apache.org/job/HBase-TRUNK/ws/trunk/target/surefire/surefire6911119667644715753tmp>
<https://builds.apache.org/job/HBase-TRUNK/ws/trunk/target/surefire/surefire_1157870043662035711355tmp>
Running org.apache.hadoop.hbase.regionserver.TestMultiColumnScanner
Tests run: 12, Failures: 0, Errors: 0, Skipped: 0, Time elapsed: 41.244 sec
Forking command line: /bin/sh -c cd <https://builds.apache.org/job/HBase-TRUNK/ws/trunk>
&& /home/jenkins/tools/java/jdk1.6.0_27-32/jre/bin/java -enableassertions -Xmx1900m
-Djava.security.egd=file:/dev/./urandom -jar <https://builds.apache.org/job/HBase-TRUNK/ws/trunk/target/surefire/surefirebooter1096003063893374819.jar>
<https://builds.apache.org/job/HBase-TRUNK/ws/trunk/target/surefire/surefire1173143243106172716tmp>
<https://builds.apache.org/job/HBase-TRUNK/ws/trunk/target/surefire/surefire_1166576274374652152033tmp>
Running org.apache.hadoop.hbase.mapreduce.TestImportTsv
Tests run: 8, Failures: 0, Errors: 0, Skipped: 0, Time elapsed: 80.107 sec
Forking command line: /bin/sh -c cd <https://builds.apache.org/job/HBase-TRUNK/ws/trunk>
&& /home/jenkins/tools/java/jdk1.6.0_27-32/jre/bin/java -enableassertions -Xmx1900m
-Djava.security.egd=file:/dev/./urandom -jar <https://builds.apache.org/job/HBase-TRUNK/ws/trunk/target/surefire/surefirebooter3543027095820918616.jar>
<https://builds.apache.org/job/HBase-TRUNK/ws/trunk/target/surefire/surefire833309344131315468tmp>
<https://builds.apache.org/job/HBase-TRUNK/ws/trunk/target/surefire/surefire_1173989470730450917225tmp>
Running org.apache.hadoop.hbase.mapreduce.TestHLogRecordReader
Tests run: 2, Failures: 0, Errors: 0, Skipped: 0, Time elapsed: 5.613 sec
Running org.apache.hadoop.hbase.mapreduce.TestImportExport
Tests run: 2, Failures: 0, Errors: 0, Skipped: 0, Time elapsed: 107.688 sec

Results :

Tests run: 605, Failures: 0, Errors: 0, Skipped: 2

[INFO] ------------------------------------------------------------------------
[INFO] BUILD FAILURE
[INFO] ------------------------------------------------------------------------
[INFO] Total time: 34:51.953s
[INFO] Finished at: Fri Apr 13 23:51:34 UTC 2012
[INFO] Final Memory: 74M/595M
[INFO] ------------------------------------------------------------------------
[ERROR] Failed to execute goal org.apache.maven.plugins:maven-surefire-plugin:2.12-TRUNK-HBASE-2:test
(secondPartTestsExecution) on project hbase: Failure or timeout -> [Help 1]
org.apache.maven.lifecycle.LifecycleExecutionException: Failed to execute goal org.apache.maven.plugins:maven-surefire-plugin:2.12-TRUNK-HBASE-2:test
(secondPartTestsExecution) on project hbase: Failure or timeout
	at org.apache.maven.lifecycle.internal.MojoExecutor.execute(MojoExecutor.java:217)
	at org.apache.maven.lifecycle.internal.MojoExecutor.execute(MojoExecutor.java:153)
	at org.apache.maven.lifecycle.internal.MojoExecutor.execute(MojoExecutor.java:145)
	at org.apache.maven.lifecycle.internal.LifecycleModuleBuilder.buildProject(LifecycleModuleBuilder.java:84)
	at org.apache.maven.lifecycle.internal.LifecycleModuleBuilder.buildProject(LifecycleModuleBuilder.java:59)
	at org.apache.maven.lifecycle.internal.LifecycleStarter.singleThreadedBuild(LifecycleStarter.java:183)
	at org.apache.maven.lifecycle.internal.LifecycleStarter.execute(LifecycleStarter.java:161)
	at org.apache.maven.DefaultMaven.doExecute(DefaultMaven.java:319)
	at org.apache.maven.DefaultMaven.execute(DefaultMaven.java:156)
	at org.apache.maven.cli.MavenCli.execute(MavenCli.java:537)
	at org.apache.maven.cli.MavenCli.doMain(MavenCli.java:196)
	at org.apache.maven.cli.MavenCli.main(MavenCli.java:141)
	at sun.reflect.NativeMethodAccessorImpl.invoke0(Native Method)
	at sun.reflect.NativeMethodAccessorImpl.invoke(NativeMethodAccessorImpl.java:39)
	at sun.reflect.DelegatingMethodAccessorImpl.invoke(DelegatingMethodAccessorImpl.java:25)
	at java.lang.reflect.Method.invoke(Method.java:597)
	at org.codehaus.plexus.classworlds.launcher.Launcher.launchEnhanced(Launcher.java:290)
	at org.codehaus.plexus.classworlds.launcher.Launcher.launch(Launcher.java:230)
	at org.codehaus.plexus.classworlds.launcher.Launcher.mainWithExitCode(Launcher.java:409)
	at org.codehaus.plexus.classworlds.launcher.Launcher.main(Launcher.java:352)
Caused by: org.apache.maven.plugin.MojoExecutionException: Failure or timeout
	at org.apache.maven.plugin.surefire.SurefirePlugin.assertNoFailureOrTimeout(SurefirePlugin.java:643)
	at org.apache.maven.plugin.surefire.SurefirePlugin.handleSummary(SurefirePlugin.java:624)
	at org.apache.maven.plugin.surefire.AbstractSurefireMojo.executeAfterPreconditionsChecked(AbstractSurefireMojo.java:137)
	at org.apache.maven.plugin.surefire.AbstractSurefireMojo.execute(AbstractSurefireMojo.java:98)
	at org.apache.maven.plugin.DefaultBuildPluginManager.executeMojo(DefaultBuildPluginManager.java:101)
	at org.apache.maven.lifecycle.internal.MojoExecutor.execute(MojoExecutor.java:209)
	... 19 more
[ERROR] 
[ERROR] 
[ERROR] For more information about the errors and possible solutions, please read the following
articles:
[ERROR] [Help 1] http://cwiki.apache.org/confluence/display/MAVEN/MojoExecutionException
Build step 'Invoke top-level Maven targets' marked build as failure
Archiving artifacts
Recording test results
Updating HBASE-5747
Updating HBASE-5708
Updating HBASE-5604

Mime
View raw message