hbase-dev mailing list archives

Site index · List index
Message view « Date » · « Thread »
Top « Date » · « Thread »
From Apache Jenkins Server <jenk...@builds.apache.org>
Subject Build failed in Jenkins: HBase-0.94 #90
Date Thu, 05 Apr 2012 21:46:13 GMT
See <https://builds.apache.org/job/HBase-0.94/90/changes>

Changes:

[stack] HBASE-5724 Row cache of KeyValue should be cleared in readFields().

[stack] HBASE-5711 Tests are failing with incorrect data directory permissions.

------------------------------------------
[...truncated 7273 lines...]
Forking command line: /bin/sh -c cd /x1/jenkins/jenkins-slave/workspace/HBase-0.94/trunk &&
/x1/jenkins/tools/java/jdk1.6.0_27-32/jre/bin/java -enableassertions -Xmx1900m -Djava.security.egd=file:/dev/./urandom
-jar /x1/jenkins/jenkins-slave/workspace/HBase-0.94/trunk/target/surefire/surefirebooter5438892342266598193.jar
/x1/jenkins/jenkins-slave/workspace/HBase-0.94/trunk/target/surefire/surefire7521769880574422763tmp
/x1/jenkins/jenkins-slave/workspace/HBase-0.94/trunk/target/surefire/surefire_828050239894522841906tmp
Running org.apache.hadoop.hbase.rest.TestGzipFilter
Tests run: 1, Failures: 0, Errors: 1, Skipped: 0, Time elapsed: 1.502 sec <<< FAILURE!
Running org.apache.hadoop.hbase.rest.TestRowResource
Tests run: 1, Failures: 0, Errors: 1, Skipped: 0, Time elapsed: 1.501 sec <<< FAILURE!
Forking command line: /bin/sh -c cd /x1/jenkins/jenkins-slave/workspace/HBase-0.94/trunk &&
/x1/jenkins/tools/java/jdk1.6.0_27-32/jre/bin/java -enableassertions -Xmx1900m -Djava.security.egd=file:/dev/./urandom
-jar /x1/jenkins/jenkins-slave/workspace/HBase-0.94/trunk/target/surefire/surefirebooter3462008154106844728.jar
/x1/jenkins/jenkins-slave/workspace/HBase-0.94/trunk/target/surefire/surefire8195846692964455041tmp
/x1/jenkins/jenkins-slave/workspace/HBase-0.94/trunk/target/surefire/surefire_838653092134435556343tmp
Forking command line: /bin/sh -c cd /x1/jenkins/jenkins-slave/workspace/HBase-0.94/trunk &&
/x1/jenkins/tools/java/jdk1.6.0_27-32/jre/bin/java -enableassertions -Xmx1900m -Djava.security.egd=file:/dev/./urandom
-jar /x1/jenkins/jenkins-slave/workspace/HBase-0.94/trunk/target/surefire/surefirebooter7236388214332279763.jar
/x1/jenkins/jenkins-slave/workspace/HBase-0.94/trunk/target/surefire/surefire4577644364930055786tmp
/x1/jenkins/jenkins-slave/workspace/HBase-0.94/trunk/target/surefire/surefire_847846361961453593207tmp
Running org.apache.hadoop.hbase.rest.TestScannerResource
Tests run: 1, Failures: 0, Errors: 1, Skipped: 0, Time elapsed: 1.329 sec <<< FAILURE!
Running org.apache.hadoop.hbase.rest.TestVersionResource
Tests run: 1, Failures: 0, Errors: 1, Skipped: 0, Time elapsed: 1.563 sec <<< FAILURE!
Forking command line: /bin/sh -c cd /x1/jenkins/jenkins-slave/workspace/HBase-0.94/trunk &&
/x1/jenkins/tools/java/jdk1.6.0_27-32/jre/bin/java -enableassertions -Xmx1900m -Djava.security.egd=file:/dev/./urandom
-jar /x1/jenkins/jenkins-slave/workspace/HBase-0.94/trunk/target/surefire/surefirebooter6166041353362551748.jar
/x1/jenkins/jenkins-slave/workspace/HBase-0.94/trunk/target/surefire/surefire5835862698255315922tmp
/x1/jenkins/jenkins-slave/workspace/HBase-0.94/trunk/target/surefire/surefire_851983424622604022634tmp
Forking command line: /bin/sh -c cd /x1/jenkins/jenkins-slave/workspace/HBase-0.94/trunk &&
/x1/jenkins/tools/java/jdk1.6.0_27-32/jre/bin/java -enableassertions -Xmx1900m -Djava.security.egd=file:/dev/./urandom
-jar /x1/jenkins/jenkins-slave/workspace/HBase-0.94/trunk/target/surefire/surefirebooter4902091755585504598.jar
/x1/jenkins/jenkins-slave/workspace/HBase-0.94/trunk/target/surefire/surefire1537046899841193939tmp
/x1/jenkins/jenkins-slave/workspace/HBase-0.94/trunk/target/surefire/surefire_863986995048741315180tmp
Running org.apache.hadoop.hbase.rest.TestStatusResource
Tests run: 1, Failures: 0, Errors: 1, Skipped: 0, Time elapsed: 1.496 sec <<< FAILURE!
Running org.apache.hadoop.hbase.rest.TestScannersWithFilters
Tests run: 1, Failures: 0, Errors: 1, Skipped: 0, Time elapsed: 1.488 sec <<< FAILURE!
Forking command line: /bin/sh -c cd /x1/jenkins/jenkins-slave/workspace/HBase-0.94/trunk &&
/x1/jenkins/tools/java/jdk1.6.0_27-32/jre/bin/java -enableassertions -Xmx1900m -Djava.security.egd=file:/dev/./urandom
-jar /x1/jenkins/jenkins-slave/workspace/HBase-0.94/trunk/target/surefire/surefirebooter500502608477468447.jar
/x1/jenkins/jenkins-slave/workspace/HBase-0.94/trunk/target/surefire/surefire2346467979387767050tmp
/x1/jenkins/jenkins-slave/workspace/HBase-0.94/trunk/target/surefire/surefire_878542819517783160276tmp
Forking command line: /bin/sh -c cd /x1/jenkins/jenkins-slave/workspace/HBase-0.94/trunk &&
/x1/jenkins/tools/java/jdk1.6.0_27-32/jre/bin/java -enableassertions -Xmx1900m -Djava.security.egd=file:/dev/./urandom
-jar /x1/jenkins/jenkins-slave/workspace/HBase-0.94/trunk/target/surefire/surefirebooter8267963579540512847.jar
/x1/jenkins/jenkins-slave/workspace/HBase-0.94/trunk/target/surefire/surefire8936378666838511152tmp
/x1/jenkins/jenkins-slave/workspace/HBase-0.94/trunk/target/surefire/surefire_884986260537642878435tmp
Running org.apache.hadoop.hbase.metrics.TestMetricsMBeanBase
Tests run: 2, Failures: 0, Errors: 0, Skipped: 0, Time elapsed: 1.161 sec
Forking command line: /bin/sh -c cd /x1/jenkins/jenkins-slave/workspace/HBase-0.94/trunk &&
/x1/jenkins/tools/java/jdk1.6.0_27-32/jre/bin/java -enableassertions -Xmx1900m -Djava.security.egd=file:/dev/./urandom
-jar /x1/jenkins/jenkins-slave/workspace/HBase-0.94/trunk/target/surefire/surefirebooter90898550265515790.jar
/x1/jenkins/jenkins-slave/workspace/HBase-0.94/trunk/target/surefire/surefire4462696994051150259tmp
/x1/jenkins/jenkins-slave/workspace/HBase-0.94/trunk/target/surefire/surefire_894073732694772248368tmp
Running org.apache.hadoop.hbase.io.hfile.TestHFileBlockIndex
Tests run: 10, Failures: 0, Errors: 0, Skipped: 0, Time elapsed: 7.088 sec
Running org.apache.hadoop.hbase.io.hfile.TestHFileSeek
Tests run: 1, Failures: 0, Errors: 0, Skipped: 0, Time elapsed: 6.207 sec
Forking command line: /bin/sh -c cd /x1/jenkins/jenkins-slave/workspace/HBase-0.94/trunk &&
/x1/jenkins/tools/java/jdk1.6.0_27-32/jre/bin/java -enableassertions -Xmx1900m -Djava.security.egd=file:/dev/./urandom
-jar /x1/jenkins/jenkins-slave/workspace/HBase-0.94/trunk/target/surefire/surefirebooter7187985427680025867.jar
/x1/jenkins/jenkins-slave/workspace/HBase-0.94/trunk/target/surefire/surefire5848547977156646121tmp
/x1/jenkins/jenkins-slave/workspace/HBase-0.94/trunk/target/surefire/surefire_90729233751115962418tmp
Forking command line: /bin/sh -c cd /x1/jenkins/jenkins-slave/workspace/HBase-0.94/trunk &&
/x1/jenkins/tools/java/jdk1.6.0_27-32/jre/bin/java -enableassertions -Xmx1900m -Djava.security.egd=file:/dev/./urandom
-jar /x1/jenkins/jenkins-slave/workspace/HBase-0.94/trunk/target/surefire/surefirebooter3007732743128859562.jar
/x1/jenkins/jenkins-slave/workspace/HBase-0.94/trunk/target/surefire/surefire5576562184756988172tmp
/x1/jenkins/jenkins-slave/workspace/HBase-0.94/trunk/target/surefire/surefire_912244322561779449637tmp
Running org.apache.hadoop.hbase.io.hfile.TestLruBlockCache
Tests run: 16, Failures: 0, Errors: 0, Skipped: 0, Time elapsed: 0.681 sec
Forking command line: /bin/sh -c cd /x1/jenkins/jenkins-slave/workspace/HBase-0.94/trunk &&
/x1/jenkins/tools/java/jdk1.6.0_27-32/jre/bin/java -enableassertions -Xmx1900m -Djava.security.egd=file:/dev/./urandom
-jar /x1/jenkins/jenkins-slave/workspace/HBase-0.94/trunk/target/surefire/surefirebooter8845803455761607462.jar
/x1/jenkins/jenkins-slave/workspace/HBase-0.94/trunk/target/surefire/surefire8167933554377937242tmp
/x1/jenkins/jenkins-slave/workspace/HBase-0.94/trunk/target/surefire/surefire_92881638521323629876tmp
Running org.apache.hadoop.hbase.io.hfile.TestFixedFileTrailer
Tests run: 2, Failures: 0, Errors: 0, Skipped: 0, Time elapsed: 0.507 sec
Forking command line: /bin/sh -c cd /x1/jenkins/jenkins-slave/workspace/HBase-0.94/trunk &&
/x1/jenkins/tools/java/jdk1.6.0_27-32/jre/bin/java -enableassertions -Xmx1900m -Djava.security.egd=file:/dev/./urandom
-jar /x1/jenkins/jenkins-slave/workspace/HBase-0.94/trunk/target/surefire/surefirebooter4747556113003208913.jar
/x1/jenkins/jenkins-slave/workspace/HBase-0.94/trunk/target/surefire/surefire3916276443858626852tmp
/x1/jenkins/jenkins-slave/workspace/HBase-0.94/trunk/target/surefire/surefire_936894013637481901465tmp
Running org.apache.hadoop.hbase.io.hfile.TestHFilePerformance
Tests run: 1, Failures: 0, Errors: 0, Skipped: 0, Time elapsed: 4.418 sec
Forking command line: /bin/sh -c cd /x1/jenkins/jenkins-slave/workspace/HBase-0.94/trunk &&
/x1/jenkins/tools/java/jdk1.6.0_27-32/jre/bin/java -enableassertions -Xmx1900m -Djava.security.egd=file:/dev/./urandom
-jar /x1/jenkins/jenkins-slave/workspace/HBase-0.94/trunk/target/surefire/surefirebooter7177765550582823061.jar
/x1/jenkins/jenkins-slave/workspace/HBase-0.94/trunk/target/surefire/surefire6923805914778831972tmp
/x1/jenkins/jenkins-slave/workspace/HBase-0.94/trunk/target/surefire/surefire_945216694055462449587tmp
Running org.apache.hadoop.hbase.io.hfile.TestHFileBlockCompatibility
Tests run: 10, Failures: 0, Errors: 0, Skipped: 0, Time elapsed: 0.946 sec
Forking command line: /bin/sh -c cd /x1/jenkins/jenkins-slave/workspace/HBase-0.94/trunk &&
/x1/jenkins/tools/java/jdk1.6.0_27-32/jre/bin/java -enableassertions -Xmx1900m -Djava.security.egd=file:/dev/./urandom
-jar /x1/jenkins/jenkins-slave/workspace/HBase-0.94/trunk/target/surefire/surefirebooter7713302700294043568.jar
/x1/jenkins/jenkins-slave/workspace/HBase-0.94/trunk/target/surefire/surefire2861855150850769320tmp
/x1/jenkins/jenkins-slave/workspace/HBase-0.94/trunk/target/surefire/surefire_953162905691348896296tmp
Running org.apache.hadoop.hbase.io.hfile.TestCacheOnWrite
Tests run: 36, Failures: 0, Errors: 0, Skipped: 0, Time elapsed: 24.301 sec
Forking command line: /bin/sh -c cd /x1/jenkins/jenkins-slave/workspace/HBase-0.94/trunk &&
/x1/jenkins/tools/java/jdk1.6.0_27-32/jre/bin/java -enableassertions -Xmx1900m -Djava.security.egd=file:/dev/./urandom
-jar /x1/jenkins/jenkins-slave/workspace/HBase-0.94/trunk/target/surefire/surefirebooter2919336878538853703.jar
/x1/jenkins/jenkins-slave/workspace/HBase-0.94/trunk/target/surefire/surefire7546940931093236554tmp
/x1/jenkins/jenkins-slave/workspace/HBase-0.94/trunk/target/surefire/surefire_965188811125104947701tmp
Running org.apache.hadoop.hbase.io.hfile.TestChecksum
Tests run: 3, Failures: 0, Errors: 0, Skipped: 0, Time elapsed: 0.785 sec
Forking command line: /bin/sh -c cd /x1/jenkins/jenkins-slave/workspace/HBase-0.94/trunk &&
/x1/jenkins/tools/java/jdk1.6.0_27-32/jre/bin/java -enableassertions -Xmx1900m -Djava.security.egd=file:/dev/./urandom
-jar /x1/jenkins/jenkins-slave/workspace/HBase-0.94/trunk/target/surefire/surefirebooter4606096614993358683.jar
/x1/jenkins/jenkins-slave/workspace/HBase-0.94/trunk/target/surefire/surefire8506687007812087724tmp
/x1/jenkins/jenkins-slave/workspace/HBase-0.94/trunk/target/surefire/surefire_976867447799105135875tmp
Running org.apache.hadoop.hbase.io.hfile.TestForceCacheImportantBlocks
Tests run: 4, Failures: 0, Errors: 0, Skipped: 0, Time elapsed: 35.16 sec
Forking command line: /bin/sh -c cd /x1/jenkins/jenkins-slave/workspace/HBase-0.94/trunk &&
/x1/jenkins/tools/java/jdk1.6.0_27-32/jre/bin/java -enableassertions -Xmx1900m -Djava.security.egd=file:/dev/./urandom
-jar /x1/jenkins/jenkins-slave/workspace/HBase-0.94/trunk/target/surefire/surefirebooter4483566982051731393.jar
/x1/jenkins/jenkins-slave/workspace/HBase-0.94/trunk/target/surefire/surefire2084537342518347474tmp
/x1/jenkins/jenkins-slave/workspace/HBase-0.94/trunk/target/surefire/surefire_988550561834155631345tmp
Running org.apache.hadoop.hbase.io.hfile.slab.TestSlabCache
Tests run: 7, Failures: 0, Errors: 0, Skipped: 0, Time elapsed: 11.366 sec
Forking command line: /bin/sh -c cd /x1/jenkins/jenkins-slave/workspace/HBase-0.94/trunk &&
/x1/jenkins/tools/java/jdk1.6.0_27-32/jre/bin/java -enableassertions -Xmx1900m -Djava.security.egd=file:/dev/./urandom
-jar /x1/jenkins/jenkins-slave/workspace/HBase-0.94/trunk/target/surefire/surefirebooter1172963274999433028.jar
/x1/jenkins/jenkins-slave/workspace/HBase-0.94/trunk/target/surefire/surefire2503513974375318195tmp
/x1/jenkins/jenkins-slave/workspace/HBase-0.94/trunk/target/surefire/surefire_992758381946148665853tmp
Running org.apache.hadoop.hbase.io.hfile.slab.TestSingleSizeCache
Tests run: 5, Failures: 0, Errors: 0, Skipped: 0, Time elapsed: 16.862 sec
Forking command line: /bin/sh -c cd /x1/jenkins/jenkins-slave/workspace/HBase-0.94/trunk &&
/x1/jenkins/tools/java/jdk1.6.0_27-32/jre/bin/java -enableassertions -Xmx1900m -Djava.security.egd=file:/dev/./urandom
-jar /x1/jenkins/jenkins-slave/workspace/HBase-0.94/trunk/target/surefire/surefirebooter5227987691139555563.jar
/x1/jenkins/jenkins-slave/workspace/HBase-0.94/trunk/target/surefire/surefire9068337994631551524tmp
/x1/jenkins/jenkins-slave/workspace/HBase-0.94/trunk/target/surefire/surefire_1006464350774548405207tmp
Running org.apache.hadoop.hbase.io.encoding.TestLoadAndSwitchEncodeOnDisk
Tests run: 1, Failures: 0, Errors: 1, Skipped: 0, Time elapsed: 1.47 sec <<< FAILURE!
Forking command line: /bin/sh -c cd /x1/jenkins/jenkins-slave/workspace/HBase-0.94/trunk &&
/x1/jenkins/tools/java/jdk1.6.0_27-32/jre/bin/java -enableassertions -Xmx1900m -Djava.security.egd=file:/dev/./urandom
-jar /x1/jenkins/jenkins-slave/workspace/HBase-0.94/trunk/target/surefire/surefirebooter3562265471915911654.jar
/x1/jenkins/jenkins-slave/workspace/HBase-0.94/trunk/target/surefire/surefire8821711672696550592tmp
/x1/jenkins/jenkins-slave/workspace/HBase-0.94/trunk/target/surefire/surefire_1018137615394340354882tmp
Running org.apache.hadoop.hbase.replication.TestReplicationZookeeper
Tests run: 1, Failures: 0, Errors: 0, Skipped: 0, Time elapsed: 0.649 sec
Forking command line: /bin/sh -c cd /x1/jenkins/jenkins-slave/workspace/HBase-0.94/trunk &&
/x1/jenkins/tools/java/jdk1.6.0_27-32/jre/bin/java -enableassertions -Xmx1900m -Djava.security.egd=file:/dev/./urandom
-jar /x1/jenkins/jenkins-slave/workspace/HBase-0.94/trunk/target/surefire/surefirebooter334592604098020890.jar
/x1/jenkins/jenkins-slave/workspace/HBase-0.94/trunk/target/surefire/surefire63528061247438807tmp
/x1/jenkins/jenkins-slave/workspace/HBase-0.94/trunk/target/surefire/surefire_1022997600161354023135tmp
Running org.apache.hadoop.hbase.replication.regionserver.TestReplicationSink
Tests run: 1, Failures: 0, Errors: 1, Skipped: 0, Time elapsed: 1.838 sec <<< FAILURE!
Forking command line: /bin/sh -c cd /x1/jenkins/jenkins-slave/workspace/HBase-0.94/trunk &&
/x1/jenkins/tools/java/jdk1.6.0_27-32/jre/bin/java -enableassertions -Xmx1900m -Djava.security.egd=file:/dev/./urandom
-jar /x1/jenkins/jenkins-slave/workspace/HBase-0.94/trunk/target/surefire/surefirebooter4526969605612521611.jar
/x1/jenkins/jenkins-slave/workspace/HBase-0.94/trunk/target/surefire/surefire7210077628297162794tmp
/x1/jenkins/jenkins-slave/workspace/HBase-0.94/trunk/target/surefire/surefire_1034303736636892960332tmp
Running org.apache.hadoop.hbase.replication.regionserver.TestReplicationSourceManager
Tests run: 1, Failures: 0, Errors: 0, Skipped: 0, Time elapsed: 1.057 sec
Forking command line: /bin/sh -c cd /x1/jenkins/jenkins-slave/workspace/HBase-0.94/trunk &&
/x1/jenkins/tools/java/jdk1.6.0_27-32/jre/bin/java -enableassertions -Xmx1900m -Djava.security.egd=file:/dev/./urandom
-jar /x1/jenkins/jenkins-slave/workspace/HBase-0.94/trunk/target/surefire/surefirebooter7358072065671621673.jar
/x1/jenkins/jenkins-slave/workspace/HBase-0.94/trunk/target/surefire/surefire7308938774869499970tmp
/x1/jenkins/jenkins-slave/workspace/HBase-0.94/trunk/target/surefire/surefire_104600657549319140320tmp
Running org.apache.hadoop.hbase.replication.TestReplicationSource
Tests run: 1, Failures: 0, Errors: 1, Skipped: 0, Time elapsed: 1.721 sec <<< FAILURE!
Forking command line: /bin/sh -c cd /x1/jenkins/jenkins-slave/workspace/HBase-0.94/trunk &&
/x1/jenkins/tools/java/jdk1.6.0_27-32/jre/bin/java -enableassertions -Xmx1900m -Djava.security.egd=file:/dev/./urandom
-jar /x1/jenkins/jenkins-slave/workspace/HBase-0.94/trunk/target/surefire/surefirebooter7465443390365213587.jar
/x1/jenkins/jenkins-slave/workspace/HBase-0.94/trunk/target/surefire/surefire4331656115294371451tmp
/x1/jenkins/jenkins-slave/workspace/HBase-0.94/trunk/target/surefire/surefire_1053328103123248039035tmp
Running org.apache.hadoop.hbase.io.hfile.TestHFileBlock
Tests run: 16, Failures: 0, Errors: 0, Skipped: 0, Time elapsed: 45.561 sec
Forking command line: /bin/sh -c cd /x1/jenkins/jenkins-slave/workspace/HBase-0.94/trunk &&
/x1/jenkins/tools/java/jdk1.6.0_27-32/jre/bin/java -enableassertions -Xmx1900m -Djava.security.egd=file:/dev/./urandom
-jar /x1/jenkins/jenkins-slave/workspace/HBase-0.94/trunk/target/surefire/surefirebooter2829225125569284976.jar
/x1/jenkins/jenkins-slave/workspace/HBase-0.94/trunk/target/surefire/surefire4965758149428459969tmp
/x1/jenkins/jenkins-slave/workspace/HBase-0.94/trunk/target/surefire/surefire_1064732238161074273136tmp
Running org.apache.hadoop.hbase.util.TestFSTableDescriptors
Tests run: 10, Failures: 0, Errors: 0, Skipped: 0, Time elapsed: 0.784 sec
Forking command line: /bin/sh -c cd /x1/jenkins/jenkins-slave/workspace/HBase-0.94/trunk &&
/x1/jenkins/tools/java/jdk1.6.0_27-32/jre/bin/java -enableassertions -Xmx1900m -Djava.security.egd=file:/dev/./urandom
-jar /x1/jenkins/jenkins-slave/workspace/HBase-0.94/trunk/target/surefire/surefirebooter4997566417005174656.jar
/x1/jenkins/jenkins-slave/workspace/HBase-0.94/trunk/target/surefire/surefire4608276418687800450tmp
/x1/jenkins/jenkins-slave/workspace/HBase-0.94/trunk/target/surefire/surefire_1075376702557572091801tmp
Running org.apache.hadoop.hbase.replication.TestReplicationPeer
Tests run: 1, Failures: 0, Errors: 0, Skipped: 0, Time elapsed: 7.579 sec
Forking command line: /bin/sh -c cd /x1/jenkins/jenkins-slave/workspace/HBase-0.94/trunk &&
/x1/jenkins/tools/java/jdk1.6.0_27-32/jre/bin/java -enableassertions -Xmx1900m -Djava.security.egd=file:/dev/./urandom
-jar /x1/jenkins/jenkins-slave/workspace/HBase-0.94/trunk/target/surefire/surefirebooter4828042932099007872.jar
/x1/jenkins/jenkins-slave/workspace/HBase-0.94/trunk/target/surefire/surefire7119588649634195451tmp
/x1/jenkins/jenkins-slave/workspace/HBase-0.94/trunk/target/surefire/surefire_1086174507670277015140tmp
Running org.apache.hadoop.hbase.util.TestEnvironmentEdgeManager
Tests run: 2, Failures: 0, Errors: 0, Skipped: 0, Time elapsed: 0.426 sec
Forking command line: /bin/sh -c cd /x1/jenkins/jenkins-slave/workspace/HBase-0.94/trunk &&
/x1/jenkins/tools/java/jdk1.6.0_27-32/jre/bin/java -enableassertions -Xmx1900m -Djava.security.egd=file:/dev/./urandom
-jar /x1/jenkins/jenkins-slave/workspace/HBase-0.94/trunk/target/surefire/surefirebooter1964214733712577462.jar
/x1/jenkins/jenkins-slave/workspace/HBase-0.94/trunk/target/surefire/surefire1220756327094614036tmp
/x1/jenkins/jenkins-slave/workspace/HBase-0.94/trunk/target/surefire/surefire_1093455879587269007170tmp
Running org.apache.hadoop.hbase.util.TestMergeTable
Tests run: 1, Failures: 0, Errors: 1, Skipped: 0, Time elapsed: 1.739 sec <<< FAILURE!
Forking command line: /bin/sh -c cd /x1/jenkins/jenkins-slave/workspace/HBase-0.94/trunk &&
/x1/jenkins/tools/java/jdk1.6.0_27-32/jre/bin/java -enableassertions -Xmx1900m -Djava.security.egd=file:/dev/./urandom
-jar /x1/jenkins/jenkins-slave/workspace/HBase-0.94/trunk/target/surefire/surefirebooter1991636312127250690.jar
/x1/jenkins/jenkins-slave/workspace/HBase-0.94/trunk/target/surefire/surefire5647701705596436394tmp
/x1/jenkins/jenkins-slave/workspace/HBase-0.94/trunk/target/surefire/surefire_1102205780837327879923tmp
Running org.apache.hadoop.hbase.util.TestHBaseFsck
Tests run: 1, Failures: 0, Errors: 1, Skipped: 0, Time elapsed: 1.589 sec <<< FAILURE!
Forking command line: /bin/sh -c cd /x1/jenkins/jenkins-slave/workspace/HBase-0.94/trunk &&
/x1/jenkins/tools/java/jdk1.6.0_27-32/jre/bin/java -enableassertions -Xmx1900m -Djava.security.egd=file:/dev/./urandom
-jar /x1/jenkins/jenkins-slave/workspace/HBase-0.94/trunk/target/surefire/surefirebooter4174519168432436967.jar
/x1/jenkins/jenkins-slave/workspace/HBase-0.94/trunk/target/surefire/surefire5402689925526110791tmp
/x1/jenkins/jenkins-slave/workspace/HBase-0.94/trunk/target/surefire/surefire_1115671791620953506665tmp
Running org.apache.hadoop.hbase.util.TestFSUtils
Tests run: 3, Failures: 0, Errors: 2, Skipped: 0, Time elapsed: 2.01 sec <<< FAILURE!
Forking command line: /bin/sh -c cd /x1/jenkins/jenkins-slave/workspace/HBase-0.94/trunk &&
/x1/jenkins/tools/java/jdk1.6.0_27-32/jre/bin/java -enableassertions -Xmx1900m -Djava.security.egd=file:/dev/./urandom
-jar /x1/jenkins/jenkins-slave/workspace/HBase-0.94/trunk/target/surefire/surefirebooter2367225698672480296.jar
/x1/jenkins/jenkins-slave/workspace/HBase-0.94/trunk/target/surefire/surefire3178209982095106028tmp
/x1/jenkins/jenkins-slave/workspace/HBase-0.94/trunk/target/surefire/surefire_1127690729686163380715tmp
Running org.apache.hadoop.hbase.util.TestPoolMap$TestRoundRobinPoolType
Tests run: 3, Failures: 0, Errors: 0, Skipped: 0, Time elapsed: 0.01 sec
Running org.apache.hadoop.hbase.util.TestPoolMap$TestThreadLocalPoolType
Tests run: 3, Failures: 0, Errors: 0, Skipped: 0, Time elapsed: 0.009 sec
Running org.apache.hadoop.hbase.util.TestPoolMap$TestReusablePoolType
Tests run: 3, Failures: 0, Errors: 0, Skipped: 0, Time elapsed: 0.042 sec
Forking command line: /bin/sh -c cd /x1/jenkins/jenkins-slave/workspace/HBase-0.94/trunk &&
/x1/jenkins/tools/java/jdk1.6.0_27-32/jre/bin/java -enableassertions -Xmx1900m -Djava.security.egd=file:/dev/./urandom
-jar /x1/jenkins/jenkins-slave/workspace/HBase-0.94/trunk/target/surefire/surefirebooter6297603159828171210.jar
/x1/jenkins/jenkins-slave/workspace/HBase-0.94/trunk/target/surefire/surefire5250038299073638795tmp
/x1/jenkins/jenkins-slave/workspace/HBase-0.94/trunk/target/surefire/surefire_1135033224379789532199tmp
Running org.apache.hadoop.hbase.util.TestRegionSplitter
Tests run: 1, Failures: 0, Errors: 1, Skipped: 0, Time elapsed: 1.464 sec <<< FAILURE!
Forking command line: /bin/sh -c cd /x1/jenkins/jenkins-slave/workspace/HBase-0.94/trunk &&
/x1/jenkins/tools/java/jdk1.6.0_27-32/jre/bin/java -enableassertions -Xmx1900m -Djava.security.egd=file:/dev/./urandom
-jar /x1/jenkins/jenkins-slave/workspace/HBase-0.94/trunk/target/surefire/surefirebooter1500079493249851737.jar
/x1/jenkins/jenkins-slave/workspace/HBase-0.94/trunk/target/surefire/surefire6261933200794302852tmp
/x1/jenkins/jenkins-slave/workspace/HBase-0.94/trunk/target/surefire/surefire_1142254221454268281071tmp
Running org.apache.hadoop.hbase.util.hbck.TestOfflineMetaRebuildBase
Tests run: 1, Failures: 0, Errors: 1, Skipped: 0, Time elapsed: 1.672 sec <<< FAILURE!
Forking command line: /bin/sh -c cd /x1/jenkins/jenkins-slave/workspace/HBase-0.94/trunk &&
/x1/jenkins/tools/java/jdk1.6.0_27-32/jre/bin/java -enableassertions -Xmx1900m -Djava.security.egd=file:/dev/./urandom
-jar /x1/jenkins/jenkins-slave/workspace/HBase-0.94/trunk/target/surefire/surefirebooter6191745643682194438.jar
/x1/jenkins/jenkins-slave/workspace/HBase-0.94/trunk/target/surefire/surefire1599258742653479468tmp
/x1/jenkins/jenkins-slave/workspace/HBase-0.94/trunk/target/surefire/surefire_1155412009354138417845tmp
Running org.apache.hadoop.hbase.util.TestIdLock
Tests run: 1, Failures: 0, Errors: 0, Skipped: 0, Time elapsed: 15.299 sec
Forking command line: /bin/sh -c cd /x1/jenkins/jenkins-slave/workspace/HBase-0.94/trunk &&
/x1/jenkins/tools/java/jdk1.6.0_27-32/jre/bin/java -enableassertions -Xmx1900m -Djava.security.egd=file:/dev/./urandom
-jar /x1/jenkins/jenkins-slave/workspace/HBase-0.94/trunk/target/surefire/surefirebooter7493527764400809691.jar
/x1/jenkins/jenkins-slave/workspace/HBase-0.94/trunk/target/surefire/surefire4311825389584001830tmp
/x1/jenkins/jenkins-slave/workspace/HBase-0.94/trunk/target/surefire/surefire_1161601246326828619792tmp
Running org.apache.hadoop.hbase.util.hbck.TestOfflineMetaRebuildOverlap
Tests run: 1, Failures: 0, Errors: 1, Skipped: 0, Time elapsed: 1.585 sec <<< FAILURE!
Forking command line: /bin/sh -c cd /x1/jenkins/jenkins-slave/workspace/HBase-0.94/trunk &&
/x1/jenkins/tools/java/jdk1.6.0_27-32/jre/bin/java -enableassertions -Xmx1900m -Djava.security.egd=file:/dev/./urandom
-jar /x1/jenkins/jenkins-slave/workspace/HBase-0.94/trunk/target/surefire/surefirebooter573200773973438879.jar
/x1/jenkins/jenkins-slave/workspace/HBase-0.94/trunk/target/surefire/surefire1310753815913755101tmp
/x1/jenkins/jenkins-slave/workspace/HBase-0.94/trunk/target/surefire/surefire_1174722810206103538836tmp
Running org.apache.hadoop.hbase.util.TestDefaultEnvironmentEdge
Tests run: 1, Failures: 0, Errors: 0, Skipped: 0, Time elapsed: 0.172 sec
Forking command line: /bin/sh -c cd /x1/jenkins/jenkins-slave/workspace/HBase-0.94/trunk &&
/x1/jenkins/tools/java/jdk1.6.0_27-32/jre/bin/java -enableassertions -Xmx1900m -Djava.security.egd=file:/dev/./urandom
-jar /x1/jenkins/jenkins-slave/workspace/HBase-0.94/trunk/target/surefire/surefirebooter3768231106524606877.jar
/x1/jenkins/jenkins-slave/workspace/HBase-0.94/trunk/target/surefire/surefire9013412234736705572tmp
/x1/jenkins/jenkins-slave/workspace/HBase-0.94/trunk/target/surefire/surefire_1184336056300994133608tmp
Running org.apache.hadoop.hbase.util.hbck.TestOfflineMetaRebuildHole
Tests run: 1, Failures: 0, Errors: 1, Skipped: 0, Time elapsed: 1.627 sec <<< FAILURE!
Running org.apache.hadoop.hbase.TestInfoServers
Tests run: 1, Failures: 0, Errors: 1, Skipped: 0, Time elapsed: 1.372 sec <<< FAILURE!

Results :

Tests in error: 
  org.apache.hadoop.hbase.client.TestHTableUtil
  org.apache.hadoop.hbase.client.TestMultiParallel
  org.apache.hadoop.hbase.client.TestTimestampsFilter
  org.apache.hadoop.hbase.client.TestMetaMigrationRemovingHTD
  org.apache.hadoop.hbase.client.TestHCM
  org.apache.hadoop.hbase.client.TestMetaScanner
  org.apache.hadoop.hbase.thrift.TestThriftServer
  testGetAtomicity(org.apache.hadoop.hbase.TestAcidGuarantees)
  testScanAtomicity(org.apache.hadoop.hbase.TestAcidGuarantees)
  testMixedAtomicity(org.apache.hadoop.hbase.TestAcidGuarantees)
  org.apache.hadoop.hbase.avro.TestAvroServer
  org.apache.hadoop.hbase.filter.TestColumnRangeFilter
  org.apache.hadoop.hbase.zookeeper.TestZooKeeperACL
  org.apache.hadoop.hbase.TestMultiVersions
  org.apache.hadoop.hbase.coprocessor.TestRegionServerCoprocessorExceptionWithAbort
  org.apache.hadoop.hbase.coprocessor.TestCoprocessorEndpoint
  org.apache.hadoop.hbase.coprocessor.TestRegionObserverBypass
  org.apache.hadoop.hbase.coprocessor.TestMasterObserver
  org.apache.hadoop.hbase.coprocessor.TestMasterCoprocessorExceptionWithAbort
  org.apache.hadoop.hbase.coprocessor.TestClassLoading
  org.apache.hadoop.hbase.coprocessor.TestAggregateProtocol
  org.apache.hadoop.hbase.coprocessor.TestRegionServerCoprocessorExceptionWithRemove
  org.apache.hadoop.hbase.coprocessor.TestWALObserver
  org.apache.hadoop.hbase.coprocessor.TestMasterCoprocessorExceptionWithRemove
  org.apache.hadoop.hbase.coprocessor.TestRegionObserverInterface
  testMasterZKSessionRecoveryFailure(org.apache.hadoop.hbase.master.TestMasterZKSessionRecovery)
  testMasterZKSessionRecoverySuccess(org.apache.hadoop.hbase.master.TestMasterZKSessionRecovery)
  org.apache.hadoop.hbase.master.TestZKBasedOpenCloseRegion
  testOpenedRegionHandlerOnMasterRestart(org.apache.hadoop.hbase.master.TestOpenedRegionHandler)
  org.apache.hadoop.hbase.master.TestMaster
  org.apache.hadoop.hbase.TestDrainingServer
  org.apache.hadoop.hbase.thrift2.TestThriftHBaseServiceHandler
  org.apache.hadoop.hbase.catalog.TestMetaReaderEditor
  org.apache.hadoop.hbase.catalog.TestMetaReaderEditor
  org.apache.hadoop.hbase.mapreduce.TestImportExport
  testMROnTable(org.apache.hadoop.hbase.mapreduce.TestImportTsv)
  testMROnTableWithCustomMapper(org.apache.hadoop.hbase.mapreduce.TestImportTsv)
  testRSAbortWithUnflushedEdits(org.apache.hadoop.hbase.regionserver.wal.TestLogRollAbort)
  org.apache.hadoop.hbase.regionserver.wal.TestWALReplay
  org.apache.hadoop.hbase.regionserver.wal.TestWALReplayCompressed
  testMultipleRegions(org.apache.hadoop.hbase.regionserver.TestRegionServerMetrics)
  testFullSystemBubblesFSErrors(org.apache.hadoop.hbase.regionserver.TestFSErrorsExposed)
  org.apache.hadoop.hbase.regionserver.TestServerCustomProtocol
  org.apache.hadoop.hbase.regionserver.TestStoreFileBlockCacheSummary
  testgetHDFSBlocksDistribution(org.apache.hadoop.hbase.regionserver.TestHRegion)
  testGlobalMemStore(org.apache.hadoop.hbase.TestGlobalMemStoreSize)
  org.apache.hadoop.hbase.constraint.TestConstraint
  org.apache.hadoop.hbase.rest.TestSchemaResource
  org.apache.hadoop.hbase.rest.client.TestRemoteAdmin
  org.apache.hadoop.hbase.rest.client.TestRemoteTable
  org.apache.hadoop.hbase.rest.client.TestRemoteTable
  org.apache.hadoop.hbase.rest.TestTableResource
  org.apache.hadoop.hbase.rest.TestMultiRowResource
  org.apache.hadoop.hbase.rest.TestGzipFilter
  org.apache.hadoop.hbase.rest.TestRowResource
  org.apache.hadoop.hbase.rest.TestScannerResource
  org.apache.hadoop.hbase.rest.TestVersionResource
  org.apache.hadoop.hbase.rest.TestStatusResource
  org.apache.hadoop.hbase.rest.TestScannersWithFilters
  loadTest[0](org.apache.hadoop.hbase.io.encoding.TestLoadAndSwitchEncodeOnDisk)
  org.apache.hadoop.hbase.replication.regionserver.TestReplicationSink
  org.apache.hadoop.hbase.replication.TestReplicationSource
  testMergeTable(org.apache.hadoop.hbase.util.TestMergeTable)
  org.apache.hadoop.hbase.util.TestHBaseFsck
  testIsHDFS(org.apache.hadoop.hbase.util.TestFSUtils)
  testcomputeHDFSBlocksDistribution(org.apache.hadoop.hbase.util.TestFSUtils)
  org.apache.hadoop.hbase.util.TestRegionSplitter
  testMetaRebuild(org.apache.hadoop.hbase.util.hbck.TestOfflineMetaRebuildBase)
  testMetaRebuildOverlapFail(org.apache.hadoop.hbase.util.hbck.TestOfflineMetaRebuildOverlap)
  testMetaRebuildHoleFail(org.apache.hadoop.hbase.util.hbck.TestOfflineMetaRebuildHole)
  org.apache.hadoop.hbase.TestInfoServers

Tests run: 409, Failures: 0, Errors: 71, Skipped: 1

[INFO] ------------------------------------------------------------------------
[INFO] BUILD FAILURE
[INFO] ------------------------------------------------------------------------
[INFO] Total time: 7:20.558s
[INFO] Finished at: Thu Apr 05 21:46:06 UTC 2012
[INFO] Final Memory: 50M/1116M
[INFO] ------------------------------------------------------------------------
[ERROR] Failed to execute goal org.apache.maven.plugins:maven-surefire-plugin:2.12-TRUNK-HBASE-2:test
(secondPartTestsExecution) on project hbase: There are test failures.
[ERROR] 
[ERROR] Please refer to /x1/jenkins/jenkins-slave/workspace/HBase-0.94/trunk/target/surefire-reports
for the individual test results.
[ERROR] -> [Help 1]
org.apache.maven.lifecycle.LifecycleExecutionException: Failed to execute goal org.apache.maven.plugins:maven-surefire-plugin:2.12-TRUNK-HBASE-2:test
(secondPartTestsExecution) on project hbase: There are test failures.

Please refer to /x1/jenkins/jenkins-slave/workspace/HBase-0.94/trunk/target/surefire-reports
for the individual test results.
	at org.apache.maven.lifecycle.internal.MojoExecutor.execute(MojoExecutor.java:213)
	at org.apache.maven.lifecycle.internal.MojoExecutor.execute(MojoExecutor.java:153)
	at org.apache.maven.lifecycle.internal.MojoExecutor.execute(MojoExecutor.java:145)
	at org.apache.maven.lifecycle.internal.LifecycleModuleBuilder.buildProject(LifecycleModuleBuilder.java:84)
	at org.apache.maven.lifecycle.internal.LifecycleModuleBuilder.buildProject(LifecycleModuleBuilder.java:59)
	at org.apache.maven.lifecycle.internal.LifecycleStarter.singleThreadedBuild(LifecycleStarter.java:183)
	at org.apache.maven.lifecycle.internal.LifecycleStarter.execute(LifecycleStarter.java:161)
	at org.apache.maven.DefaultMaven.doExecute(DefaultMaven.java:319)
	at org.apache.maven.DefaultMaven.execute(DefaultMaven.java:156)
	at org.apache.maven.cli.MavenCli.execute(MavenCli.java:537)
	at org.apache.maven.cli.MavenCli.doMain(MavenCli.java:196)
	at org.apache.maven.cli.MavenCli.main(MavenCli.java:141)
	at sun.reflect.NativeMethodAccessorImpl.invoke0(Native Method)
	at sun.reflect.NativeMethodAccessorImpl.invoke(NativeMethodAccessorImpl.java:39)
	at sun.reflect.DelegatingMethodAccessorImpl.invoke(DelegatingMethodAccessorImpl.java:25)
	at java.lang.reflect.Method.invoke(Method.java:597)
	at org.codehaus.plexus.classworlds.launcher.Launcher.launchEnhanced(Launcher.java:290)
	at org.codehaus.plexus.classworlds.launcher.Launcher.launch(Launcher.java:230)
	at org.codehaus.plexus.classworlds.launcher.Launcher.mainWithExitCode(Launcher.java:409)
	at org.codehaus.plexus.classworlds.launcher.Launcher.main(Launcher.java:352)
Caused by: org.apache.maven.plugin.MojoFailureException: There are test failures.

Please refer to /x1/jenkins/jenkins-slave/workspace/HBase-0.94/trunk/target/surefire-reports
for the individual test results.
	at org.apache.maven.plugin.surefire.SurefireHelper.reportExecution(SurefireHelper.java:87)
	at org.apache.maven.plugin.surefire.SurefirePlugin.writeSummary(SurefirePlugin.java:651)
	at org.apache.maven.plugin.surefire.SurefirePlugin.handleSummary(SurefirePlugin.java:625)
	at org.apache.maven.plugin.surefire.AbstractSurefireMojo.executeAfterPreconditionsChecked(AbstractSurefireMojo.java:137)
	at org.apache.maven.plugin.surefire.AbstractSurefireMojo.execute(AbstractSurefireMojo.java:98)
	at org.apache.maven.plugin.DefaultBuildPluginManager.executeMojo(DefaultBuildPluginManager.java:101)
	at org.apache.maven.lifecycle.internal.MojoExecutor.execute(MojoExecutor.java:209)
	... 19 more
[ERROR] 
[ERROR] 
[ERROR] For more information about the errors and possible solutions, please read the following
articles:
[ERROR] [Help 1] http://cwiki.apache.org/confluence/display/MAVEN/MojoFailureException
Build step 'Invoke top-level Maven targets' marked build as failure
Archiving artifacts
Recording test results
Updating HBASE-5711
Updating HBASE-5724

Mime
View raw message