hbase-dev mailing list archives

Site index · List index
Message view « Date » · « Thread »
Top « Date » · « Thread »
From Apache Jenkins Server <jenk...@builds.apache.org>
Subject Build failed in Jenkins: HBase-0.94 #76
Date Mon, 02 Apr 2012 16:19:16 GMT
See <https://builds.apache.org/job/HBase-0.94/76/>

------------------------------------------
[...truncated 7177 lines...]
Tests run: 1, Failures: 0, Errors: 0, Skipped: 0, Time elapsed: 1.344 sec
Forking command line: /bin/sh -c cd <https://builds.apache.org/job/HBase-0.94/ws/trunk>
&& /home/jenkins/tools/java/jdk1.6.0_27-32/jre/bin/java -enableassertions -Xmx1900m
-Djava.security.egd=file:/dev/./urandom -jar <https://builds.apache.org/job/HBase-0.94/ws/trunk/target/surefire/surefirebooter6695108064352261742.jar>
<https://builds.apache.org/job/HBase-0.94/ws/trunk/target/surefire/surefire3522753384307448754tmp>
<https://builds.apache.org/job/HBase-0.94/ws/trunk/target/surefire/surefire_576921764831566889136tmp>
Running org.apache.hadoop.hbase.master.TestDeadServer
Tests run: 1, Failures: 0, Errors: 0, Skipped: 0, Time elapsed: 0.21 sec
Forking command line: /bin/sh -c cd <https://builds.apache.org/job/HBase-0.94/ws/trunk>
&& /home/jenkins/tools/java/jdk1.6.0_27-32/jre/bin/java -enableassertions -Xmx1900m
-Djava.security.egd=file:/dev/./urandom -jar <https://builds.apache.org/job/HBase-0.94/ws/trunk/target/surefire/surefirebooter3734412760938633754.jar>
<https://builds.apache.org/job/HBase-0.94/ws/trunk/target/surefire/surefire2138557696986352289tmp>
<https://builds.apache.org/job/HBase-0.94/ws/trunk/target/surefire/surefire_587474240517842323602tmp>
Running org.apache.hadoop.hbase.master.TestLogsCleaner
Tests run: 1, Failures: 0, Errors: 0, Skipped: 0, Time elapsed: 3.123 sec
Forking command line: /bin/sh -c cd <https://builds.apache.org/job/HBase-0.94/ws/trunk>
&& /home/jenkins/tools/java/jdk1.6.0_27-32/jre/bin/java -enableassertions -Xmx1900m
-Djava.security.egd=file:/dev/./urandom -jar <https://builds.apache.org/job/HBase-0.94/ws/trunk/target/surefire/surefirebooter1549741439133162687.jar>
<https://builds.apache.org/job/HBase-0.94/ws/trunk/target/surefire/surefire3258410805300870755tmp>
<https://builds.apache.org/job/HBase-0.94/ws/trunk/target/surefire/surefire_598947171297547572010tmp>
Running org.apache.hadoop.hbase.client.TestHTablePool$TestHTableThreadLocalPool
Tests run: 9, Failures: 0, Errors: 0, Skipped: 0, Time elapsed: 23.236 sec
Forking command line: /bin/sh -c cd <https://builds.apache.org/job/HBase-0.94/ws/trunk>
&& /home/jenkins/tools/java/jdk1.6.0_27-32/jre/bin/java -enableassertions -Xmx1900m
-Djava.security.egd=file:/dev/./urandom -jar <https://builds.apache.org/job/HBase-0.94/ws/trunk/target/surefire/surefirebooter7063532442395462907.jar>
<https://builds.apache.org/job/HBase-0.94/ws/trunk/target/surefire/surefire8061834981373433791tmp>
<https://builds.apache.org/job/HBase-0.94/ws/trunk/target/surefire/surefire_605179582573019634125tmp>
Running org.apache.hadoop.hbase.master.TestOpenedRegionHandler
Tests run: 2, Failures: 0, Errors: 0, Skipped: 0, Time elapsed: 15.749 sec
Forking command line: /bin/sh -c cd <https://builds.apache.org/job/HBase-0.94/ws/trunk>
&& /home/jenkins/tools/java/jdk1.6.0_27-32/jre/bin/java -enableassertions -Xmx1900m
-Djava.security.egd=file:/dev/./urandom -jar <https://builds.apache.org/job/HBase-0.94/ws/trunk/target/surefire/surefirebooter7312942136072065490.jar>
<https://builds.apache.org/job/HBase-0.94/ws/trunk/target/surefire/surefire1478389446580406455tmp>
<https://builds.apache.org/job/HBase-0.94/ws/trunk/target/surefire/surefire_618902512240594165362tmp>
Running org.apache.hadoop.hbase.master.TestDefaultLoadBalancer
Tests run: 4, Failures: 0, Errors: 0, Skipped: 0, Time elapsed: 1.454 sec
Forking command line: /bin/sh -c cd <https://builds.apache.org/job/HBase-0.94/ws/trunk>
&& /home/jenkins/tools/java/jdk1.6.0_27-32/jre/bin/java -enableassertions -Xmx1900m
-Djava.security.egd=file:/dev/./urandom -jar <https://builds.apache.org/job/HBase-0.94/ws/trunk/target/surefire/surefirebooter1388595505094381855.jar>
<https://builds.apache.org/job/HBase-0.94/ws/trunk/target/surefire/surefire5452661535383692096tmp>
<https://builds.apache.org/job/HBase-0.94/ws/trunk/target/surefire/surefire_625675885950302839753tmp>
Running org.apache.hadoop.hbase.master.TestClockSkewDetection
Tests run: 1, Failures: 0, Errors: 0, Skipped: 0, Time elapsed: 0.246 sec
Forking command line: /bin/sh -c cd <https://builds.apache.org/job/HBase-0.94/ws/trunk>
&& /home/jenkins/tools/java/jdk1.6.0_27-32/jre/bin/java -enableassertions -Xmx1900m
-Djava.security.egd=file:/dev/./urandom -jar <https://builds.apache.org/job/HBase-0.94/ws/trunk/target/surefire/surefirebooter3677524802915781411.jar>
<https://builds.apache.org/job/HBase-0.94/ws/trunk/target/surefire/surefire606513287133294497tmp>
<https://builds.apache.org/job/HBase-0.94/ws/trunk/target/surefire/surefire_631166787109174541892tmp>
Running org.apache.hadoop.hbase.master.TestZKBasedOpenCloseRegion
Tests run: 3, Failures: 0, Errors: 0, Skipped: 0, Time elapsed: 19.789 sec
Forking command line: /bin/sh -c cd <https://builds.apache.org/job/HBase-0.94/ws/trunk>
&& /home/jenkins/tools/java/jdk1.6.0_27-32/jre/bin/java -enableassertions -Xmx1900m
-Djava.security.egd=file:/dev/./urandom -jar <https://builds.apache.org/job/HBase-0.94/ws/trunk/target/surefire/surefirebooter61010780148919016.jar>
<https://builds.apache.org/job/HBase-0.94/ws/trunk/target/surefire/surefire610549679583355160tmp>
<https://builds.apache.org/job/HBase-0.94/ws/trunk/target/surefire/surefire_647793709868174098923tmp>
Running org.apache.hadoop.hbase.master.TestMaster
Tests run: 1, Failures: 0, Errors: 0, Skipped: 0, Time elapsed: 17.368 sec
Forking command line: /bin/sh -c cd <https://builds.apache.org/job/HBase-0.94/ws/trunk>
&& /home/jenkins/tools/java/jdk1.6.0_27-32/jre/bin/java -enableassertions -Xmx1900m
-Djava.security.egd=file:/dev/./urandom -jar <https://builds.apache.org/job/HBase-0.94/ws/trunk/target/surefire/surefirebooter3123744960573320847.jar>
<https://builds.apache.org/job/HBase-0.94/ws/trunk/target/surefire/surefire7060364177142032181tmp>
<https://builds.apache.org/job/HBase-0.94/ws/trunk/target/surefire/surefire_651173113775964070636tmp>
Running org.apache.hadoop.hbase.master.TestSplitLogManager
Tests run: 12, Failures: 2, Errors: 0, Skipped: 0, Time elapsed: 17.616 sec <<< FAILURE!
Forking command line: /bin/sh -c cd <https://builds.apache.org/job/HBase-0.94/ws/trunk>
&& /home/jenkins/tools/java/jdk1.6.0_27-32/jre/bin/java -enableassertions -Xmx1900m
-Djava.security.egd=file:/dev/./urandom -jar <https://builds.apache.org/job/HBase-0.94/ws/trunk/target/surefire/surefirebooter5425512480676956666.jar>
<https://builds.apache.org/job/HBase-0.94/ws/trunk/target/surefire/surefire3421701398904079862tmp>
<https://builds.apache.org/job/HBase-0.94/ws/trunk/target/surefire/surefire_665657944584417377850tmp>
Running org.apache.hadoop.hbase.metrics.TestMetricsMBeanBase
Tests run: 2, Failures: 0, Errors: 0, Skipped: 0, Time elapsed: 1.119 sec
Forking command line: /bin/sh -c cd <https://builds.apache.org/job/HBase-0.94/ws/trunk>
&& /home/jenkins/tools/java/jdk1.6.0_27-32/jre/bin/java -enableassertions -Xmx1900m
-Djava.security.egd=file:/dev/./urandom -jar <https://builds.apache.org/job/HBase-0.94/ws/trunk/target/surefire/surefirebooter7564317941190308042.jar>
<https://builds.apache.org/job/HBase-0.94/ws/trunk/target/surefire/surefire7968147578655190339tmp>
<https://builds.apache.org/job/HBase-0.94/ws/trunk/target/surefire/surefire_673957631232944213732tmp>
Running org.apache.hadoop.hbase.TestGlobalMemStoreSize
Tests run: 1, Failures: 0, Errors: 0, Skipped: 0, Time elapsed: 22.098 sec
Forking command line: /bin/sh -c cd <https://builds.apache.org/job/HBase-0.94/ws/trunk>
&& /home/jenkins/tools/java/jdk1.6.0_27-32/jre/bin/java -enableassertions -Xmx1900m
-Djava.security.egd=file:/dev/./urandom -jar <https://builds.apache.org/job/HBase-0.94/ws/trunk/target/surefire/surefirebooter7379185389944574667.jar>
<https://builds.apache.org/job/HBase-0.94/ws/trunk/target/surefire/surefire9190481855151547946tmp>
<https://builds.apache.org/job/HBase-0.94/ws/trunk/target/surefire/surefire_68682645873110746291tmp>
Running org.apache.hadoop.hbase.master.TestMasterZKSessionRecovery
Tests run: 2, Failures: 0, Errors: 0, Skipped: 0, Time elapsed: 27.742 sec
Forking command line: /bin/sh -c cd <https://builds.apache.org/job/HBase-0.94/ws/trunk>
&& /home/jenkins/tools/java/jdk1.6.0_27-32/jre/bin/java -enableassertions -Xmx1900m
-Djava.security.egd=file:/dev/./urandom -jar <https://builds.apache.org/job/HBase-0.94/ws/trunk/target/surefire/surefirebooter6824507657986127298.jar>
<https://builds.apache.org/job/HBase-0.94/ws/trunk/target/surefire/surefire8932874264749503137tmp>
<https://builds.apache.org/job/HBase-0.94/ws/trunk/target/surefire/surefire_695152485340711095052tmp>
Running org.apache.hadoop.hbase.replication.TestReplicationZookeeper
Tests run: 1, Failures: 0, Errors: 0, Skipped: 0, Time elapsed: 1.43 sec
Forking command line: /bin/sh -c cd <https://builds.apache.org/job/HBase-0.94/ws/trunk>
&& /home/jenkins/tools/java/jdk1.6.0_27-32/jre/bin/java -enableassertions -Xmx1900m
-Djava.security.egd=file:/dev/./urandom -jar <https://builds.apache.org/job/HBase-0.94/ws/trunk/target/surefire/surefirebooter3094705632059007124.jar>
<https://builds.apache.org/job/HBase-0.94/ws/trunk/target/surefire/surefire9193372637994614564tmp>
<https://builds.apache.org/job/HBase-0.94/ws/trunk/target/surefire/surefire_708119983987323577386tmp>
Running org.apache.hadoop.hbase.replication.TestReplicationSource
Tests run: 1, Failures: 0, Errors: 0, Skipped: 0, Time elapsed: 3.553 sec
Forking command line: /bin/sh -c cd <https://builds.apache.org/job/HBase-0.94/ws/trunk>
&& /home/jenkins/tools/java/jdk1.6.0_27-32/jre/bin/java -enableassertions -Xmx1900m
-Djava.security.egd=file:/dev/./urandom -jar <https://builds.apache.org/job/HBase-0.94/ws/trunk/target/surefire/surefirebooter644772298639264553.jar>
<https://builds.apache.org/job/HBase-0.94/ws/trunk/target/surefire/surefire2243687265760965927tmp>
<https://builds.apache.org/job/HBase-0.94/ws/trunk/target/surefire/surefire_712210622492826980790tmp>
Running org.apache.hadoop.hbase.replication.TestReplicationPeer
Tests run: 1, Failures: 0, Errors: 0, Skipped: 0, Time elapsed: 7.635 sec
Forking command line: /bin/sh -c cd <https://builds.apache.org/job/HBase-0.94/ws/trunk>
&& /home/jenkins/tools/java/jdk1.6.0_27-32/jre/bin/java -enableassertions -Xmx1900m
-Djava.security.egd=file:/dev/./urandom -jar <https://builds.apache.org/job/HBase-0.94/ws/trunk/target/surefire/surefirebooter4394628684001824202.jar>
<https://builds.apache.org/job/HBase-0.94/ws/trunk/target/surefire/surefire529064763135820866tmp>
<https://builds.apache.org/job/HBase-0.94/ws/trunk/target/surefire/surefire_727823158151495917372tmp>
Running org.apache.hadoop.hbase.replication.regionserver.TestReplicationSourceManager
Tests run: 1, Failures: 0, Errors: 0, Skipped: 0, Time elapsed: 1.046 sec
Forking command line: /bin/sh -c cd <https://builds.apache.org/job/HBase-0.94/ws/trunk>
&& /home/jenkins/tools/java/jdk1.6.0_27-32/jre/bin/java -enableassertions -Xmx1900m
-Djava.security.egd=file:/dev/./urandom -jar <https://builds.apache.org/job/HBase-0.94/ws/trunk/target/surefire/surefirebooter9187127104685430680.jar>
<https://builds.apache.org/job/HBase-0.94/ws/trunk/target/surefire/surefire4917945272659531759tmp>
<https://builds.apache.org/job/HBase-0.94/ws/trunk/target/surefire/surefire_737401930433769921020tmp>
Running org.apache.hadoop.hbase.replication.regionserver.TestReplicationSink
Tests run: 5, Failures: 0, Errors: 0, Skipped: 0, Time elapsed: 16.56 sec
Forking command line: /bin/sh -c cd <https://builds.apache.org/job/HBase-0.94/ws/trunk>
&& /home/jenkins/tools/java/jdk1.6.0_27-32/jre/bin/java -enableassertions -Xmx1900m
-Djava.security.egd=file:/dev/./urandom -jar <https://builds.apache.org/job/HBase-0.94/ws/trunk/target/surefire/surefirebooter7947324899701352802.jar>
<https://builds.apache.org/job/HBase-0.94/ws/trunk/target/surefire/surefire660692056757721267tmp>
<https://builds.apache.org/job/HBase-0.94/ws/trunk/target/surefire/surefire_741742262018358116485tmp>
Running org.apache.hadoop.hbase.catalog.TestMetaReaderEditorNoCluster
Tests run: 1, Failures: 0, Errors: 0, Skipped: 0, Time elapsed: 4.166 sec
Forking command line: /bin/sh -c cd <https://builds.apache.org/job/HBase-0.94/ws/trunk>
&& /home/jenkins/tools/java/jdk1.6.0_27-32/jre/bin/java -enableassertions -Xmx1900m
-Djava.security.egd=file:/dev/./urandom -jar <https://builds.apache.org/job/HBase-0.94/ws/trunk/target/surefire/surefirebooter6323563895706325390.jar>
<https://builds.apache.org/job/HBase-0.94/ws/trunk/target/surefire/surefire5808724842908178759tmp>
<https://builds.apache.org/job/HBase-0.94/ws/trunk/target/surefire/surefire_75691188200732343901tmp>
Running org.apache.hadoop.hbase.TestMultiVersions
Tests run: 3, Failures: 0, Errors: 0, Skipped: 0, Time elapsed: 28.142 sec
Forking command line: /bin/sh -c cd <https://builds.apache.org/job/HBase-0.94/ws/trunk>
&& /home/jenkins/tools/java/jdk1.6.0_27-32/jre/bin/java -enableassertions -Xmx1900m
-Djava.security.egd=file:/dev/./urandom -jar <https://builds.apache.org/job/HBase-0.94/ws/trunk/target/surefire/surefirebooter4257287838014029910.jar>
<https://builds.apache.org/job/HBase-0.94/ws/trunk/target/surefire/surefire5111015372221828664tmp>
<https://builds.apache.org/job/HBase-0.94/ws/trunk/target/surefire/surefire_768194328400385736563tmp>
Running org.apache.hadoop.hbase.catalog.TestCatalogTracker
Tests run: 9, Failures: 0, Errors: 0, Skipped: 1, Time elapsed: 6.471 sec
Forking command line: /bin/sh -c cd <https://builds.apache.org/job/HBase-0.94/ws/trunk>
&& /home/jenkins/tools/java/jdk1.6.0_27-32/jre/bin/java -enableassertions -Xmx1900m
-Djava.security.egd=file:/dev/./urandom -jar <https://builds.apache.org/job/HBase-0.94/ws/trunk/target/surefire/surefirebooter8596791866028323515.jar>
<https://builds.apache.org/job/HBase-0.94/ws/trunk/target/surefire/surefire8719053219008686268tmp>
<https://builds.apache.org/job/HBase-0.94/ws/trunk/target/surefire/surefire_774778723037224884288tmp>
Running org.apache.hadoop.hbase.catalog.TestMetaReaderEditor
Tests run: 5, Failures: 0, Errors: 0, Skipped: 0, Time elapsed: 29.89 sec
Forking command line: /bin/sh -c cd <https://builds.apache.org/job/HBase-0.94/ws/trunk>
&& /home/jenkins/tools/java/jdk1.6.0_27-32/jre/bin/java -enableassertions -Xmx1900m
-Djava.security.egd=file:/dev/./urandom -jar <https://builds.apache.org/job/HBase-0.94/ws/trunk/target/surefire/surefirebooter6812691218271152671.jar>
<https://builds.apache.org/job/HBase-0.94/ws/trunk/target/surefire/surefire6979246293309701924tmp>
<https://builds.apache.org/job/HBase-0.94/ws/trunk/target/surefire/surefire_787155603471434071499tmp>
Running org.apache.hadoop.hbase.coprocessor.TestAggregateProtocol
Tests run: 45, Failures: 0, Errors: 0, Skipped: 0, Time elapsed: 16.831 sec
Forking command line: /bin/sh -c cd <https://builds.apache.org/job/HBase-0.94/ws/trunk>
&& /home/jenkins/tools/java/jdk1.6.0_27-32/jre/bin/java -enableassertions -Xmx1900m
-Djava.security.egd=file:/dev/./urandom -jar <https://builds.apache.org/job/HBase-0.94/ws/trunk/target/surefire/surefirebooter8775524001645801900.jar>
<https://builds.apache.org/job/HBase-0.94/ws/trunk/target/surefire/surefire2684470825402280764tmp>
<https://builds.apache.org/job/HBase-0.94/ws/trunk/target/surefire/surefire_795667029389591153417tmp>
Running org.apache.hadoop.hbase.coprocessor.TestMasterObserver
Tests run: 3, Failures: 0, Errors: 0, Skipped: 0, Time elapsed: 29.952 sec
Forking command line: /bin/sh -c cd <https://builds.apache.org/job/HBase-0.94/ws/trunk>
&& /home/jenkins/tools/java/jdk1.6.0_27-32/jre/bin/java -enableassertions -Xmx1900m
-Djava.security.egd=file:/dev/./urandom -jar <https://builds.apache.org/job/HBase-0.94/ws/trunk/target/surefire/surefirebooter6535266441860756360.jar>
<https://builds.apache.org/job/HBase-0.94/ws/trunk/target/surefire/surefire6749190622532093343tmp>
<https://builds.apache.org/job/HBase-0.94/ws/trunk/target/surefire/surefire_807596622512662851535tmp>
Running org.apache.hadoop.hbase.coprocessor.TestCoprocessorEndpoint
Tests run: 3, Failures: 0, Errors: 0, Skipped: 1, Time elapsed: 29.941 sec
Forking command line: /bin/sh -c cd <https://builds.apache.org/job/HBase-0.94/ws/trunk>
&& /home/jenkins/tools/java/jdk1.6.0_27-32/jre/bin/java -enableassertions -Xmx1900m
-Djava.security.egd=file:/dev/./urandom -jar <https://builds.apache.org/job/HBase-0.94/ws/trunk/target/surefire/surefirebooter5616829051016642876.jar>
<https://builds.apache.org/job/HBase-0.94/ws/trunk/target/surefire/surefire1319685954060719087tmp>
<https://builds.apache.org/job/HBase-0.94/ws/trunk/target/surefire/surefire_814236247924644461639tmp>
Running org.apache.hadoop.hbase.coprocessor.TestClassLoading
Tests run: 5, Failures: 0, Errors: 0, Skipped: 0, Time elapsed: 26.977 sec
Forking command line: /bin/sh -c cd <https://builds.apache.org/job/HBase-0.94/ws/trunk>
&& /home/jenkins/tools/java/jdk1.6.0_27-32/jre/bin/java -enableassertions -Xmx1900m
-Djava.security.egd=file:/dev/./urandom -jar <https://builds.apache.org/job/HBase-0.94/ws/trunk/target/surefire/surefirebooter288670125014611124.jar>
<https://builds.apache.org/job/HBase-0.94/ws/trunk/target/surefire/surefire9016545312374181898tmp>
<https://builds.apache.org/job/HBase-0.94/ws/trunk/target/surefire/surefire_82483898855527192621tmp>
Running org.apache.hadoop.hbase.coprocessor.TestRegionObserverInterface
Tests run: 6, Failures: 0, Errors: 0, Skipped: 0, Time elapsed: 31.305 sec
Forking command line: /bin/sh -c cd <https://builds.apache.org/job/HBase-0.94/ws/trunk>
&& /home/jenkins/tools/java/jdk1.6.0_27-32/jre/bin/java -enableassertions -Xmx1900m
-Djava.security.egd=file:/dev/./urandom -jar <https://builds.apache.org/job/HBase-0.94/ws/trunk/target/surefire/surefirebooter3735243348423456566.jar>
<https://builds.apache.org/job/HBase-0.94/ws/trunk/target/surefire/surefire862470589551946655tmp>
<https://builds.apache.org/job/HBase-0.94/ws/trunk/target/surefire/surefire_834113804832194937204tmp>
Running org.apache.hadoop.hbase.coprocessor.TestMasterCoprocessorExceptionWithRemove
Tests run: 1, Failures: 0, Errors: 0, Skipped: 0, Time elapsed: 14.267 sec
Forking command line: /bin/sh -c cd <https://builds.apache.org/job/HBase-0.94/ws/trunk>
&& /home/jenkins/tools/java/jdk1.6.0_27-32/jre/bin/java -enableassertions -Xmx1900m
-Djava.security.egd=file:/dev/./urandom -jar <https://builds.apache.org/job/HBase-0.94/ws/trunk/target/surefire/surefirebooter6132297243157377342.jar>
<https://builds.apache.org/job/HBase-0.94/ws/trunk/target/surefire/surefire8549084572106323065tmp>
<https://builds.apache.org/job/HBase-0.94/ws/trunk/target/surefire/surefire_847312208978938488965tmp>
Running org.apache.hadoop.hbase.coprocessor.TestRegionServerCoprocessorExceptionWithRemove
Tests run: 1, Failures: 0, Errors: 0, Skipped: 0, Time elapsed: 16.297 sec
Running org.apache.hadoop.hbase.coprocessor.TestMasterCoprocessorExceptionWithAbort
Tests run: 1, Failures: 0, Errors: 0, Skipped: 0, Time elapsed: 12.763 sec
Forking command line: /bin/sh -c cd <https://builds.apache.org/job/HBase-0.94/ws/trunk>
&& /home/jenkins/tools/java/jdk1.6.0_27-32/jre/bin/java -enableassertions -Xmx1900m
-Djava.security.egd=file:/dev/./urandom -jar <https://builds.apache.org/job/HBase-0.94/ws/trunk/target/surefire/surefirebooter4610886146128241368.jar>
<https://builds.apache.org/job/HBase-0.94/ws/trunk/target/surefire/surefire4038503560662369727tmp>
<https://builds.apache.org/job/HBase-0.94/ws/trunk/target/surefire/surefire_853235959483864091148tmp>
Forking command line: /bin/sh -c cd <https://builds.apache.org/job/HBase-0.94/ws/trunk>
&& /home/jenkins/tools/java/jdk1.6.0_27-32/jre/bin/java -enableassertions -Xmx1900m
-Djava.security.egd=file:/dev/./urandom -jar <https://builds.apache.org/job/HBase-0.94/ws/trunk/target/surefire/surefirebooter3956945467421406335.jar>
<https://builds.apache.org/job/HBase-0.94/ws/trunk/target/surefire/surefire2749794462400524222tmp>
<https://builds.apache.org/job/HBase-0.94/ws/trunk/target/surefire/surefire_861653557625892341271tmp>
Running org.apache.hadoop.hbase.coprocessor.TestRegionServerCoprocessorExceptionWithAbort
Tests run: 1, Failures: 0, Errors: 0, Skipped: 0, Time elapsed: 14.274 sec
Running org.apache.hadoop.hbase.coprocessor.TestWALObserver
Tests run: 3, Failures: 0, Errors: 0, Skipped: 0, Time elapsed: 14.74 sec
Forking command line: /bin/sh -c cd <https://builds.apache.org/job/HBase-0.94/ws/trunk>
&& /home/jenkins/tools/java/jdk1.6.0_27-32/jre/bin/java -enableassertions -Xmx1900m
-Djava.security.egd=file:/dev/./urandom -jar <https://builds.apache.org/job/HBase-0.94/ws/trunk/target/surefire/surefirebooter3142611364130557942.jar>
<https://builds.apache.org/job/HBase-0.94/ws/trunk/target/surefire/surefire8664840887570367701tmp>
<https://builds.apache.org/job/HBase-0.94/ws/trunk/target/surefire/surefire_874349337914828195883tmp>
Running org.apache.hadoop.hbase.coprocessor.TestRegionObserverBypass
Tests run: 2, Failures: 0, Errors: 0, Skipped: 0, Time elapsed: 11.28 sec
Forking command line: /bin/sh -c cd <https://builds.apache.org/job/HBase-0.94/ws/trunk>
&& /home/jenkins/tools/java/jdk1.6.0_27-32/jre/bin/java -enableassertions -Xmx1900m
-Djava.security.egd=file:/dev/./urandom -jar <https://builds.apache.org/job/HBase-0.94/ws/trunk/target/surefire/surefirebooter38284656852729980.jar>
<https://builds.apache.org/job/HBase-0.94/ws/trunk/target/surefire/surefire3093131762198517063tmp>
<https://builds.apache.org/job/HBase-0.94/ws/trunk/target/surefire/surefire_8814433105319372412tmp>
Forking command line: /bin/sh -c cd <https://builds.apache.org/job/HBase-0.94/ws/trunk>
&& /home/jenkins/tools/java/jdk1.6.0_27-32/jre/bin/java -enableassertions -Xmx1900m
-Djava.security.egd=file:/dev/./urandom -jar <https://builds.apache.org/job/HBase-0.94/ws/trunk/target/surefire/surefirebooter940771832713797603.jar>
<https://builds.apache.org/job/HBase-0.94/ws/trunk/target/surefire/surefire1464242142651080219tmp>
<https://builds.apache.org/job/HBase-0.94/ws/trunk/target/surefire/surefire_896947375108041423962tmp>
Running org.apache.hadoop.hbase.thrift2.TestThriftHBaseServiceHandler
Tests run: 12, Failures: 0, Errors: 0, Skipped: 0, Time elapsed: 13.735 sec
Forking command line: /bin/sh -c cd <https://builds.apache.org/job/HBase-0.94/ws/trunk>
&& /home/jenkins/tools/java/jdk1.6.0_27-32/jre/bin/java -enableassertions -Xmx1900m
-Djava.security.egd=file:/dev/./urandom -jar <https://builds.apache.org/job/HBase-0.94/ws/trunk/target/surefire/surefirebooter7433665259648787518.jar>
<https://builds.apache.org/job/HBase-0.94/ws/trunk/target/surefire/surefire5337188132380913402tmp>
<https://builds.apache.org/job/HBase-0.94/ws/trunk/target/surefire/surefire_90447136675418862216tmp>
Running org.apache.hadoop.hbase.avro.TestAvroServer
Tests run: 3, Failures: 0, Errors: 0, Skipped: 0, Time elapsed: 26.127 sec
Forking command line: /bin/sh -c cd <https://builds.apache.org/job/HBase-0.94/ws/trunk>
&& /home/jenkins/tools/java/jdk1.6.0_27-32/jre/bin/java -enableassertions -Xmx1900m
-Djava.security.egd=file:/dev/./urandom -jar <https://builds.apache.org/job/HBase-0.94/ws/trunk/target/surefire/surefirebooter3846076109390912668.jar>
<https://builds.apache.org/job/HBase-0.94/ws/trunk/target/surefire/surefire6399808877674970065tmp>
<https://builds.apache.org/job/HBase-0.94/ws/trunk/target/surefire/surefire_915706958564752791116tmp>
Running org.apache.hadoop.hbase.monitoring.TestTaskMonitor
Tests run: 3, Failures: 0, Errors: 0, Skipped: 0, Time elapsed: 0.302 sec
Forking command line: /bin/sh -c cd <https://builds.apache.org/job/HBase-0.94/ws/trunk>
&& /home/jenkins/tools/java/jdk1.6.0_27-32/jre/bin/java -enableassertions -Xmx1900m
-Djava.security.egd=file:/dev/./urandom -jar <https://builds.apache.org/job/HBase-0.94/ws/trunk/target/surefire/surefirebooter9185114569038815074.jar>
<https://builds.apache.org/job/HBase-0.94/ws/trunk/target/surefire/surefire2603538577348646863tmp>
<https://builds.apache.org/job/HBase-0.94/ws/trunk/target/surefire/surefire_92467103709406797896tmp>
Running org.apache.hadoop.hbase.monitoring.TestMemoryBoundedLogMessageBuffer
Tests run: 2, Failures: 0, Errors: 0, Skipped: 0, Time elapsed: 0.244 sec
Forking command line: /bin/sh -c cd <https://builds.apache.org/job/HBase-0.94/ws/trunk>
&& /home/jenkins/tools/java/jdk1.6.0_27-32/jre/bin/java -enableassertions -Xmx1900m
-Djava.security.egd=file:/dev/./urandom -jar <https://builds.apache.org/job/HBase-0.94/ws/trunk/target/surefire/surefirebooter30372091025558173.jar>
<https://builds.apache.org/job/HBase-0.94/ws/trunk/target/surefire/surefire7699382808095115715tmp>
<https://builds.apache.org/job/HBase-0.94/ws/trunk/target/surefire/surefire_931579676127692235894tmp>
Running org.apache.hadoop.hbase.thrift.TestThriftServer
Tests run: 1, Failures: 0, Errors: 0, Skipped: 0, Time elapsed: 41.63 sec
Forking command line: /bin/sh -c cd <https://builds.apache.org/job/HBase-0.94/ws/trunk>
&& /home/jenkins/tools/java/jdk1.6.0_27-32/jre/bin/java -enableassertions -Xmx1900m
-Djava.security.egd=file:/dev/./urandom -jar <https://builds.apache.org/job/HBase-0.94/ws/trunk/target/surefire/surefirebooter8785443246226083729.jar>
<https://builds.apache.org/job/HBase-0.94/ws/trunk/target/surefire/surefire8481691867529033042tmp>
<https://builds.apache.org/job/HBase-0.94/ws/trunk/target/surefire/surefire_94647973494996451307tmp>
Running org.apache.hadoop.hbase.regionserver.TestMasterAddressManager
Tests run: 1, Failures: 0, Errors: 0, Skipped: 0, Time elapsed: 0.784 sec
Forking command line: /bin/sh -c cd <https://builds.apache.org/job/HBase-0.94/ws/trunk>
&& /home/jenkins/tools/java/jdk1.6.0_27-32/jre/bin/java -enableassertions -Xmx1900m
-Djava.security.egd=file:/dev/./urandom -jar <https://builds.apache.org/job/HBase-0.94/ws/trunk/target/surefire/surefirebooter8413747669291618771.jar>
<https://builds.apache.org/job/HBase-0.94/ws/trunk/target/surefire/surefire788614949401739043tmp>
<https://builds.apache.org/job/HBase-0.94/ws/trunk/target/surefire/surefire_951226434987163440935tmp>
Running org.apache.hadoop.hbase.regionserver.TestHRegion
Tests run: 61, Failures: 0, Errors: 0, Skipped: 0, Time elapsed: 35.247 sec
Forking command line: /bin/sh -c cd <https://builds.apache.org/job/HBase-0.94/ws/trunk>
&& /home/jenkins/tools/java/jdk1.6.0_27-32/jre/bin/java -enableassertions -Xmx1900m
-Djava.security.egd=file:/dev/./urandom -jar <https://builds.apache.org/job/HBase-0.94/ws/trunk/target/surefire/surefirebooter5532159605529151195.jar>
<https://builds.apache.org/job/HBase-0.94/ws/trunk/target/surefire/surefire4362331957028123328tmp>
<https://builds.apache.org/job/HBase-0.94/ws/trunk/target/surefire/surefire_968490502384858672525tmp>
Running org.apache.hadoop.hbase.regionserver.TestSplitLogWorker
Tests run: 5, Failures: 0, Errors: 0, Skipped: 0, Time elapsed: 2.183 sec
Forking command line: /bin/sh -c cd <https://builds.apache.org/job/HBase-0.94/ws/trunk>
&& /home/jenkins/tools/java/jdk1.6.0_27-32/jre/bin/java -enableassertions -Xmx1900m
-Djava.security.egd=file:/dev/./urandom -jar <https://builds.apache.org/job/HBase-0.94/ws/trunk/target/surefire/surefirebooter3135676553093364598.jar>
<https://builds.apache.org/job/HBase-0.94/ws/trunk/target/surefire/surefire6235981376054448611tmp>
<https://builds.apache.org/job/HBase-0.94/ws/trunk/target/surefire/surefire_975805886471570540508tmp>
Running org.apache.hadoop.hbase.regionserver.TestRegionServerMetrics
Tests run: 1, Failures: 0, Errors: 0, Skipped: 0, Time elapsed: 32.437 sec
Forking command line: /bin/sh -c cd <https://builds.apache.org/job/HBase-0.94/ws/trunk>
&& /home/jenkins/tools/java/jdk1.6.0_27-32/jre/bin/java -enableassertions -Xmx1900m
-Djava.security.egd=file:/dev/./urandom -jar <https://builds.apache.org/job/HBase-0.94/ws/trunk/target/surefire/surefirebooter5527448037006976646.jar>
<https://builds.apache.org/job/HBase-0.94/ws/trunk/target/surefire/surefire4080250185101715360tmp>
<https://builds.apache.org/job/HBase-0.94/ws/trunk/target/surefire/surefire_985756104637969336464tmp>
Running org.apache.hadoop.hbase.regionserver.TestServerCustomProtocol
Tests run: 7, Failures: 0, Errors: 0, Skipped: 0, Time elapsed: 16.046 sec
Forking command line: /bin/sh -c cd <https://builds.apache.org/job/HBase-0.94/ws/trunk>
&& /home/jenkins/tools/java/jdk1.6.0_27-32/jre/bin/java -enableassertions -Xmx1900m
-Djava.security.egd=file:/dev/./urandom -jar <https://builds.apache.org/job/HBase-0.94/ws/trunk/target/surefire/surefirebooter6172102412021406855.jar>
<https://builds.apache.org/job/HBase-0.94/ws/trunk/target/surefire/surefire2395240771261529570tmp>
<https://builds.apache.org/job/HBase-0.94/ws/trunk/target/surefire/surefire_993360331647278644969tmp>
Running org.apache.hadoop.hbase.regionserver.TestStore
Tests run: 12, Failures: 0, Errors: 0, Skipped: 0, Time elapsed: 9.386 sec
Forking command line: /bin/sh -c cd <https://builds.apache.org/job/HBase-0.94/ws/trunk>
&& /home/jenkins/tools/java/jdk1.6.0_27-32/jre/bin/java -enableassertions -Xmx1900m
-Djava.security.egd=file:/dev/./urandom -jar <https://builds.apache.org/job/HBase-0.94/ws/trunk/target/surefire/surefirebooter8807240858685776069.jar>
<https://builds.apache.org/job/HBase-0.94/ws/trunk/target/surefire/surefire350564279059575249tmp>
<https://builds.apache.org/job/HBase-0.94/ws/trunk/target/surefire/surefire_1001969722827878924667tmp>
Running org.apache.hadoop.hbase.regionserver.TestStoreFileBlockCacheSummary
Tests run: 1, Failures: 0, Errors: 0, Skipped: 0, Time elapsed: 16.093 sec
Forking command line: /bin/sh -c cd <https://builds.apache.org/job/HBase-0.94/ws/trunk>
&& /home/jenkins/tools/java/jdk1.6.0_27-32/jre/bin/java -enableassertions -Xmx1900m
-Djava.security.egd=file:/dev/./urandom -jar <https://builds.apache.org/job/HBase-0.94/ws/trunk/target/surefire/surefirebooter3597295950008787548.jar>
<https://builds.apache.org/job/HBase-0.94/ws/trunk/target/surefire/surefire6930426913924388731tmp>
<https://builds.apache.org/job/HBase-0.94/ws/trunk/target/surefire/surefire_1019141274168470686805tmp>
Running org.apache.hadoop.hbase.regionserver.TestBlocksRead
Tests run: 4, Failures: 0, Errors: 0, Skipped: 0, Time elapsed: 1.607 sec
Forking command line: /bin/sh -c cd <https://builds.apache.org/job/HBase-0.94/ws/trunk>
&& /home/jenkins/tools/java/jdk1.6.0_27-32/jre/bin/java -enableassertions -Xmx1900m
-Djava.security.egd=file:/dev/./urandom -jar <https://builds.apache.org/job/HBase-0.94/ws/trunk/target/surefire/surefirebooter8509669904288143299.jar>
<https://builds.apache.org/job/HBase-0.94/ws/trunk/target/surefire/surefire9023636632430552968tmp>
<https://builds.apache.org/job/HBase-0.94/ws/trunk/target/surefire/surefire_1023813159147481536662tmp>
Running org.apache.hadoop.hbase.regionserver.TestAtomicOperation
Tests run: 5, Failures: 0, Errors: 0, Skipped: 0, Time elapsed: 28.708 sec
Forking command line: /bin/sh -c cd <https://builds.apache.org/job/HBase-0.94/ws/trunk>
&& /home/jenkins/tools/java/jdk1.6.0_27-32/jre/bin/java -enableassertions -Xmx1900m
-Djava.security.egd=file:/dev/./urandom -jar <https://builds.apache.org/job/HBase-0.94/ws/trunk/target/surefire/surefirebooter853678395514407984.jar>
<https://builds.apache.org/job/HBase-0.94/ws/trunk/target/surefire/surefire1324855477575547777tmp>
<https://builds.apache.org/job/HBase-0.94/ws/trunk/target/surefire/surefire_103702887786249272213tmp>
Running org.apache.hadoop.hbase.regionserver.TestSeekOptimizations
Tests run: 6, Failures: 0, Errors: 0, Skipped: 0, Time elapsed: 2.866 sec
Forking command line: /bin/sh -c cd <https://builds.apache.org/job/HBase-0.94/ws/trunk>
&& /home/jenkins/tools/java/jdk1.6.0_27-32/jre/bin/java -enableassertions -Xmx1900m
-Djava.security.egd=file:/dev/./urandom -jar <https://builds.apache.org/job/HBase-0.94/ws/trunk/target/surefire/surefirebooter6201198307819626790.jar>
<https://builds.apache.org/job/HBase-0.94/ws/trunk/target/surefire/surefire1059116797962256720tmp>
<https://builds.apache.org/job/HBase-0.94/ws/trunk/target/surefire/surefire_1043153055905543564779tmp>
Running org.apache.hadoop.hbase.regionserver.TestFSErrorsExposed
Tests run: 3, Failures: 0, Errors: 0, Skipped: 0, Time elapsed: 28.623 sec
Forking command line: /bin/sh -c cd <https://builds.apache.org/job/HBase-0.94/ws/trunk>
&& /home/jenkins/tools/java/jdk1.6.0_27-32/jre/bin/java -enableassertions -Xmx1900m
-Djava.security.egd=file:/dev/./urandom -jar <https://builds.apache.org/job/HBase-0.94/ws/trunk/target/surefire/surefirebooter7551989248756644129.jar>
<https://builds.apache.org/job/HBase-0.94/ws/trunk/target/surefire/surefire3365215240869409622tmp>
<https://builds.apache.org/job/HBase-0.94/ws/trunk/target/surefire/surefire_1057101920034377541253tmp>
Running org.apache.hadoop.hbase.regionserver.handler.TestCloseRegionHandler
Tests run: 3, Failures: 0, Errors: 0, Skipped: 0, Time elapsed: 1.316 sec
Forking command line: /bin/sh -c cd <https://builds.apache.org/job/HBase-0.94/ws/trunk>
&& /home/jenkins/tools/java/jdk1.6.0_27-32/jre/bin/java -enableassertions -Xmx1900m
-Djava.security.egd=file:/dev/./urandom -jar <https://builds.apache.org/job/HBase-0.94/ws/trunk/target/surefire/surefirebooter7823121584603121.jar>
<https://builds.apache.org/job/HBase-0.94/ws/trunk/target/surefire/surefire4681590313303850172tmp>
<https://builds.apache.org/job/HBase-0.94/ws/trunk/target/surefire/surefire_1065118916597707748355tmp>
Running org.apache.hadoop.hbase.regionserver.handler.TestOpenRegionHandler
Tests run: 3, Failures: 0, Errors: 0, Skipped: 0, Time elapsed: 1.11 sec
Forking command line: /bin/sh -c cd <https://builds.apache.org/job/HBase-0.94/ws/trunk>
&& /home/jenkins/tools/java/jdk1.6.0_27-32/jre/bin/java -enableassertions -Xmx1900m
-Djava.security.egd=file:/dev/./urandom -jar <https://builds.apache.org/job/HBase-0.94/ws/trunk/target/surefire/surefirebooter6698440577972816846.jar>
<https://builds.apache.org/job/HBase-0.94/ws/trunk/target/surefire/surefire295926713018472116tmp>
<https://builds.apache.org/job/HBase-0.94/ws/trunk/target/surefire/surefire_1078749319468772370329tmp>
Running org.apache.hadoop.hbase.regionserver.TestParallelPut
Tests run: 2, Failures: 0, Errors: 0, Skipped: 0, Time elapsed: 5.568 sec
Forking command line: /bin/sh -c cd <https://builds.apache.org/job/HBase-0.94/ws/trunk>
&& /home/jenkins/tools/java/jdk1.6.0_27-32/jre/bin/java -enableassertions -Xmx1900m
-Djava.security.egd=file:/dev/./urandom -jar <https://builds.apache.org/job/HBase-0.94/ws/trunk/target/surefire/surefirebooter3031784389282526722.jar>
<https://builds.apache.org/job/HBase-0.94/ws/trunk/target/surefire/surefire8716651487039355880tmp>
<https://builds.apache.org/job/HBase-0.94/ws/trunk/target/surefire/surefire_1088432975961369778884tmp>
Running org.apache.hadoop.hbase.regionserver.wal.TestHLogBench
Tests run: 1, Failures: 0, Errors: 0, Skipped: 0, Time elapsed: 1.339 sec
Forking command line: /bin/sh -c cd <https://builds.apache.org/job/HBase-0.94/ws/trunk>
&& /home/jenkins/tools/java/jdk1.6.0_27-32/jre/bin/java -enableassertions -Xmx1900m
-Djava.security.egd=file:/dev/./urandom -jar <https://builds.apache.org/job/HBase-0.94/ws/trunk/target/surefire/surefirebooter6358194346535773906.jar>
<https://builds.apache.org/job/HBase-0.94/ws/trunk/target/surefire/surefire9133742523043503674tmp>
<https://builds.apache.org/job/HBase-0.94/ws/trunk/target/surefire/surefire_1095660658742482800906tmp>
Running org.apache.hadoop.hbase.regionserver.metrics.TestSchemaMetrics
Tests run: 6, Failures: 0, Errors: 0, Skipped: 0, Time elapsed: 15.377 sec
Forking command line: /bin/sh -c cd <https://builds.apache.org/job/HBase-0.94/ws/trunk>
&& /home/jenkins/tools/java/jdk1.6.0_27-32/jre/bin/java -enableassertions -Xmx1900m
-Djava.security.egd=file:/dev/./urandom -jar <https://builds.apache.org/job/HBase-0.94/ws/trunk/target/surefire/surefirebooter6404510180306016410.jar>
<https://builds.apache.org/job/HBase-0.94/ws/trunk/target/surefire/surefire7126100447828632483tmp>
<https://builds.apache.org/job/HBase-0.94/ws/trunk/target/surefire/surefire_1107118335399014606491tmp>
Running org.apache.hadoop.hbase.regionserver.wal.TestLogRollingNoCluster
Tests run: 1, Failures: 0, Errors: 0, Skipped: 0, Time elapsed: 2.485 sec
Forking command line: /bin/sh -c cd <https://builds.apache.org/job/HBase-0.94/ws/trunk>
&& /home/jenkins/tools/java/jdk1.6.0_27-32/jre/bin/java -enableassertions -Xmx1900m
-Djava.security.egd=file:/dev/./urandom -jar <https://builds.apache.org/job/HBase-0.94/ws/trunk/target/surefire/surefirebooter4865057631399419856.jar>
<https://builds.apache.org/job/HBase-0.94/ws/trunk/target/surefire/surefire2471111630242141451tmp>
<https://builds.apache.org/job/HBase-0.94/ws/trunk/target/surefire/surefire_1112470267434797386604tmp>
Running org.apache.hadoop.hbase.regionserver.wal.TestWALReplay
Tests run: 5, Failures: 0, Errors: 0, Skipped: 0, Time elapsed: 31.813 sec
Running org.apache.hadoop.hbase.regionserver.wal.TestLogRollAbort
Tests run: 1, Failures: 0, Errors: 0, Skipped: 0, Time elapsed: 163.527 sec
Forking command line: /bin/sh -c cd <https://builds.apache.org/job/HBase-0.94/ws/trunk>
&& /home/jenkins/tools/java/jdk1.6.0_27-32/jre/bin/java -enableassertions -Xmx1900m
-Djava.security.egd=file:/dev/./urandom -jar <https://builds.apache.org/job/HBase-0.94/ws/trunk/target/surefire/surefirebooter6185657495798427557.jar>
<https://builds.apache.org/job/HBase-0.94/ws/trunk/target/surefire/surefire4322389047627407330tmp>
<https://builds.apache.org/job/HBase-0.94/ws/trunk/target/surefire/surefire_1127971230243258017433tmp>
Running org.apache.hadoop.hbase.regionserver.wal.TestWALReplayCompressed
Tests run: 5, Failures: 0, Errors: 0, Skipped: 0, Time elapsed: 29.092 sec
Forking command line: /bin/sh -c cd <https://builds.apache.org/job/HBase-0.94/ws/trunk>
&& /home/jenkins/tools/java/jdk1.6.0_27-32/jre/bin/java -enableassertions -Xmx1900m
-Djava.security.egd=file:/dev/./urandom -jar <https://builds.apache.org/job/HBase-0.94/ws/trunk/target/surefire/surefirebooter4057185631402637421.jar>
<https://builds.apache.org/job/HBase-0.94/ws/trunk/target/surefire/surefire848399297081558304tmp>
<https://builds.apache.org/job/HBase-0.94/ws/trunk/target/surefire/surefire_1137699506658063424616tmp>
Running org.apache.hadoop.hbase.regionserver.TestStoreScanner
Tests run: 16, Failures: 0, Errors: 0, Skipped: 0, Time elapsed: 0.064 sec
Forking command line: /bin/sh -c cd <https://builds.apache.org/job/HBase-0.94/ws/trunk>
&& /home/jenkins/tools/java/jdk1.6.0_27-32/jre/bin/java -enableassertions -Xmx1900m
-Djava.security.egd=file:/dev/./urandom -jar <https://builds.apache.org/job/HBase-0.94/ws/trunk/target/surefire/surefirebooter6153223731852679950.jar>
<https://builds.apache.org/job/HBase-0.94/ws/trunk/target/surefire/surefire4859080224425028675tmp>
<https://builds.apache.org/job/HBase-0.94/ws/trunk/target/surefire/surefire_1141521208488435150466tmp>
Running org.apache.hadoop.hbase.regionserver.TestRpcMetrics
Tests run: 1, Failures: 0, Errors: 0, Skipped: 0, Time elapsed: 2.104 sec
Forking command line: /bin/sh -c cd <https://builds.apache.org/job/HBase-0.94/ws/trunk>
&& /home/jenkins/tools/java/jdk1.6.0_27-32/jre/bin/java -enableassertions -Xmx1900m
-Djava.security.egd=file:/dev/./urandom -jar <https://builds.apache.org/job/HBase-0.94/ws/trunk/target/surefire/surefirebooter5301935097872856378.jar>
<https://builds.apache.org/job/HBase-0.94/ws/trunk/target/surefire/surefire8726025484118284433tmp>
<https://builds.apache.org/job/HBase-0.94/ws/trunk/target/surefire/surefire_1155474206800514893662tmp>
Running org.apache.hadoop.hbase.regionserver.TestMultiColumnScanner
Tests run: 12, Failures: 0, Errors: 0, Skipped: 0, Time elapsed: 41.117 sec
Forking command line: /bin/sh -c cd <https://builds.apache.org/job/HBase-0.94/ws/trunk>
&& /home/jenkins/tools/java/jdk1.6.0_27-32/jre/bin/java -enableassertions -Xmx1900m
-Djava.security.egd=file:/dev/./urandom -jar <https://builds.apache.org/job/HBase-0.94/ws/trunk/target/surefire/surefirebooter6889428759948377950.jar>
<https://builds.apache.org/job/HBase-0.94/ws/trunk/target/surefire/surefire5899801522697144029tmp>
<https://builds.apache.org/job/HBase-0.94/ws/trunk/target/surefire/surefire_1161444310362386010710tmp>
Running org.apache.hadoop.hbase.TestDrainingServer
Tests run: 2, Failures: 0, Errors: 0, Skipped: 0, Time elapsed: 18.815 sec
Forking command line: /bin/sh -c cd <https://builds.apache.org/job/HBase-0.94/ws/trunk>
&& /home/jenkins/tools/java/jdk1.6.0_27-32/jre/bin/java -enableassertions -Xmx1900m
-Djava.security.egd=file:/dev/./urandom -jar <https://builds.apache.org/job/HBase-0.94/ws/trunk/target/surefire/surefirebooter235898927687642014.jar>
<https://builds.apache.org/job/HBase-0.94/ws/trunk/target/surefire/surefire8634535600706745183tmp>
<https://builds.apache.org/job/HBase-0.94/ws/trunk/target/surefire/surefire_1176461042333458569983tmp>
Running org.apache.hadoop.hbase.mapreduce.TestImportTsv
Tests run: 8, Failures: 0, Errors: 0, Skipped: 0, Time elapsed: 79.522 sec
Forking command line: /bin/sh -c cd <https://builds.apache.org/job/HBase-0.94/ws/trunk>
&& /home/jenkins/tools/java/jdk1.6.0_27-32/jre/bin/java -enableassertions -Xmx1900m
-Djava.security.egd=file:/dev/./urandom -jar <https://builds.apache.org/job/HBase-0.94/ws/trunk/target/surefire/surefirebooter395579600105394080.jar>
<https://builds.apache.org/job/HBase-0.94/ws/trunk/target/surefire/surefire7664046281822745468tmp>
<https://builds.apache.org/job/HBase-0.94/ws/trunk/target/surefire/surefire_1188759454589523942473tmp>
Running org.apache.hadoop.hbase.mapreduce.TestImportExport
Tests run: 2, Failures: 0, Errors: 0, Skipped: 0, Time elapsed: 48.461 sec

Results :

Failed tests:   testOrphanTaskAcquisition(org.apache.hadoop.hbase.master.TestSplitLogManager)
  testUnassignedTimeout(org.apache.hadoop.hbase.master.TestSplitLogManager)

Tests run: 616, Failures: 2, Errors: 0, Skipped: 2

[INFO] ------------------------------------------------------------------------
[INFO] BUILD FAILURE
[INFO] ------------------------------------------------------------------------
[INFO] Total time: 26:57.872s
[INFO] Finished at: Mon Apr 02 16:18:51 UTC 2012
[INFO] Final Memory: 52M/612M
[INFO] ------------------------------------------------------------------------
[ERROR] Failed to execute goal org.apache.maven.plugins:maven-surefire-plugin:2.12-TRUNK-HBASE-2:test
(secondPartTestsExecution) on project hbase: There are test failures.
[ERROR] 
[ERROR] Please refer to <https://builds.apache.org/job/HBase-0.94/ws/trunk/target/surefire-reports>
for the individual test results.
[ERROR] -> [Help 1]
org.apache.maven.lifecycle.LifecycleExecutionException: Failed to execute goal org.apache.maven.plugins:maven-surefire-plugin:2.12-TRUNK-HBASE-2:test
(secondPartTestsExecution) on project hbase: There are test failures.

Please refer to <https://builds.apache.org/job/HBase-0.94/ws/trunk/target/surefire-reports>
for the individual test results.
	at org.apache.maven.lifecycle.internal.MojoExecutor.execute(MojoExecutor.java:213)
	at org.apache.maven.lifecycle.internal.MojoExecutor.execute(MojoExecutor.java:153)
	at org.apache.maven.lifecycle.internal.MojoExecutor.execute(MojoExecutor.java:145)
	at org.apache.maven.lifecycle.internal.LifecycleModuleBuilder.buildProject(LifecycleModuleBuilder.java:84)
	at org.apache.maven.lifecycle.internal.LifecycleModuleBuilder.buildProject(LifecycleModuleBuilder.java:59)
	at org.apache.maven.lifecycle.internal.LifecycleStarter.singleThreadedBuild(LifecycleStarter.java:183)
	at org.apache.maven.lifecycle.internal.LifecycleStarter.execute(LifecycleStarter.java:161)
	at org.apache.maven.DefaultMaven.doExecute(DefaultMaven.java:319)
	at org.apache.maven.DefaultMaven.execute(DefaultMaven.java:156)
	at org.apache.maven.cli.MavenCli.execute(MavenCli.java:537)
	at org.apache.maven.cli.MavenCli.doMain(MavenCli.java:196)
	at org.apache.maven.cli.MavenCli.main(MavenCli.java:141)
	at sun.reflect.NativeMethodAccessorImpl.invoke0(Native Method)
	at sun.reflect.NativeMethodAccessorImpl.invoke(NativeMethodAccessorImpl.java:39)
	at sun.reflect.DelegatingMethodAccessorImpl.invoke(DelegatingMethodAccessorImpl.java:25)
	at java.lang.reflect.Method.invoke(Method.java:597)
	at org.codehaus.plexus.classworlds.launcher.Launcher.launchEnhanced(Launcher.java:290)
	at org.codehaus.plexus.classworlds.launcher.Launcher.launch(Launcher.java:230)
	at org.codehaus.plexus.classworlds.launcher.Launcher.mainWithExitCode(Launcher.java:409)
	at org.codehaus.plexus.classworlds.launcher.Launcher.main(Launcher.java:352)
Caused by: org.apache.maven.plugin.MojoFailureException: There are test failures.

Please refer to <https://builds.apache.org/job/HBase-0.94/ws/trunk/target/surefire-reports>
for the individual test results.
	at org.apache.maven.plugin.surefire.SurefireHelper.reportExecution(SurefireHelper.java:87)
	at org.apache.maven.plugin.surefire.SurefirePlugin.writeSummary(SurefirePlugin.java:651)
	at org.apache.maven.plugin.surefire.SurefirePlugin.handleSummary(SurefirePlugin.java:625)
	at org.apache.maven.plugin.surefire.AbstractSurefireMojo.executeAfterPreconditionsChecked(AbstractSurefireMojo.java:137)
	at org.apache.maven.plugin.surefire.AbstractSurefireMojo.execute(AbstractSurefireMojo.java:98)
	at org.apache.maven.plugin.DefaultBuildPluginManager.executeMojo(DefaultBuildPluginManager.java:101)
	at org.apache.maven.lifecycle.internal.MojoExecutor.execute(MojoExecutor.java:209)
	... 19 more
[ERROR] 
[ERROR] 
[ERROR] For more information about the errors and possible solutions, please read the following
articles:
[ERROR] [Help 1] http://cwiki.apache.org/confluence/display/MAVEN/MojoFailureException
Build step 'Invoke top-level Maven targets' marked build as failure
Archiving artifacts
Recording test results

Mime
View raw message