hbase-dev mailing list archives

Site index · List index
Message view « Date » · « Thread »
Top « Date » · « Thread »
From Apache Jenkins Server <jenk...@builds.apache.org>
Subject Build failed in Jenkins: HBase-0.94 #110
Date Fri, 13 Apr 2012 04:23:56 GMT
See <https://builds.apache.org/job/HBase-0.94/110/>

------------------------------------------
[...truncated 20881 lines...]
Forking command line: /bin/sh -c cd /x1/jenkins/jenkins-slave/workspace/HBase-0.94/trunk &&
/x1/jenkins/tools/java/jdk1.6.0_27-32/jre/bin/java -enableassertions -Xmx1900m -Djava.security.egd=file:/dev/./urandom
-jar /x1/jenkins/jenkins-slave/workspace/HBase-0.94/trunk/target/surefire/surefirebooter4723876198992382146.jar
/x1/jenkins/jenkins-slave/workspace/HBase-0.94/trunk/target/surefire/surefire5929886282424668183tmp
/x1/jenkins/jenkins-slave/workspace/HBase-0.94/trunk/target/surefire/surefire_589095512978303396979tmp
Running org.apache.hadoop.hbase.regionserver.TestAtomicOperation
Tests run: 5, Failures: 0, Errors: 0, Skipped: 0, Time elapsed: 21.735 sec
Forking command line: /bin/sh -c cd /x1/jenkins/jenkins-slave/workspace/HBase-0.94/trunk &&
/x1/jenkins/tools/java/jdk1.6.0_27-32/jre/bin/java -enableassertions -Xmx1900m -Djava.security.egd=file:/dev/./urandom
-jar /x1/jenkins/jenkins-slave/workspace/HBase-0.94/trunk/target/surefire/surefirebooter599341793184928672.jar
/x1/jenkins/jenkins-slave/workspace/HBase-0.94/trunk/target/surefire/surefire7234090846927034592tmp
/x1/jenkins/jenkins-slave/workspace/HBase-0.94/trunk/target/surefire/surefire_598385070960973480495tmp
Running org.apache.hadoop.hbase.regionserver.TestFSErrorsExposed
Tests run: 3, Failures: 0, Errors: 0, Skipped: 0, Time elapsed: 26.735 sec
Forking command line: /bin/sh -c cd /x1/jenkins/jenkins-slave/workspace/HBase-0.94/trunk &&
/x1/jenkins/tools/java/jdk1.6.0_27-32/jre/bin/java -enableassertions -Xmx1900m -Djava.security.egd=file:/dev/./urandom
-jar /x1/jenkins/jenkins-slave/workspace/HBase-0.94/trunk/target/surefire/surefirebooter8534119171104955375.jar
/x1/jenkins/jenkins-slave/workspace/HBase-0.94/trunk/target/surefire/surefire6603341246755449471tmp
/x1/jenkins/jenkins-slave/workspace/HBase-0.94/trunk/target/surefire/surefire_601038663936174596602tmp
Running org.apache.hadoop.hbase.regionserver.TestServerCustomProtocol
Tests run: 7, Failures: 0, Errors: 0, Skipped: 0, Time elapsed: 14.293 sec
Forking command line: /bin/sh -c cd /x1/jenkins/jenkins-slave/workspace/HBase-0.94/trunk &&
/x1/jenkins/tools/java/jdk1.6.0_27-32/jre/bin/java -enableassertions -Xmx1900m -Djava.security.egd=file:/dev/./urandom
-jar /x1/jenkins/jenkins-slave/workspace/HBase-0.94/trunk/target/surefire/surefirebooter896306215554421681.jar
/x1/jenkins/jenkins-slave/workspace/HBase-0.94/trunk/target/surefire/surefire3641401196022604136tmp
/x1/jenkins/jenkins-slave/workspace/HBase-0.94/trunk/target/surefire/surefire_613217010333799700409tmp
Running org.apache.hadoop.hbase.regionserver.TestParallelPut
Tests run: 2, Failures: 0, Errors: 0, Skipped: 0, Time elapsed: 3.046 sec
Forking command line: /bin/sh -c cd /x1/jenkins/jenkins-slave/workspace/HBase-0.94/trunk &&
/x1/jenkins/tools/java/jdk1.6.0_27-32/jre/bin/java -enableassertions -Xmx1900m -Djava.security.egd=file:/dev/./urandom
-jar /x1/jenkins/jenkins-slave/workspace/HBase-0.94/trunk/target/surefire/surefirebooter7775927324957032149.jar
/x1/jenkins/jenkins-slave/workspace/HBase-0.94/trunk/target/surefire/surefire1123151555895144071tmp
/x1/jenkins/jenkins-slave/workspace/HBase-0.94/trunk/target/surefire/surefire_625213150320484892903tmp
Running org.apache.hadoop.hbase.regionserver.TestRpcMetrics
Tests run: 1, Failures: 0, Errors: 0, Skipped: 0, Time elapsed: 1.944 sec
Forking command line: /bin/sh -c cd /x1/jenkins/jenkins-slave/workspace/HBase-0.94/trunk &&
/x1/jenkins/tools/java/jdk1.6.0_27-32/jre/bin/java -enableassertions -Xmx1900m -Djava.security.egd=file:/dev/./urandom
-jar /x1/jenkins/jenkins-slave/workspace/HBase-0.94/trunk/target/surefire/surefirebooter5245536328506936694.jar
/x1/jenkins/jenkins-slave/workspace/HBase-0.94/trunk/target/surefire/surefire5656887542301542701tmp
/x1/jenkins/jenkins-slave/workspace/HBase-0.94/trunk/target/surefire/surefire_632087263999826759767tmp
Forking command line: /bin/sh -c cd /x1/jenkins/jenkins-slave/workspace/HBase-0.94/trunk &&
/x1/jenkins/tools/java/jdk1.6.0_27-32/jre/bin/java -enableassertions -Xmx1900m -Djava.security.egd=file:/dev/./urandom
-jar /x1/jenkins/jenkins-slave/workspace/HBase-0.94/trunk/target/surefire/surefirebooter8506096026039206263.jar
/x1/jenkins/jenkins-slave/workspace/HBase-0.94/trunk/target/surefire/surefire4432876763191676119tmp
/x1/jenkins/jenkins-slave/workspace/HBase-0.94/trunk/target/surefire/surefire_641947080841279735235tmp
Running org.apache.hadoop.hbase.regionserver.handler.TestCloseRegionHandler
Tests run: 3, Failures: 0, Errors: 0, Skipped: 0, Time elapsed: 1.143 sec
Forking command line: /bin/sh -c cd /x1/jenkins/jenkins-slave/workspace/HBase-0.94/trunk &&
/x1/jenkins/tools/java/jdk1.6.0_27-32/jre/bin/java -enableassertions -Xmx1900m -Djava.security.egd=file:/dev/./urandom
-jar /x1/jenkins/jenkins-slave/workspace/HBase-0.94/trunk/target/surefire/surefirebooter8432387427587917831.jar
/x1/jenkins/jenkins-slave/workspace/HBase-0.94/trunk/target/surefire/surefire4253285326716141240tmp
/x1/jenkins/jenkins-slave/workspace/HBase-0.94/trunk/target/surefire/surefire_656092565227849092655tmp
Running org.apache.hadoop.hbase.regionserver.TestSeekOptimizations
Tests run: 6, Failures: 0, Errors: 0, Skipped: 0, Time elapsed: 2.242 sec
Running org.apache.hadoop.hbase.regionserver.handler.TestOpenRegionHandler
Tests run: 3, Failures: 0, Errors: 0, Skipped: 0, Time elapsed: 0.85 sec
Forking command line: /bin/sh -c cd /x1/jenkins/jenkins-slave/workspace/HBase-0.94/trunk &&
/x1/jenkins/tools/java/jdk1.6.0_27-32/jre/bin/java -enableassertions -Xmx1900m -Djava.security.egd=file:/dev/./urandom
-jar /x1/jenkins/jenkins-slave/workspace/HBase-0.94/trunk/target/surefire/surefirebooter6334846370158917808.jar
/x1/jenkins/jenkins-slave/workspace/HBase-0.94/trunk/target/surefire/surefire4753453997489763689tmp
/x1/jenkins/jenkins-slave/workspace/HBase-0.94/trunk/target/surefire/surefire_665979222888521273944tmp
Forking command line: /bin/sh -c cd /x1/jenkins/jenkins-slave/workspace/HBase-0.94/trunk &&
/x1/jenkins/tools/java/jdk1.6.0_27-32/jre/bin/java -enableassertions -Xmx1900m -Djava.security.egd=file:/dev/./urandom
-jar /x1/jenkins/jenkins-slave/workspace/HBase-0.94/trunk/target/surefire/surefirebooter7296621127224248399.jar
/x1/jenkins/jenkins-slave/workspace/HBase-0.94/trunk/target/surefire/surefire2555832689203215928tmp
/x1/jenkins/jenkins-slave/workspace/HBase-0.94/trunk/target/surefire/surefire_672525777729156254695tmp
Running org.apache.hadoop.hbase.regionserver.TestBlocksRead
Tests run: 4, Failures: 0, Errors: 0, Skipped: 0, Time elapsed: 0.721 sec
Forking command line: /bin/sh -c cd /x1/jenkins/jenkins-slave/workspace/HBase-0.94/trunk &&
/x1/jenkins/tools/java/jdk1.6.0_27-32/jre/bin/java -enableassertions -Xmx1900m -Djava.security.egd=file:/dev/./urandom
-jar /x1/jenkins/jenkins-slave/workspace/HBase-0.94/trunk/target/surefire/surefirebooter8067830062516912398.jar
/x1/jenkins/jenkins-slave/workspace/HBase-0.94/trunk/target/surefire/surefire4122487581302460299tmp
/x1/jenkins/jenkins-slave/workspace/HBase-0.94/trunk/target/surefire/surefire_681431645098094040007tmp
Running org.apache.hadoop.hbase.regionserver.TestStoreScanner
Tests run: 16, Failures: 0, Errors: 0, Skipped: 0, Time elapsed: 0.086 sec
Forking command line: /bin/sh -c cd /x1/jenkins/jenkins-slave/workspace/HBase-0.94/trunk &&
/x1/jenkins/tools/java/jdk1.6.0_27-32/jre/bin/java -enableassertions -Xmx1900m -Djava.security.egd=file:/dev/./urandom
-jar /x1/jenkins/jenkins-slave/workspace/HBase-0.94/trunk/target/surefire/surefirebooter6384828990074323399.jar
/x1/jenkins/jenkins-slave/workspace/HBase-0.94/trunk/target/surefire/surefire7522998907675539362tmp
/x1/jenkins/jenkins-slave/workspace/HBase-0.94/trunk/target/surefire/surefire_697234245765568037443tmp
Running org.apache.hadoop.hbase.regionserver.TestSplitLogWorker
Tests run: 5, Failures: 0, Errors: 0, Skipped: 0, Time elapsed: 2.061 sec
Forking command line: /bin/sh -c cd /x1/jenkins/jenkins-slave/workspace/HBase-0.94/trunk &&
/x1/jenkins/tools/java/jdk1.6.0_27-32/jre/bin/java -enableassertions -Xmx1900m -Djava.security.egd=file:/dev/./urandom
-jar /x1/jenkins/jenkins-slave/workspace/HBase-0.94/trunk/target/surefire/surefirebooter3044286206615586002.jar
/x1/jenkins/jenkins-slave/workspace/HBase-0.94/trunk/target/surefire/surefire1700317659335657435tmp
/x1/jenkins/jenkins-slave/workspace/HBase-0.94/trunk/target/surefire/surefire_701907705274273624282tmp
Running org.apache.hadoop.hbase.regionserver.metrics.TestSchemaMetrics
Tests run: 6, Failures: 0, Errors: 0, Skipped: 0, Time elapsed: 11.059 sec
Forking command line: /bin/sh -c cd /x1/jenkins/jenkins-slave/workspace/HBase-0.94/trunk &&
/x1/jenkins/tools/java/jdk1.6.0_27-32/jre/bin/java -enableassertions -Xmx1900m -Djava.security.egd=file:/dev/./urandom
-jar /x1/jenkins/jenkins-slave/workspace/HBase-0.94/trunk/target/surefire/surefirebooter8508712694103363364.jar
/x1/jenkins/jenkins-slave/workspace/HBase-0.94/trunk/target/surefire/surefire4553291021171643470tmp
/x1/jenkins/jenkins-slave/workspace/HBase-0.94/trunk/target/surefire/surefire_717073888459633492404tmp
Running org.apache.hadoop.hbase.regionserver.TestStoreFileBlockCacheSummary
Tests run: 1, Failures: 0, Errors: 0, Skipped: 0, Time elapsed: 13.575 sec
Forking command line: /bin/sh -c cd /x1/jenkins/jenkins-slave/workspace/HBase-0.94/trunk &&
/x1/jenkins/tools/java/jdk1.6.0_27-32/jre/bin/java -enableassertions -Xmx1900m -Djava.security.egd=file:/dev/./urandom
-jar /x1/jenkins/jenkins-slave/workspace/HBase-0.94/trunk/target/surefire/surefirebooter1601182553619734392.jar
/x1/jenkins/jenkins-slave/workspace/HBase-0.94/trunk/target/surefire/surefire2372219824328055519tmp
/x1/jenkins/jenkins-slave/workspace/HBase-0.94/trunk/target/surefire/surefire_724683350175260703920tmp
Running org.apache.hadoop.hbase.regionserver.TestMasterAddressManager
Tests run: 1, Failures: 0, Errors: 0, Skipped: 0, Time elapsed: 0.55 sec
Forking command line: /bin/sh -c cd /x1/jenkins/jenkins-slave/workspace/HBase-0.94/trunk &&
/x1/jenkins/tools/java/jdk1.6.0_27-32/jre/bin/java -enableassertions -Xmx1900m -Djava.security.egd=file:/dev/./urandom
-jar /x1/jenkins/jenkins-slave/workspace/HBase-0.94/trunk/target/surefire/surefirebooter1531492361066229475.jar
/x1/jenkins/jenkins-slave/workspace/HBase-0.94/trunk/target/surefire/surefire5953547385694452298tmp
/x1/jenkins/jenkins-slave/workspace/HBase-0.94/trunk/target/surefire/surefire_73225161365062380441tmp
Running org.apache.hadoop.hbase.regionserver.TestMultiColumnScanner
Tests run: 12, Failures: 0, Errors: 0, Skipped: 0, Time elapsed: 28.107 sec
Forking command line: /bin/sh -c cd /x1/jenkins/jenkins-slave/workspace/HBase-0.94/trunk &&
/x1/jenkins/tools/java/jdk1.6.0_27-32/jre/bin/java -enableassertions -Xmx1900m -Djava.security.egd=file:/dev/./urandom
-jar /x1/jenkins/jenkins-slave/workspace/HBase-0.94/trunk/target/surefire/surefirebooter6697599885023432622.jar
/x1/jenkins/jenkins-slave/workspace/HBase-0.94/trunk/target/surefire/surefire8393689201773176951tmp
/x1/jenkins/jenkins-slave/workspace/HBase-0.94/trunk/target/surefire/surefire_748021953132659700837tmp
Running org.apache.hadoop.hbase.ipc.TestDelayedRpc
Tests run: 4, Failures: 0, Errors: 0, Skipped: 0, Time elapsed: 2.459 sec
Forking command line: /bin/sh -c cd /x1/jenkins/jenkins-slave/workspace/HBase-0.94/trunk &&
/x1/jenkins/tools/java/jdk1.6.0_27-32/jre/bin/java -enableassertions -Xmx1900m -Djava.security.egd=file:/dev/./urandom
-jar /x1/jenkins/jenkins-slave/workspace/HBase-0.94/trunk/target/surefire/surefirebooter8301439804373548959.jar
/x1/jenkins/jenkins-slave/workspace/HBase-0.94/trunk/target/surefire/surefire4035811344177543389tmp
/x1/jenkins/jenkins-slave/workspace/HBase-0.94/trunk/target/surefire/surefire_758471067719313899790tmp
Running org.apache.hadoop.hbase.TestGlobalMemStoreSize
Tests run: 1, Failures: 0, Errors: 0, Skipped: 0, Time elapsed: 14.786 sec
Forking command line: /bin/sh -c cd /x1/jenkins/jenkins-slave/workspace/HBase-0.94/trunk &&
/x1/jenkins/tools/java/jdk1.6.0_27-32/jre/bin/java -enableassertions -Xmx1900m -Djava.security.egd=file:/dev/./urandom
-jar /x1/jenkins/jenkins-slave/workspace/HBase-0.94/trunk/target/surefire/surefirebooter6082749734011808326.jar
/x1/jenkins/jenkins-slave/workspace/HBase-0.94/trunk/target/surefire/surefire6722733101558204513tmp
/x1/jenkins/jenkins-slave/workspace/HBase-0.94/trunk/target/surefire/surefire_761298348890799225885tmp
Running org.apache.hadoop.hbase.regionserver.TestHRegion
Tests run: 62, Failures: 0, Errors: 0, Skipped: 0, Time elapsed: 57.91 sec
Forking command line: /bin/sh -c cd /x1/jenkins/jenkins-slave/workspace/HBase-0.94/trunk &&
/x1/jenkins/tools/java/jdk1.6.0_27-32/jre/bin/java -enableassertions -Xmx1900m -Djava.security.egd=file:/dev/./urandom
-jar /x1/jenkins/jenkins-slave/workspace/HBase-0.94/trunk/target/surefire/surefirebooter771597317345736837.jar
/x1/jenkins/jenkins-slave/workspace/HBase-0.94/trunk/target/surefire/surefire8385854764938524132tmp
/x1/jenkins/jenkins-slave/workspace/HBase-0.94/trunk/target/surefire/surefire_777199675199918355985tmp
Running org.apache.hadoop.hbase.constraint.TestConstraint
Tests run: 5, Failures: 0, Errors: 0, Skipped: 0, Time elapsed: 28.381 sec
Forking command line: /bin/sh -c cd /x1/jenkins/jenkins-slave/workspace/HBase-0.94/trunk &&
/x1/jenkins/tools/java/jdk1.6.0_27-32/jre/bin/java -enableassertions -Xmx1900m -Djava.security.egd=file:/dev/./urandom
-jar /x1/jenkins/jenkins-slave/workspace/HBase-0.94/trunk/target/surefire/surefirebooter1828794558087120799.jar
/x1/jenkins/jenkins-slave/workspace/HBase-0.94/trunk/target/surefire/surefire3396257002399296138tmp
/x1/jenkins/jenkins-slave/workspace/HBase-0.94/trunk/target/surefire/surefire_786211151601913940223tmp
Running org.apache.hadoop.hbase.rest.TestSchemaResource
Tests run: 2, Failures: 0, Errors: 0, Skipped: 0, Time elapsed: 20.193 sec
Forking command line: /bin/sh -c cd /x1/jenkins/jenkins-slave/workspace/HBase-0.94/trunk &&
/x1/jenkins/tools/java/jdk1.6.0_27-32/jre/bin/java -enableassertions -Xmx1900m -Djava.security.egd=file:/dev/./urandom
-jar /x1/jenkins/jenkins-slave/workspace/HBase-0.94/trunk/target/surefire/surefirebooter1682079346910670367.jar
/x1/jenkins/jenkins-slave/workspace/HBase-0.94/trunk/target/surefire/surefire4123562403704934599tmp
/x1/jenkins/jenkins-slave/workspace/HBase-0.94/trunk/target/surefire/surefire_798915012772088300987tmp
Running org.apache.hadoop.hbase.rest.client.TestRemoteAdmin
Tests run: 1, Failures: 0, Errors: 0, Skipped: 0, Time elapsed: 15.739 sec
Forking command line: /bin/sh -c cd /x1/jenkins/jenkins-slave/workspace/HBase-0.94/trunk &&
/x1/jenkins/tools/java/jdk1.6.0_27-32/jre/bin/java -enableassertions -Xmx1900m -Djava.security.egd=file:/dev/./urandom
-jar /x1/jenkins/jenkins-slave/workspace/HBase-0.94/trunk/target/surefire/surefirebooter7428719878233942454.jar
/x1/jenkins/jenkins-slave/workspace/HBase-0.94/trunk/target/surefire/surefire3369498928337643115tmp
/x1/jenkins/jenkins-slave/workspace/HBase-0.94/trunk/target/surefire/surefire_801368855893375419740tmp
Running org.apache.hadoop.hbase.rest.client.TestRemoteTable
Tests run: 3, Failures: 0, Errors: 0, Skipped: 0, Time elapsed: 14.175 sec
Forking command line: /bin/sh -c cd /x1/jenkins/jenkins-slave/workspace/HBase-0.94/trunk &&
/x1/jenkins/tools/java/jdk1.6.0_27-32/jre/bin/java -enableassertions -Xmx1900m -Djava.security.egd=file:/dev/./urandom
-jar /x1/jenkins/jenkins-slave/workspace/HBase-0.94/trunk/target/surefire/surefirebooter1227554203429076073.jar
/x1/jenkins/jenkins-slave/workspace/HBase-0.94/trunk/target/surefire/surefire8212113267138198741tmp
/x1/jenkins/jenkins-slave/workspace/HBase-0.94/trunk/target/surefire/surefire_811460053924752346472tmp
Running org.apache.hadoop.hbase.rest.TestMultiRowResource
Tests run: 3, Failures: 0, Errors: 0, Skipped: 0, Time elapsed: 13.573 sec
Forking command line: /bin/sh -c cd /x1/jenkins/jenkins-slave/workspace/HBase-0.94/trunk &&
/x1/jenkins/tools/java/jdk1.6.0_27-32/jre/bin/java -enableassertions -Xmx1900m -Djava.security.egd=file:/dev/./urandom
-jar /x1/jenkins/jenkins-slave/workspace/HBase-0.94/trunk/target/surefire/surefirebooter8822667049716331885.jar
/x1/jenkins/jenkins-slave/workspace/HBase-0.94/trunk/target/surefire/surefire4675047866202369974tmp
/x1/jenkins/jenkins-slave/workspace/HBase-0.94/trunk/target/surefire/surefire_827198564524432679132tmp
Running org.apache.hadoop.hbase.rest.TestTableResource
Tests run: 8, Failures: 0, Errors: 0, Skipped: 0, Time elapsed: 22.535 sec
Forking command line: /bin/sh -c cd /x1/jenkins/jenkins-slave/workspace/HBase-0.94/trunk &&
/x1/jenkins/tools/java/jdk1.6.0_27-32/jre/bin/java -enableassertions -Xmx1900m -Djava.security.egd=file:/dev/./urandom
-jar /x1/jenkins/jenkins-slave/workspace/HBase-0.94/trunk/target/surefire/surefirebooter500227742064624889.jar
/x1/jenkins/jenkins-slave/workspace/HBase-0.94/trunk/target/surefire/surefire6271377070129346118tmp
/x1/jenkins/jenkins-slave/workspace/HBase-0.94/trunk/target/surefire/surefire_838862239743254827498tmp
Running org.apache.hadoop.hbase.rest.TestGzipFilter
Tests run: 3, Failures: 0, Errors: 0, Skipped: 0, Time elapsed: 12.922 sec
Forking command line: /bin/sh -c cd /x1/jenkins/jenkins-slave/workspace/HBase-0.94/trunk &&
/x1/jenkins/tools/java/jdk1.6.0_27-32/jre/bin/java -enableassertions -Xmx1900m -Djava.security.egd=file:/dev/./urandom
-jar /x1/jenkins/jenkins-slave/workspace/HBase-0.94/trunk/target/surefire/surefirebooter2008478894782270625.jar
/x1/jenkins/jenkins-slave/workspace/HBase-0.94/trunk/target/surefire/surefire5534772239847525071tmp
/x1/jenkins/jenkins-slave/workspace/HBase-0.94/trunk/target/surefire/surefire_843259121213356455292tmp
Running org.apache.hadoop.hbase.rest.TestRowResource
Tests run: 11, Failures: 0, Errors: 0, Skipped: 0, Time elapsed: 16.165 sec
Forking command line: /bin/sh -c cd /x1/jenkins/jenkins-slave/workspace/HBase-0.94/trunk &&
/x1/jenkins/tools/java/jdk1.6.0_27-32/jre/bin/java -enableassertions -Xmx1900m -Djava.security.egd=file:/dev/./urandom
-jar /x1/jenkins/jenkins-slave/workspace/HBase-0.94/trunk/target/surefire/surefirebooter989496333056021862.jar
/x1/jenkins/jenkins-slave/workspace/HBase-0.94/trunk/target/surefire/surefire6912037473883188163tmp
/x1/jenkins/jenkins-slave/workspace/HBase-0.94/trunk/target/surefire/surefire_853321365354930627222tmp
Running org.apache.hadoop.hbase.rest.TestVersionResource
Tests run: 7, Failures: 0, Errors: 0, Skipped: 0, Time elapsed: 10.961 sec
Forking command line: /bin/sh -c cd /x1/jenkins/jenkins-slave/workspace/HBase-0.94/trunk &&
/x1/jenkins/tools/java/jdk1.6.0_27-32/jre/bin/java -enableassertions -Xmx1900m -Djava.security.egd=file:/dev/./urandom
-jar /x1/jenkins/jenkins-slave/workspace/HBase-0.94/trunk/target/surefire/surefirebooter7310325680371768867.jar
/x1/jenkins/jenkins-slave/workspace/HBase-0.94/trunk/target/surefire/surefire8600539596164866879tmp
/x1/jenkins/jenkins-slave/workspace/HBase-0.94/trunk/target/surefire/surefire_866977863716557536614tmp
Running org.apache.hadoop.hbase.rest.TestScannerResource
Tests run: 5, Failures: 0, Errors: 0, Skipped: 0, Time elapsed: 27.169 sec
Forking command line: /bin/sh -c cd /x1/jenkins/jenkins-slave/workspace/HBase-0.94/trunk &&
/x1/jenkins/tools/java/jdk1.6.0_27-32/jre/bin/java -enableassertions -Xmx1900m -Djava.security.egd=file:/dev/./urandom
-jar /x1/jenkins/jenkins-slave/workspace/HBase-0.94/trunk/target/surefire/surefirebooter1386985143713340429.jar
/x1/jenkins/jenkins-slave/workspace/HBase-0.94/trunk/target/surefire/surefire936201565071231622tmp
/x1/jenkins/jenkins-slave/workspace/HBase-0.94/trunk/target/surefire/surefire_871613494085862943836tmp
Running org.apache.hadoop.hbase.rest.TestStatusResource
Tests run: 2, Failures: 0, Errors: 0, Skipped: 0, Time elapsed: 9.946 sec
Forking command line: /bin/sh -c cd /x1/jenkins/jenkins-slave/workspace/HBase-0.94/trunk &&
/x1/jenkins/tools/java/jdk1.6.0_27-32/jre/bin/java -enableassertions -Xmx1900m -Djava.security.egd=file:/dev/./urandom
-jar /x1/jenkins/jenkins-slave/workspace/HBase-0.94/trunk/target/surefire/surefirebooter3411291318478331109.jar
/x1/jenkins/jenkins-slave/workspace/HBase-0.94/trunk/target/surefire/surefire1000711081367867701tmp
/x1/jenkins/jenkins-slave/workspace/HBase-0.94/trunk/target/surefire/surefire_884521933494136024936tmp
Running org.apache.hadoop.hbase.metrics.TestMetricsMBeanBase
Tests run: 2, Failures: 0, Errors: 0, Skipped: 0, Time elapsed: 1.104 sec
Forking command line: /bin/sh -c cd /x1/jenkins/jenkins-slave/workspace/HBase-0.94/trunk &&
/x1/jenkins/tools/java/jdk1.6.0_27-32/jre/bin/java -enableassertions -Xmx1900m -Djava.security.egd=file:/dev/./urandom
-jar /x1/jenkins/jenkins-slave/workspace/HBase-0.94/trunk/target/surefire/surefirebooter6777547586785487644.jar
/x1/jenkins/jenkins-slave/workspace/HBase-0.94/trunk/target/surefire/surefire3220524782204731843tmp
/x1/jenkins/jenkins-slave/workspace/HBase-0.94/trunk/target/surefire/surefire_895448938297580339997tmp
Running org.apache.hadoop.hbase.io.hfile.TestHFileBlockIndex
Tests run: 10, Failures: 0, Errors: 0, Skipped: 0, Time elapsed: 7.341 sec
Forking command line: /bin/sh -c cd /x1/jenkins/jenkins-slave/workspace/HBase-0.94/trunk &&
/x1/jenkins/tools/java/jdk1.6.0_27-32/jre/bin/java -enableassertions -Xmx1900m -Djava.security.egd=file:/dev/./urandom
-jar /x1/jenkins/jenkins-slave/workspace/HBase-0.94/trunk/target/surefire/surefirebooter6101270776829823362.jar
/x1/jenkins/jenkins-slave/workspace/HBase-0.94/trunk/target/surefire/surefire6191557237670363179tmp
/x1/jenkins/jenkins-slave/workspace/HBase-0.94/trunk/target/surefire/surefire_905114283712858567685tmp
Running org.apache.hadoop.hbase.io.hfile.TestHFileSeek
Tests run: 1, Failures: 0, Errors: 0, Skipped: 0, Time elapsed: 6.285 sec
Forking command line: /bin/sh -c cd /x1/jenkins/jenkins-slave/workspace/HBase-0.94/trunk &&
/x1/jenkins/tools/java/jdk1.6.0_27-32/jre/bin/java -enableassertions -Xmx1900m -Djava.security.egd=file:/dev/./urandom
-jar /x1/jenkins/jenkins-slave/workspace/HBase-0.94/trunk/target/surefire/surefirebooter6820432860073519499.jar
/x1/jenkins/jenkins-slave/workspace/HBase-0.94/trunk/target/surefire/surefire8286123271196066417tmp
/x1/jenkins/jenkins-slave/workspace/HBase-0.94/trunk/target/surefire/surefire_914507929127827163677tmp
Running org.apache.hadoop.hbase.rest.TestScannersWithFilters
Tests run: 10, Failures: 0, Errors: 0, Skipped: 0, Time elapsed: 16.362 sec
Forking command line: /bin/sh -c cd /x1/jenkins/jenkins-slave/workspace/HBase-0.94/trunk &&
/x1/jenkins/tools/java/jdk1.6.0_27-32/jre/bin/java -enableassertions -Xmx1900m -Djava.security.egd=file:/dev/./urandom
-jar /x1/jenkins/jenkins-slave/workspace/HBase-0.94/trunk/target/surefire/surefirebooter4959104321083827284.jar
/x1/jenkins/jenkins-slave/workspace/HBase-0.94/trunk/target/surefire/surefire3673058226596192981tmp
/x1/jenkins/jenkins-slave/workspace/HBase-0.94/trunk/target/surefire/surefire_924124218784663305275tmp
Running org.apache.hadoop.hbase.io.hfile.TestLruBlockCache
Tests run: 16, Failures: 0, Errors: 0, Skipped: 0, Time elapsed: 0.879 sec
Forking command line: /bin/sh -c cd /x1/jenkins/jenkins-slave/workspace/HBase-0.94/trunk &&
/x1/jenkins/tools/java/jdk1.6.0_27-32/jre/bin/java -enableassertions -Xmx1900m -Djava.security.egd=file:/dev/./urandom
-jar /x1/jenkins/jenkins-slave/workspace/HBase-0.94/trunk/target/surefire/surefirebooter6885273762317049019.jar
/x1/jenkins/jenkins-slave/workspace/HBase-0.94/trunk/target/surefire/surefire8167455360285286005tmp
/x1/jenkins/jenkins-slave/workspace/HBase-0.94/trunk/target/surefire/surefire_934417066048251243122tmp
Running org.apache.hadoop.hbase.io.hfile.TestFixedFileTrailer
Tests run: 2, Failures: 0, Errors: 0, Skipped: 0, Time elapsed: 0.552 sec
Forking command line: /bin/sh -c cd /x1/jenkins/jenkins-slave/workspace/HBase-0.94/trunk &&
/x1/jenkins/tools/java/jdk1.6.0_27-32/jre/bin/java -enableassertions -Xmx1900m -Djava.security.egd=file:/dev/./urandom
-jar /x1/jenkins/jenkins-slave/workspace/HBase-0.94/trunk/target/surefire/surefirebooter1875625936491868491.jar
/x1/jenkins/jenkins-slave/workspace/HBase-0.94/trunk/target/surefire/surefire4134981707152554388tmp
/x1/jenkins/jenkins-slave/workspace/HBase-0.94/trunk/target/surefire/surefire_948534037904843584125tmp
Running org.apache.hadoop.hbase.io.hfile.TestHFilePerformance
Tests run: 1, Failures: 0, Errors: 0, Skipped: 0, Time elapsed: 4.362 sec
Forking command line: /bin/sh -c cd /x1/jenkins/jenkins-slave/workspace/HBase-0.94/trunk &&
/x1/jenkins/tools/java/jdk1.6.0_27-32/jre/bin/java -enableassertions -Xmx1900m -Djava.security.egd=file:/dev/./urandom
-jar /x1/jenkins/jenkins-slave/workspace/HBase-0.94/trunk/target/surefire/surefirebooter5057573766077052297.jar
/x1/jenkins/jenkins-slave/workspace/HBase-0.94/trunk/target/surefire/surefire5941655966567511057tmp
/x1/jenkins/jenkins-slave/workspace/HBase-0.94/trunk/target/surefire/surefire_954288578543229299399tmp
Running org.apache.hadoop.hbase.io.hfile.TestHFileBlockCompatibility
Tests run: 10, Failures: 0, Errors: 0, Skipped: 0, Time elapsed: 1.013 sec
Forking command line: /bin/sh -c cd /x1/jenkins/jenkins-slave/workspace/HBase-0.94/trunk &&
/x1/jenkins/tools/java/jdk1.6.0_27-32/jre/bin/java -enableassertions -Xmx1900m -Djava.security.egd=file:/dev/./urandom
-jar /x1/jenkins/jenkins-slave/workspace/HBase-0.94/trunk/target/surefire/surefirebooter1684176263656125343.jar
/x1/jenkins/jenkins-slave/workspace/HBase-0.94/trunk/target/surefire/surefire1076575732858364688tmp
/x1/jenkins/jenkins-slave/workspace/HBase-0.94/trunk/target/surefire/surefire_966966741085530390522tmp
Running org.apache.hadoop.hbase.io.hfile.TestCacheOnWrite
Tests run: 36, Failures: 0, Errors: 0, Skipped: 0, Time elapsed: 25.324 sec
Forking command line: /bin/sh -c cd /x1/jenkins/jenkins-slave/workspace/HBase-0.94/trunk &&
/x1/jenkins/tools/java/jdk1.6.0_27-32/jre/bin/java -enableassertions -Xmx1900m -Djava.security.egd=file:/dev/./urandom
-jar /x1/jenkins/jenkins-slave/workspace/HBase-0.94/trunk/target/surefire/surefirebooter8415557715922693622.jar
/x1/jenkins/jenkins-slave/workspace/HBase-0.94/trunk/target/surefire/surefire2302591221513065778tmp
/x1/jenkins/jenkins-slave/workspace/HBase-0.94/trunk/target/surefire/surefire_975126542528079565830tmp
Running org.apache.hadoop.hbase.io.hfile.TestChecksum
Tests run: 3, Failures: 0, Errors: 0, Skipped: 0, Time elapsed: 0.667 sec
Forking command line: /bin/sh -c cd /x1/jenkins/jenkins-slave/workspace/HBase-0.94/trunk &&
/x1/jenkins/tools/java/jdk1.6.0_27-32/jre/bin/java -enableassertions -Xmx1900m -Djava.security.egd=file:/dev/./urandom
-jar /x1/jenkins/jenkins-slave/workspace/HBase-0.94/trunk/target/surefire/surefirebooter5502904295930555704.jar
/x1/jenkins/jenkins-slave/workspace/HBase-0.94/trunk/target/surefire/surefire5123020295523219603tmp
/x1/jenkins/jenkins-slave/workspace/HBase-0.94/trunk/target/surefire/surefire_982942924974571453126tmp
Running org.apache.hadoop.hbase.io.hfile.TestForceCacheImportantBlocks
Tests run: 4, Failures: 0, Errors: 0, Skipped: 0, Time elapsed: 35.521 sec
Forking command line: /bin/sh -c cd /x1/jenkins/jenkins-slave/workspace/HBase-0.94/trunk &&
/x1/jenkins/tools/java/jdk1.6.0_27-32/jre/bin/java -enableassertions -Xmx1900m -Djava.security.egd=file:/dev/./urandom
-jar /x1/jenkins/jenkins-slave/workspace/HBase-0.94/trunk/target/surefire/surefirebooter5415393045297017445.jar
/x1/jenkins/jenkins-slave/workspace/HBase-0.94/trunk/target/surefire/surefire4868698845668099703tmp
/x1/jenkins/jenkins-slave/workspace/HBase-0.94/trunk/target/surefire/surefire_995168625476792663093tmp
Running org.apache.hadoop.hbase.io.hfile.slab.TestSlabCache
Tests run: 7, Failures: 0, Errors: 0, Skipped: 0, Time elapsed: 12.579 sec
Forking command line: /bin/sh -c cd /x1/jenkins/jenkins-slave/workspace/HBase-0.94/trunk &&
/x1/jenkins/tools/java/jdk1.6.0_27-32/jre/bin/java -enableassertions -Xmx1900m -Djava.security.egd=file:/dev/./urandom
-jar /x1/jenkins/jenkins-slave/workspace/HBase-0.94/trunk/target/surefire/surefirebooter2922359632407708816.jar
/x1/jenkins/jenkins-slave/workspace/HBase-0.94/trunk/target/surefire/surefire3789072540864963799tmp
/x1/jenkins/jenkins-slave/workspace/HBase-0.94/trunk/target/surefire/surefire_1004576063339790038337tmp
Running org.apache.hadoop.hbase.io.hfile.slab.TestSingleSizeCache
Tests run: 5, Failures: 0, Errors: 0, Skipped: 0, Time elapsed: 18.685 sec
Forking command line: /bin/sh -c cd /x1/jenkins/jenkins-slave/workspace/HBase-0.94/trunk &&
/x1/jenkins/tools/java/jdk1.6.0_27-32/jre/bin/java -enableassertions -Xmx1900m -Djava.security.egd=file:/dev/./urandom
-jar /x1/jenkins/jenkins-slave/workspace/HBase-0.94/trunk/target/surefire/surefirebooter861779369350888052.jar
/x1/jenkins/jenkins-slave/workspace/HBase-0.94/trunk/target/surefire/surefire6871387395024758006tmp
/x1/jenkins/jenkins-slave/workspace/HBase-0.94/trunk/target/surefire/surefire_101259456382644772127tmp
Running org.apache.hadoop.hbase.io.hfile.TestHFileBlock
Tests run: 16, Failures: 0, Errors: 0, Skipped: 0, Time elapsed: 45.878 sec
Forking command line: /bin/sh -c cd /x1/jenkins/jenkins-slave/workspace/HBase-0.94/trunk &&
/x1/jenkins/tools/java/jdk1.6.0_27-32/jre/bin/java -enableassertions -Xmx1900m -Djava.security.egd=file:/dev/./urandom
-jar /x1/jenkins/jenkins-slave/workspace/HBase-0.94/trunk/target/surefire/surefirebooter4818292300060545760.jar
/x1/jenkins/jenkins-slave/workspace/HBase-0.94/trunk/target/surefire/surefire4528517493616923419tmp
/x1/jenkins/jenkins-slave/workspace/HBase-0.94/trunk/target/surefire/surefire_1028465109006223455051tmp
Running org.apache.hadoop.hbase.replication.TestReplicationZookeeper
Tests run: 1, Failures: 0, Errors: 0, Skipped: 0, Time elapsed: 0.639 sec
Forking command line: /bin/sh -c cd /x1/jenkins/jenkins-slave/workspace/HBase-0.94/trunk &&
/x1/jenkins/tools/java/jdk1.6.0_27-32/jre/bin/java -enableassertions -Xmx1900m -Djava.security.egd=file:/dev/./urandom
-jar /x1/jenkins/jenkins-slave/workspace/HBase-0.94/trunk/target/surefire/surefirebooter3151530405238596126.jar
/x1/jenkins/jenkins-slave/workspace/HBase-0.94/trunk/target/surefire/surefire382473563227176989tmp
/x1/jenkins/jenkins-slave/workspace/HBase-0.94/trunk/target/surefire/surefire_1031695685875979041604tmp
Running org.apache.hadoop.hbase.replication.regionserver.TestReplicationSink
Running org.apache.hadoop.hbase.io.encoding.TestLoadAndSwitchEncodeOnDisk
Tests run: 5, Failures: 0, Errors: 0, Skipped: 0, Time elapsed: 13.026 sec
Tests run: 1, Failures: 0, Errors: 0, Skipped: 0, Time elapsed: 27.295 sec
Forking command line: /bin/sh -c cd /x1/jenkins/jenkins-slave/workspace/HBase-0.94/trunk &&
/x1/jenkins/tools/java/jdk1.6.0_27-32/jre/bin/java -enableassertions -Xmx1900m -Djava.security.egd=file:/dev/./urandom
-jar /x1/jenkins/jenkins-slave/workspace/HBase-0.94/trunk/target/surefire/surefirebooter7136626665075522893.jar
/x1/jenkins/jenkins-slave/workspace/HBase-0.94/trunk/target/surefire/surefire599942349700043247tmp
/x1/jenkins/jenkins-slave/workspace/HBase-0.94/trunk/target/surefire/surefire_1043109790687271094603tmp
Forking command line: /bin/sh -c cd /x1/jenkins/jenkins-slave/workspace/HBase-0.94/trunk &&
/x1/jenkins/tools/java/jdk1.6.0_27-32/jre/bin/java -enableassertions -Xmx1900m -Djava.security.egd=file:/dev/./urandom
-jar /x1/jenkins/jenkins-slave/workspace/HBase-0.94/trunk/target/surefire/surefirebooter811595409542483662.jar
/x1/jenkins/jenkins-slave/workspace/HBase-0.94/trunk/target/surefire/surefire6478887070626393960tmp
/x1/jenkins/jenkins-slave/workspace/HBase-0.94/trunk/target/surefire/surefire_1056518016650274881908tmp
Running org.apache.hadoop.hbase.replication.regionserver.TestReplicationSourceManager
Tests run: 1, Failures: 0, Errors: 0, Skipped: 0, Time elapsed: 0.913 sec
Forking command line: /bin/sh -c cd /x1/jenkins/jenkins-slave/workspace/HBase-0.94/trunk &&
/x1/jenkins/tools/java/jdk1.6.0_27-32/jre/bin/java -enableassertions -Xmx1900m -Djava.security.egd=file:/dev/./urandom
-jar /x1/jenkins/jenkins-slave/workspace/HBase-0.94/trunk/target/surefire/surefirebooter1003977347770044270.jar
/x1/jenkins/jenkins-slave/workspace/HBase-0.94/trunk/target/surefire/surefire1861886450696710033tmp
/x1/jenkins/jenkins-slave/workspace/HBase-0.94/trunk/target/surefire/surefire_1065083233708328780128tmp
Running org.apache.hadoop.hbase.replication.TestReplicationSource
Tests run: 1, Failures: 0, Errors: 0, Skipped: 0, Time elapsed: 2.468 sec
Forking command line: /bin/sh -c cd /x1/jenkins/jenkins-slave/workspace/HBase-0.94/trunk &&
/x1/jenkins/tools/java/jdk1.6.0_27-32/jre/bin/java -enableassertions -Xmx1900m -Djava.security.egd=file:/dev/./urandom
-jar /x1/jenkins/jenkins-slave/workspace/HBase-0.94/trunk/target/surefire/surefirebooter1310079683306045936.jar
/x1/jenkins/jenkins-slave/workspace/HBase-0.94/trunk/target/surefire/surefire2481537599610761423tmp
/x1/jenkins/jenkins-slave/workspace/HBase-0.94/trunk/target/surefire/surefire_1076060650145750886156tmp
Running org.apache.hadoop.hbase.util.TestFSTableDescriptors
Tests run: 10, Failures: 0, Errors: 0, Skipped: 0, Time elapsed: 0.97 sec
Forking command line: /bin/sh -c cd /x1/jenkins/jenkins-slave/workspace/HBase-0.94/trunk &&
/x1/jenkins/tools/java/jdk1.6.0_27-32/jre/bin/java -enableassertions -Xmx1900m -Djava.security.egd=file:/dev/./urandom
-jar /x1/jenkins/jenkins-slave/workspace/HBase-0.94/trunk/target/surefire/surefirebooter6407364670633231353.jar
/x1/jenkins/jenkins-slave/workspace/HBase-0.94/trunk/target/surefire/surefire110612883066952498tmp
/x1/jenkins/jenkins-slave/workspace/HBase-0.94/trunk/target/surefire/surefire_1085142760517649041342tmp
Running org.apache.hadoop.hbase.replication.TestReplicationPeer
Tests run: 1, Failures: 0, Errors: 0, Skipped: 0, Time elapsed: 7.615 sec
Forking command line: /bin/sh -c cd /x1/jenkins/jenkins-slave/workspace/HBase-0.94/trunk &&
/x1/jenkins/tools/java/jdk1.6.0_27-32/jre/bin/java -enableassertions -Xmx1900m -Djava.security.egd=file:/dev/./urandom
-jar /x1/jenkins/jenkins-slave/workspace/HBase-0.94/trunk/target/surefire/surefirebooter4083295639160221898.jar
/x1/jenkins/jenkins-slave/workspace/HBase-0.94/trunk/target/surefire/surefire3652399337593586172tmp
/x1/jenkins/jenkins-slave/workspace/HBase-0.94/trunk/target/surefire/surefire_1092340083833667916883tmp
Running org.apache.hadoop.hbase.util.TestEnvironmentEdgeManager
Tests run: 2, Failures: 0, Errors: 0, Skipped: 0, Time elapsed: 0.44 sec
Forking command line: /bin/sh -c cd /x1/jenkins/jenkins-slave/workspace/HBase-0.94/trunk &&
/x1/jenkins/tools/java/jdk1.6.0_27-32/jre/bin/java -enableassertions -Xmx1900m -Djava.security.egd=file:/dev/./urandom
-jar /x1/jenkins/jenkins-slave/workspace/HBase-0.94/trunk/target/surefire/surefirebooter5165948228551428568.jar
/x1/jenkins/jenkins-slave/workspace/HBase-0.94/trunk/target/surefire/surefire5919510627605555217tmp
/x1/jenkins/jenkins-slave/workspace/HBase-0.94/trunk/target/surefire/surefire_110540072881032377171tmp
Running org.apache.hadoop.hbase.util.TestIdLock
Tests run: 1, Failures: 0, Errors: 0, Skipped: 0, Time elapsed: 15.411 sec
Forking command line: /bin/sh -c cd /x1/jenkins/jenkins-slave/workspace/HBase-0.94/trunk &&
/x1/jenkins/tools/java/jdk1.6.0_27-32/jre/bin/java -enableassertions -Xmx1900m -Djava.security.egd=file:/dev/./urandom
-jar /x1/jenkins/jenkins-slave/workspace/HBase-0.94/trunk/target/surefire/surefirebooter3713057124469812021.jar
/x1/jenkins/jenkins-slave/workspace/HBase-0.94/trunk/target/surefire/surefire5859177627646965545tmp
/x1/jenkins/jenkins-slave/workspace/HBase-0.94/trunk/target/surefire/surefire_1117050191605289138882tmp
Running org.apache.hadoop.hbase.util.TestMergeTable
Tests run: 1, Failures: 0, Errors: 0, Skipped: 0, Time elapsed: 23.24 sec
Forking command line: /bin/sh -c cd /x1/jenkins/jenkins-slave/workspace/HBase-0.94/trunk &&
/x1/jenkins/tools/java/jdk1.6.0_27-32/jre/bin/java -enableassertions -Xmx1900m -Djava.security.egd=file:/dev/./urandom
-jar /x1/jenkins/jenkins-slave/workspace/HBase-0.94/trunk/target/surefire/surefirebooter5396981598756627637.jar
/x1/jenkins/jenkins-slave/workspace/HBase-0.94/trunk/target/surefire/surefire5202750224292247277tmp
/x1/jenkins/jenkins-slave/workspace/HBase-0.94/trunk/target/surefire/surefire_1122905423850122299521tmp
Running org.apache.hadoop.hbase.util.TestFSUtils
Tests run: 3, Failures: 1, Errors: 0, Skipped: 0, Time elapsed: 14.292 sec <<< FAILURE!
Forking command line: /bin/sh -c cd /x1/jenkins/jenkins-slave/workspace/HBase-0.94/trunk &&
/x1/jenkins/tools/java/jdk1.6.0_27-32/jre/bin/java -enableassertions -Xmx1900m -Djava.security.egd=file:/dev/./urandom
-jar /x1/jenkins/jenkins-slave/workspace/HBase-0.94/trunk/target/surefire/surefirebooter6555226879936765036.jar
/x1/jenkins/jenkins-slave/workspace/HBase-0.94/trunk/target/surefire/surefire3015053231985448987tmp
/x1/jenkins/jenkins-slave/workspace/HBase-0.94/trunk/target/surefire/surefire_1137929437672226908844tmp
Running org.apache.hadoop.hbase.util.TestPoolMap$TestRoundRobinPoolType
Tests run: 3, Failures: 0, Errors: 0, Skipped: 0, Time elapsed: 0.01 sec
Running org.apache.hadoop.hbase.util.TestPoolMap$TestThreadLocalPoolType
Tests run: 3, Failures: 0, Errors: 0, Skipped: 0, Time elapsed: 0.005 sec
Running org.apache.hadoop.hbase.util.TestPoolMap$TestReusablePoolType
Tests run: 3, Failures: 0, Errors: 0, Skipped: 0, Time elapsed: 0.031 sec
Forking command line: /bin/sh -c cd /x1/jenkins/jenkins-slave/workspace/HBase-0.94/trunk &&
/x1/jenkins/tools/java/jdk1.6.0_27-32/jre/bin/java -enableassertions -Xmx1900m -Djava.security.egd=file:/dev/./urandom
-jar /x1/jenkins/jenkins-slave/workspace/HBase-0.94/trunk/target/surefire/surefirebooter1120845606826590759.jar
/x1/jenkins/jenkins-slave/workspace/HBase-0.94/trunk/target/surefire/surefire131659434642234536tmp
/x1/jenkins/jenkins-slave/workspace/HBase-0.94/trunk/target/surefire/surefire_1142931566834375243246tmp
Running org.apache.hadoop.hbase.util.TestRegionSplitter
Tests run: 5, Failures: 0, Errors: 0, Skipped: 0, Time elapsed: 24.395 sec
Forking command line: /bin/sh -c cd /x1/jenkins/jenkins-slave/workspace/HBase-0.94/trunk &&
/x1/jenkins/tools/java/jdk1.6.0_27-32/jre/bin/java -enableassertions -Xmx1900m -Djava.security.egd=file:/dev/./urandom
-jar /x1/jenkins/jenkins-slave/workspace/HBase-0.94/trunk/target/surefire/surefirebooter4319380712150199023.jar
/x1/jenkins/jenkins-slave/workspace/HBase-0.94/trunk/target/surefire/surefire7240845862873850042tmp
/x1/jenkins/jenkins-slave/workspace/HBase-0.94/trunk/target/surefire/surefire_1155725477353816446783tmp
Running org.apache.hadoop.hbase.util.hbck.TestOfflineMetaRebuildBase
Tests run: 1, Failures: 0, Errors: 0, Skipped: 0, Time elapsed: 19.64 sec
Forking command line: /bin/sh -c cd /x1/jenkins/jenkins-slave/workspace/HBase-0.94/trunk &&
/x1/jenkins/tools/java/jdk1.6.0_27-32/jre/bin/java -enableassertions -Xmx1900m -Djava.security.egd=file:/dev/./urandom
-jar /x1/jenkins/jenkins-slave/workspace/HBase-0.94/trunk/target/surefire/surefirebooter1505661208221726608.jar
/x1/jenkins/jenkins-slave/workspace/HBase-0.94/trunk/target/surefire/surefire1922181202956687594tmp
/x1/jenkins/jenkins-slave/workspace/HBase-0.94/trunk/target/surefire/surefire_1165294935249253475551tmp
Running org.apache.hadoop.hbase.util.hbck.TestOfflineMetaRebuildOverlap
Tests run: 1, Failures: 0, Errors: 0, Skipped: 0, Time elapsed: 18.635 sec
Forking command line: /bin/sh -c cd /x1/jenkins/jenkins-slave/workspace/HBase-0.94/trunk &&
/x1/jenkins/tools/java/jdk1.6.0_27-32/jre/bin/java -enableassertions -Xmx1900m -Djava.security.egd=file:/dev/./urandom
-jar /x1/jenkins/jenkins-slave/workspace/HBase-0.94/trunk/target/surefire/surefirebooter2906906628316523663.jar
/x1/jenkins/jenkins-slave/workspace/HBase-0.94/trunk/target/surefire/surefire6043558521935907400tmp
/x1/jenkins/jenkins-slave/workspace/HBase-0.94/trunk/target/surefire/surefire_1172430281616161416195tmp
Running org.apache.hadoop.hbase.util.hbck.TestOfflineMetaRebuildHole
Tests run: 1, Failures: 0, Errors: 0, Skipped: 0, Time elapsed: 17.776 sec
Forking command line: /bin/sh -c cd /x1/jenkins/jenkins-slave/workspace/HBase-0.94/trunk &&
/x1/jenkins/tools/java/jdk1.6.0_27-32/jre/bin/java -enableassertions -Xmx1900m -Djava.security.egd=file:/dev/./urandom
-jar /x1/jenkins/jenkins-slave/workspace/HBase-0.94/trunk/target/surefire/surefirebooter4649200952805782332.jar
/x1/jenkins/jenkins-slave/workspace/HBase-0.94/trunk/target/surefire/surefire3402559220330770442tmp
/x1/jenkins/jenkins-slave/workspace/HBase-0.94/trunk/target/surefire/surefire_1188651629834755350994tmp
Running org.apache.hadoop.hbase.util.TestDefaultEnvironmentEdge
Tests run: 1, Failures: 0, Errors: 0, Skipped: 0, Time elapsed: 0.153 sec
Forking command line: /bin/sh -c cd /x1/jenkins/jenkins-slave/workspace/HBase-0.94/trunk &&
/x1/jenkins/tools/java/jdk1.6.0_27-32/jre/bin/java -enableassertions -Xmx1900m -Djava.security.egd=file:/dev/./urandom
-jar /x1/jenkins/jenkins-slave/workspace/HBase-0.94/trunk/target/surefire/surefirebooter482741521164763802.jar
/x1/jenkins/jenkins-slave/workspace/HBase-0.94/trunk/target/surefire/surefire150737068576105630tmp
/x1/jenkins/jenkins-slave/workspace/HBase-0.94/trunk/target/surefire/surefire_1198818582758675100110tmp
Running org.apache.hadoop.hbase.TestInfoServers
Tests run: 2, Failures: 0, Errors: 0, Skipped: 0, Time elapsed: 10.675 sec
Running org.apache.hadoop.hbase.util.TestHBaseFsck
Tests run: 16, Failures: 0, Errors: 0, Skipped: 0, Time elapsed: 170.85 sec

Results :

Failed tests:   testcomputeHDFSBlocksDistribution(org.apache.hadoop.hbase.util.TestFSUtils)

Tests run: 622, Failures: 1, Errors: 0, Skipped: 2

[INFO] ------------------------------------------------------------------------
[INFO] BUILD FAILURE
[INFO] ------------------------------------------------------------------------
[INFO] Total time: 25:14.022s
[INFO] Finished at: Fri Apr 13 04:23:51 UTC 2012
[INFO] Final Memory: 51M/845M
[INFO] ------------------------------------------------------------------------
[ERROR] Failed to execute goal org.apache.maven.plugins:maven-surefire-plugin:2.12-TRUNK-HBASE-2:test
(secondPartTestsExecution) on project hbase: There are test failures.
[ERROR] 
[ERROR] Please refer to /x1/jenkins/jenkins-slave/workspace/HBase-0.94/trunk/target/surefire-reports
for the individual test results.
[ERROR] -> [Help 1]
org.apache.maven.lifecycle.LifecycleExecutionException: Failed to execute goal org.apache.maven.plugins:maven-surefire-plugin:2.12-TRUNK-HBASE-2:test
(secondPartTestsExecution) on project hbase: There are test failures.

Please refer to /x1/jenkins/jenkins-slave/workspace/HBase-0.94/trunk/target/surefire-reports
for the individual test results.
	at org.apache.maven.lifecycle.internal.MojoExecutor.execute(MojoExecutor.java:213)
	at org.apache.maven.lifecycle.internal.MojoExecutor.execute(MojoExecutor.java:153)
	at org.apache.maven.lifecycle.internal.MojoExecutor.execute(MojoExecutor.java:145)
	at org.apache.maven.lifecycle.internal.LifecycleModuleBuilder.buildProject(LifecycleModuleBuilder.java:84)
	at org.apache.maven.lifecycle.internal.LifecycleModuleBuilder.buildProject(LifecycleModuleBuilder.java:59)
	at org.apache.maven.lifecycle.internal.LifecycleStarter.singleThreadedBuild(LifecycleStarter.java:183)
	at org.apache.maven.lifecycle.internal.LifecycleStarter.execute(LifecycleStarter.java:161)
	at org.apache.maven.DefaultMaven.doExecute(DefaultMaven.java:319)
	at org.apache.maven.DefaultMaven.execute(DefaultMaven.java:156)
	at org.apache.maven.cli.MavenCli.execute(MavenCli.java:537)
	at org.apache.maven.cli.MavenCli.doMain(MavenCli.java:196)
	at org.apache.maven.cli.MavenCli.main(MavenCli.java:141)
	at sun.reflect.NativeMethodAccessorImpl.invoke0(Native Method)
	at sun.reflect.NativeMethodAccessorImpl.invoke(NativeMethodAccessorImpl.java:39)
	at sun.reflect.DelegatingMethodAccessorImpl.invoke(DelegatingMethodAccessorImpl.java:25)
	at java.lang.reflect.Method.invoke(Method.java:597)
	at org.codehaus.plexus.classworlds.launcher.Launcher.launchEnhanced(Launcher.java:290)
	at org.codehaus.plexus.classworlds.launcher.Launcher.launch(Launcher.java:230)
	at org.codehaus.plexus.classworlds.launcher.Launcher.mainWithExitCode(Launcher.java:409)
	at org.codehaus.plexus.classworlds.launcher.Launcher.main(Launcher.java:352)
Caused by: org.apache.maven.plugin.MojoFailureException: There are test failures.

Please refer to /x1/jenkins/jenkins-slave/workspace/HBase-0.94/trunk/target/surefire-reports
for the individual test results.
	at org.apache.maven.plugin.surefire.SurefireHelper.reportExecution(SurefireHelper.java:87)
	at org.apache.maven.plugin.surefire.SurefirePlugin.writeSummary(SurefirePlugin.java:651)
	at org.apache.maven.plugin.surefire.SurefirePlugin.handleSummary(SurefirePlugin.java:625)
	at org.apache.maven.plugin.surefire.AbstractSurefireMojo.executeAfterPreconditionsChecked(AbstractSurefireMojo.java:137)
	at org.apache.maven.plugin.surefire.AbstractSurefireMojo.execute(AbstractSurefireMojo.java:98)
	at org.apache.maven.plugin.DefaultBuildPluginManager.executeMojo(DefaultBuildPluginManager.java:101)
	at org.apache.maven.lifecycle.internal.MojoExecutor.execute(MojoExecutor.java:209)
	... 19 more
[ERROR] 
[ERROR] 
[ERROR] For more information about the errors and possible solutions, please read the following
articles:
[ERROR] [Help 1] http://cwiki.apache.org/confluence/display/MAVEN/MojoFailureException
Build step 'Invoke top-level Maven targets' marked build as failure
Archiving artifacts
Recording test results

Mime
View raw message