hbase-dev mailing list archives

Site index · List index
Message view « Date » · « Thread »
Top « Date » · « Thread »
From Apache Jenkins Server <jenk...@builds.apache.org>
Subject Build failed in Jenkins: HBase-0.92 #357
Date Fri, 06 Apr 2012 00:09:58 GMT
See <https://builds.apache.org/job/HBase-0.92/357/changes>

Changes:

[stack] HBASE-5711 Tests are failing with incorrect data directory permissions -- REVERT

------------------------------------------
[...truncated 6119 lines...]
[DEBUG] properties used {java.vendor=Sun Microsystems Inc., commons-cli.version=1.2, jetty.jspapi.version=6.1.14,
env.JENKINS_SERVER_COOKIE=7c50f1f72c06532d13df55278c5aeb60, sun.java.launcher=SUN_STANDARD,
sun.management.compiler=HotSpot Tiered Compilers, commons-codec.version=1.4, os.name=Linux,
sun.boot.class.path=/home/jenkins/tools/java/jdk1.6.0_27-32/jre/lib/resources.jar:/home/jenkins/tools/java/jdk1.6.0_27-32/jre/lib/rt.jar:/home/jenkins/tools/java/jdk1.6.0_27-32/jre/lib/sunrsasign.jar:/home/jenkins/tools/java/jdk1.6.0_27-32/jre/lib/jsse.jar:/home/jenkins/tools/java/jdk1.6.0_27-32/jre/lib/jce.jar:/home/jenkins/tools/java/jdk1.6.0_27-32/jre/lib/charsets.jar:/home/jenkins/tools/java/jdk1.6.0_27-32/jre/lib/modules/jdk.boot.jar:/home/jenkins/tools/java/jdk1.6.0_27-32/jre/classes,
package.pid.dir=/var/run/hbase, env.PWD=<https://builds.apache.org/job/HBase-0.92/ws/trunk,>
mockito-all.version=1.8.5, java.vm.specification.vendor=Sun Microsystems Inc., java.runtime.version=1.6.0_27-b07,
myThreadCount=1, project.build.sourceEncoding=UTF-8, commons-httpclient.version=3.1, user.name=jenkins,
env._=/usr/bin/java, env.USER=jenkins, env.SHELL=/bin/bash, myParallelMode=none, sourceReleaseAssemblyDescriptor=source-release,
env.NLSPATH=/usr/dt/lib/nls/msg/%L/%N.cat, package.log.dir=/var/log/hbase, env.PATH=/home/hudson/tools/java/latest1.6/bin:/usr/local/bin:/usr/bin:/bin:/usr/bin/X11:/usr/games,
user.language=en, sun.boot.library.path=/home/jenkins/tools/java/jdk1.6.0_27-32/jre/lib/i386,
thrift.version=0.7.0, classworlds.conf=/home/hudson/tools/maven/latest3/bin/m2.conf, env.SSH_CONNECTION=140.211.11.8
59481 67.195.138.60 22, java.version=1.6.0_27, package.conf.dir=/etc/hbase, env.SSH_CLIENT=140.211.11.8
59481 22, commons-math.version=2.1, user.timezone=Etc/UTC, env.NODE_NAME=ubuntu4, organization.logo=http://www.apache.org/images/asf_logo_wide.gif,
sun.arch.data.model=32, compileSource=1.6, java.endorsed.dirs=/home/jenkins/tools/java/jdk1.6.0_27-32/jre/lib/endorsed,
commons-lang.version=2.5, sun.cpu.isalist=, sun.jnu.encoding=ANSI_X3.4-1968, file.encoding.pkg=sun.io,
env.SHLVL=1, file.separator=/, env.SVN_REVISION=1310107, java.specification.name=Java Platform
API Specification, java.class.version=50.0, user.country=US, env.BUILD_NUMBER=357, java.home=/home/jenkins/tools/java/jdk1.6.0_27-32/jre,
java.vm.info=mixed mode, env.LOGNAME=jenkins, os.version=2.6.32-33-server, maven.test.redirectTestOutputToFile=true,
env.HUDSON_COOKIE=9f060697-53fa-4ebb-99f1-22b772d668d7, hadoop.version=1.0.0, path.separator=:,
java.vm.version=20.2-b06, package.version=0.91.0, package.prefix=/usr, env.JOB_NAME=HBase-0.92,
env.JAVA_HOME=/home/hudson/tools/java/latest1.6, java.awt.printerjob=sun.print.PSPrinterJob,
commons-configuration.version=1.6, integrationtest.include=**/IntegrationTest*.java, sun.io.unicode.encoding=UnicodeLittle,
jaxb-api.version=2.1, unittest.include=**/Test*.java, env.HUDSON_URL=https://builds.apache.org/,
env.BUILD_TAG=jenkins-HBase-0.92-357, user.home=/home/jenkins, jersey.version=1.4, env.JENKINS_HOME=/home/hudson/hudson,
env.JOB_URL=https://builds.apache.org/job/HBase-0.92/, env.OLDPWD=/home/jenkins, protobuf.version=2.4.0a,
myForkMode=always, guava.version=r09, java.specification.vendor=Sun Microsystems Inc., jruby.version=1.6.5,
env.M2_HOME=/home/hudson/tools/maven/latest3, java.library.path=/home/jenkins/tools/java/jdk1.6.0_27-32/jre/lib/i386/server:/home/jenkins/tools/java/jdk1.6.0_27-32/jre/lib/i386:/home/jenkins/tools/java/jdk1.6.0_27-32/jre/../lib/i386:/usr/lib/jvm/java-6-openjdk/jre/lib/amd64/server:/usr/lib/jvm/java-6-openjdk/jre/lib/amd64:/usr/lib/jvm/java-6-openjdk/jre/../lib/amd64:/usr/java/packages/lib/i386:/lib:/usr/lib,
java.vendor.url=http://java.sun.com/, distMgmtSnapshotsName=Apache Development Snapshot Repository,
env.HUDSON_HOME=/home/hudson/hudson, env.HUDSON_SERVER_COOKIE=7c50f1f72c06532d13df55278c5aeb60,
java.vm.vendor=Sun Microsystems Inc., test.exclude=, maven.home=/home/hudson/tools/maven/latest3,
java.runtime.name=Java(TM) SE Runtime Environment, package.release=1, sun.java.command=org.codehaus.plexus.classworlds.launcher.Launcher
-e -X clean -Dmaven.test.redirectTestOutputToFile=true site install assembly:single -Prelease,
java.class.path=/home/hudson/tools/maven/latest3/boot/plexus-classworlds-2.4.jar, env.EXECUTOR_NUMBER=1,
env.MAVEN_TERMINATE_CMD=on, jetty.version=6.1.26, build.platform=Linux-i386-32, test.exclude.pattern=**/.java,
jasper.version=5.5.23, env.XFILESEARCHPATH=/usr/dt/app-defaults/%L/Dt, slf4j.version=1.5.8,
java.vm.specification.name=Java Virtual Machine Specification, java.vm.specification.version=1.0,
sun.cpu.endian=little, sun.os.patch.level=unknown, env.HOME=/home/jenkins, env.BUILD_URL=https://builds.apache.org/job/HBase-0.92/357/,
java.io.tmpdir=/tmp, env.LD_LIBRARY_PATH=/home/jenkins/tools/java/jdk1.6.0_27-32/jre/lib/i386/server:/home/jenkins/tools/java/jdk1.6.0_27-32/jre/lib/i386:/home/jenkins/tools/java/jdk1.6.0_27-32/jre/../lib/i386:/usr/lib/jvm/java-6-openjdk/jre/lib/amd64/server:/usr/lib/jvm/java-6-openjdk/jre/lib/amd64:/usr/lib/jvm/java-6-openjdk/jre/../lib/amd64,
java.vendor.url.bug=http://java.sun.com/cgi-bin/bugreport.cgi, distMgmtSnapshotsUrl=https://repository.apache.org/content/repositories/snapshots,
env.MAVEN_OPTS=-Xmx3G, commons-logging.version=1.1.1, os.arch=i386, java.awt.graphicsenv=sun.awt.X11GraphicsEnvironment,
java.ext.dirs=/home/jenkins/tools/java/jdk1.6.0_27-32/jre/lib/ext:/usr/java/packages/lib/ext,
env.MAVEN_HOME=/home/hudson/tools/maven/latest3, user.dir=<https://builds.apache.org/job/HBase-0.92/ws/trunk,>
env.BUILD_ID=2012-04-06_00-08-54, log4j.version=1.2.16, line.separator=
, env.JENKINS_URL=https://builds.apache.org/, java.vm.name=Java HotSpot(TM) Server VM, stax-api.version=1.0.1,
env.SVN_URL=https://svn.apache.org/repos/asf/hbase/branches/0.92, hadoop-snappy.version=0.0.1-SNAPSHOT,
jackson.version=1.5.5, file.encoding=ANSI_X3.4-1968, env.MAIL=/var/mail/jenkins, env.WORKSPACE=<https://builds.apache.org/job/HBase-0.92/ws/,>
avro.version=1.5.3, final.name=hbase-0.92.2-SNAPSHOT, zookeeper.version=3.4.3, java.specification.version=1.6,
junit.version=4.10, env.NODE_LABELS=Ubuntu hadoop10 ubuntu ubuntu4}
[INFO] Using 'UTF-8' encoding to copy filtered resources.
[DEBUG] resource with targetPath null
directory <https://builds.apache.org/job/HBase-0.92/ws/trunk/src/test/resources>
excludes [hbase-site.xml]
includes []
[INFO] Copying 4 resources
[DEBUG] file log4j.properties has a filtered file extension
[DEBUG] copy <https://builds.apache.org/job/HBase-0.92/ws/trunk/src/test/resources/log4j.properties>
to <https://builds.apache.org/job/HBase-0.92/ws/trunk/target/test-classes/log4j.properties>
[DEBUG] file mapred-queues.xml has a filtered file extension
[DEBUG] copy <https://builds.apache.org/job/HBase-0.92/ws/trunk/src/test/resources/mapred-queues.xml>
to <https://builds.apache.org/job/HBase-0.92/ws/trunk/target/test-classes/mapred-queues.xml>
[DEBUG] file PerformanceEvaluation_Counter.properties has a filtered file extension
[DEBUG] copy <https://builds.apache.org/job/HBase-0.92/ws/trunk/src/test/resources/org/apache/hadoop/hbase/PerformanceEvaluation_Counter.properties>
to <https://builds.apache.org/job/HBase-0.92/ws/trunk/target/test-classes/org/apache/hadoop/hbase/PerformanceEvaluation_Counter.properties>
[DEBUG] file 8e8ab58dcf39412da19833fcd8f687ac has a filtered file extension
[DEBUG] copy <https://builds.apache.org/job/HBase-0.92/ws/trunk/src/test/resources/org/apache/hadoop/hbase/io/hfile/8e8ab58dcf39412da19833fcd8f687ac>
to <https://builds.apache.org/job/HBase-0.92/ws/trunk/target/test-classes/org/apache/hadoop/hbase/io/hfile/8e8ab58dcf39412da19833fcd8f687ac>
[DEBUG] resource with targetPath null
directory <https://builds.apache.org/job/HBase-0.92/ws/trunk/target/maven-shared-archive-resources>
excludes []
includes []
[INFO] Copying 3 resources
[DEBUG] file NOTICE has a filtered file extension
[DEBUG] copy <https://builds.apache.org/job/HBase-0.92/ws/trunk/target/maven-shared-archive-resources/META-INF/NOTICE>
to <https://builds.apache.org/job/HBase-0.92/ws/trunk/target/test-classes/META-INF/NOTICE>
[DEBUG] file DEPENDENCIES has a filtered file extension
[DEBUG] copy <https://builds.apache.org/job/HBase-0.92/ws/trunk/target/maven-shared-archive-resources/META-INF/DEPENDENCIES>
to <https://builds.apache.org/job/HBase-0.92/ws/trunk/target/test-classes/META-INF/DEPENDENCIES>
[DEBUG] file LICENSE has a filtered file extension
[DEBUG] copy <https://builds.apache.org/job/HBase-0.92/ws/trunk/target/maven-shared-archive-resources/META-INF/LICENSE>
to <https://builds.apache.org/job/HBase-0.92/ws/trunk/target/test-classes/META-INF/LICENSE>
[DEBUG] resource with targetPath null
directory <https://builds.apache.org/job/HBase-0.92/ws/trunk/src/test/resources>
excludes []
includes [hbase-site.xml]
[INFO] Copying 1 resource
[DEBUG] file hbase-site.xml has a filtered file extension
[DEBUG] copy <https://builds.apache.org/job/HBase-0.92/ws/trunk/src/test/resources/hbase-site.xml>
to <https://builds.apache.org/job/HBase-0.92/ws/trunk/target/test-classes/hbase-site.xml>
[INFO] 
[INFO] --- maven-compiler-plugin:2.0.2:testCompile (default-testCompile) @ hbase ---
[DEBUG] Configuring mojo org.apache.maven.plugins:maven-compiler-plugin:2.0.2:testCompile
from plugin realm ClassRealm[plugin>org.apache.maven.plugins:maven-compiler-plugin:2.0.2,
parent: sun.misc.Launcher$AppClassLoader@192d342]
[DEBUG] Configuring mojo 'org.apache.maven.plugins:maven-compiler-plugin:2.0.2:testCompile'
with basic configurator -->
[DEBUG]   (f) basedir = <https://builds.apache.org/job/HBase-0.92/ws/trunk>
[DEBUG]   (f) buildDirectory = <https://builds.apache.org/job/HBase-0.92/ws/trunk/target>
[DEBUG]   (f) classpathElements = [<https://builds.apache.org/job/HBase-0.92/ws/trunk/target/test-classes,>
<https://builds.apache.org/job/HBase-0.92/ws/trunk/target/classes,> /home/jenkins/.m2/repository/com/google/guava/guava/r09/guava-r09.jar,
/home/jenkins/.m2/repository/commons-cli/commons-cli/1.2/commons-cli-1.2.jar, /home/jenkins/.m2/repository/commons-configuration/commons-configuration/1.6/commons-configuration-1.6.jar,
/home/jenkins/.m2/repository/commons-collections/commons-collections/3.2.1/commons-collections-3.2.1.jar,
/home/jenkins/.m2/repository/commons-digester/commons-digester/1.8/commons-digester-1.8.jar,
/home/jenkins/.m2/repository/commons-beanutils/commons-beanutils/1.7.0/commons-beanutils-1.7.0.jar,
/home/jenkins/.m2/repository/commons-beanutils/commons-beanutils-core/1.8.0/commons-beanutils-core-1.8.0.jar,
/home/jenkins/.m2/repository/com/github/stephenc/high-scale-lib/high-scale-lib/1.1.1/high-scale-lib-1.1.1.jar,
/home/jenkins/.m2/repository/commons-codec/commons-codec/1.4/commons-codec-1.4.jar, /home/jenkins/.m2/repository/commons-httpclient/commons-httpclient/3.1/commons-httpclient-3.1.jar,
/home/jenkins/.m2/repository/commons-lang/commons-lang/2.5/commons-lang-2.5.jar, /home/jenkins/.m2/repository/commons-logging/commons-logging/1.1.1/commons-logging-1.1.1.jar,
/home/jenkins/.m2/repository/log4j/log4j/1.2.16/log4j-1.2.16.jar, /home/jenkins/.m2/repository/org/apache/avro/avro/1.5.3/avro-1.5.3.jar,
/home/jenkins/.m2/repository/org/xerial/snappy/snappy-java/1.0.3.2/snappy-java-1.0.3.2.jar,
/home/jenkins/.m2/repository/org/apache/avro/avro-ipc/1.5.3/avro-ipc-1.5.3.jar, /home/jenkins/.m2/repository/org/jboss/netty/netty/3.2.4.Final/netty-3.2.4.Final.jar,
/home/jenkins/.m2/repository/org/apache/velocity/velocity/1.7/velocity-1.7.jar, /home/jenkins/.m2/repository/org/apache/zookeeper/zookeeper/3.4.3/zookeeper-3.4.3.jar,
/home/jenkins/.m2/repository/org/apache/thrift/libthrift/0.7.0/libthrift-0.7.0.jar, /home/jenkins/.m2/repository/javax/servlet/servlet-api/2.5/servlet-api-2.5.jar,
/home/jenkins/.m2/repository/org/apache/httpcomponents/httpclient/4.0.1/httpclient-4.0.1.jar,
/home/jenkins/.m2/repository/org/apache/httpcomponents/httpcore/4.0.1/httpcore-4.0.1.jar,
/home/jenkins/.m2/repository/org/jruby/jruby-complete/1.6.5/jruby-complete-1.6.5.jar, /home/jenkins/.m2/repository/org/mortbay/jetty/jetty/6.1.26/jetty-6.1.26.jar,
/home/jenkins/.m2/repository/org/mortbay/jetty/jetty-util/6.1.26/jetty-util-6.1.26.jar, /home/jenkins/.m2/repository/org/mortbay/jetty/jsp-2.1/6.1.14/jsp-2.1-6.1.14.jar,
/home/jenkins/.m2/repository/org/eclipse/jdt/core/3.1.1/core-3.1.1.jar, /home/jenkins/.m2/repository/org/mortbay/jetty/jsp-api-2.1/6.1.14/jsp-api-2.1-6.1.14.jar,
/home/jenkins/.m2/repository/org/mortbay/jetty/servlet-api-2.5/6.1.14/servlet-api-2.5-6.1.14.jar,
/home/jenkins/.m2/repository/org/codehaus/jackson/jackson-core-asl/1.5.5/jackson-core-asl-1.5.5.jar,
/home/jenkins/.m2/repository/org/codehaus/jackson/jackson-mapper-asl/1.5.5/jackson-mapper-asl-1.5.5.jar,
/home/jenkins/.m2/repository/org/codehaus/jackson/jackson-jaxrs/1.5.5/jackson-jaxrs-1.5.5.jar,
/home/jenkins/.m2/repository/org/codehaus/jackson/jackson-xc/1.5.5/jackson-xc-1.5.5.jar, /home/jenkins/.m2/repository/org/slf4j/slf4j-api/1.5.8/slf4j-api-1.5.8.jar,
/home/jenkins/.m2/repository/org/slf4j/slf4j-log4j12/1.5.8/slf4j-log4j12-1.5.8.jar, /home/jenkins/.m2/repository/tomcat/jasper-compiler/5.5.23/jasper-compiler-5.5.23.jar,
/home/jenkins/.m2/repository/tomcat/jasper-runtime/5.5.23/jasper-runtime-5.5.23.jar, /home/jenkins/.m2/repository/commons-el/commons-el/1.0/commons-el-1.0.jar,
/home/jenkins/.m2/repository/org/jamon/jamon-runtime/2.3.1/jamon-runtime-2.3.1.jar, /home/jenkins/.m2/repository/com/google/protobuf/protobuf-java/2.4.0a/protobuf-java-2.4.0a.jar,
/home/jenkins/.m2/repository/com/sun/jersey/jersey-core/1.4/jersey-core-1.4.jar, /home/jenkins/.m2/repository/com/sun/jersey/jersey-json/1.4/jersey-json-1.4.jar,
/home/jenkins/.m2/repository/org/codehaus/jettison/jettison/1.1/jettison-1.1.jar, /home/jenkins/.m2/repository/com/sun/xml/bind/jaxb-impl/2.1.12/jaxb-impl-2.1.12.jar,
/home/jenkins/.m2/repository/com/sun/jersey/jersey-server/1.4/jersey-server-1.4.jar, /home/jenkins/.m2/repository/asm/asm/3.1/asm-3.1.jar,
/home/jenkins/.m2/repository/javax/xml/bind/jaxb-api/2.1/jaxb-api-2.1.jar, /home/jenkins/.m2/repository/javax/activation/activation/1.1/activation-1.1.jar,
/home/jenkins/.m2/repository/stax/stax-api/1.0.1/stax-api-1.0.1.jar, /home/jenkins/.m2/repository/junit/junit/4.10/junit-4.10.jar,
/home/jenkins/.m2/repository/org/hamcrest/hamcrest-core/1.1/hamcrest-core-1.1.jar, /home/jenkins/.m2/repository/org/mockito/mockito-all/1.8.5/mockito-all-1.8.5.jar,
/home/jenkins/.m2/repository/org/apache/commons/commons-math/2.1/commons-math-2.1.jar, /home/jenkins/.m2/repository/org/apache/hadoop/hadoop-core/1.0.0/hadoop-core-1.0.0.jar,
/home/jenkins/.m2/repository/xmlenc/xmlenc/0.52/xmlenc-0.52.jar, /home/jenkins/.m2/repository/commons-net/commons-net/1.4.1/commons-net-1.4.1.jar,
/home/jenkins/.m2/repository/org/apache/hadoop/hadoop-test/1.0.0/hadoop-test-1.0.0.jar, /home/jenkins/.m2/repository/org/apache/ftpserver/ftplet-api/1.0.0/ftplet-api-1.0.0.jar,
/home/jenkins/.m2/repository/org/apache/mina/mina-core/2.0.0-M5/mina-core-2.0.0-M5.jar, /home/jenkins/.m2/repository/org/apache/ftpserver/ftpserver-core/1.0.0/ftpserver-core-1.0.0.jar,
/home/jenkins/.m2/repository/org/apache/ftpserver/ftpserver-deprecated/1.0.0-M2/ftpserver-deprecated-1.0.0-M2.jar]
[DEBUG]   (f) compileSourceRoots = [<https://builds.apache.org/job/HBase-0.92/ws/trunk/src/test/java]>
[DEBUG]   (f) compilerId = javac
[DEBUG]   (f) debug = true
[DEBUG]   (f) encoding = UTF-8
[DEBUG]   (f) failOnError = true
[DEBUG]   (f) fork = false
[DEBUG]   (f) optimize = false
[DEBUG]   (f) outputDirectory = <https://builds.apache.org/job/HBase-0.92/ws/trunk/target/test-classes>
[DEBUG]   (f) outputFileName = hbase-0.92.2-SNAPSHOT
[DEBUG]   (f) showDeprecation = false
[DEBUG]   (f) showWarnings = true
[DEBUG]   (f) source = 1.6
[DEBUG]   (f) staleMillis = 0
[DEBUG]   (f) target = 1.6
[DEBUG]   (f) verbose = false
[DEBUG] -- end configuration --
[DEBUG] Using compiler 'javac'.
[DEBUG] Source directories: [<https://builds.apache.org/job/HBase-0.92/ws/trunk/src/test/java]>
[DEBUG] Classpath: [<https://builds.apache.org/job/HBase-0.92/ws/trunk/target/test-classes>
 <https://builds.apache.org/job/HBase-0.92/ws/trunk/target/classes>
 /home/jenkins/.m2/repository/com/google/guava/guava/r09/guava-r09.jar
 /home/jenkins/.m2/repository/commons-cli/commons-cli/1.2/commons-cli-1.2.jar
 /home/jenkins/.m2/repository/commons-configuration/commons-configuration/1.6/commons-configuration-1.6.jar
 /home/jenkins/.m2/repository/commons-collections/commons-collections/3.2.1/commons-collections-3.2.1.jar
 /home/jenkins/.m2/repository/commons-digester/commons-digester/1.8/commons-digester-1.8.jar
 /home/jenkins/.m2/repository/commons-beanutils/commons-beanutils/1.7.0/commons-beanutils-1.7.0.jar
 /home/jenkins/.m2/repository/commons-beanutils/commons-beanutils-core/1.8.0/commons-beanutils-core-1.8.0.jar
 /home/jenkins/.m2/repository/com/github/stephenc/high-scale-lib/high-scale-lib/1.1.1/high-scale-lib-1.1.1.jar
 /home/jenkins/.m2/repository/commons-codec/commons-codec/1.4/commons-codec-1.4.jar
 /home/jenkins/.m2/repository/commons-httpclient/commons-httpclient/3.1/commons-httpclient-3.1.jar
 /home/jenkins/.m2/repository/commons-lang/commons-lang/2.5/commons-lang-2.5.jar
 /home/jenkins/.m2/repository/commons-logging/commons-logging/1.1.1/commons-logging-1.1.1.jar
 /home/jenkins/.m2/repository/log4j/log4j/1.2.16/log4j-1.2.16.jar
 /home/jenkins/.m2/repository/org/apache/avro/avro/1.5.3/avro-1.5.3.jar
 /home/jenkins/.m2/repository/org/xerial/snappy/snappy-java/1.0.3.2/snappy-java-1.0.3.2.jar
 /home/jenkins/.m2/repository/org/apache/avro/avro-ipc/1.5.3/avro-ipc-1.5.3.jar
 /home/jenkins/.m2/repository/org/jboss/netty/netty/3.2.4.Final/netty-3.2.4.Final.jar
 /home/jenkins/.m2/repository/org/apache/velocity/velocity/1.7/velocity-1.7.jar
 /home/jenkins/.m2/repository/org/apache/zookeeper/zookeeper/3.4.3/zookeeper-3.4.3.jar
 /home/jenkins/.m2/repository/org/apache/thrift/libthrift/0.7.0/libthrift-0.7.0.jar
 /home/jenkins/.m2/repository/javax/servlet/servlet-api/2.5/servlet-api-2.5.jar
 /home/jenkins/.m2/repository/org/apache/httpcomponents/httpclient/4.0.1/httpclient-4.0.1.jar
 /home/jenkins/.m2/repository/org/apache/httpcomponents/httpcore/4.0.1/httpcore-4.0.1.jar
 /home/jenkins/.m2/repository/org/jruby/jruby-complete/1.6.5/jruby-complete-1.6.5.jar
 /home/jenkins/.m2/repository/org/mortbay/jetty/jetty/6.1.26/jetty-6.1.26.jar
 /home/jenkins/.m2/repository/org/mortbay/jetty/jetty-util/6.1.26/jetty-util-6.1.26.jar
 /home/jenkins/.m2/repository/org/mortbay/jetty/jsp-2.1/6.1.14/jsp-2.1-6.1.14.jar
 /home/jenkins/.m2/repository/org/eclipse/jdt/core/3.1.1/core-3.1.1.jar
 /home/jenkins/.m2/repository/org/mortbay/jetty/jsp-api-2.1/6.1.14/jsp-api-2.1-6.1.14.jar
 /home/jenkins/.m2/repository/org/mortbay/jetty/servlet-api-2.5/6.1.14/servlet-api-2.5-6.1.14.jar
 /home/jenkins/.m2/repository/org/codehaus/jackson/jackson-core-asl/1.5.5/jackson-core-asl-1.5.5.jar
 /home/jenkins/.m2/repository/org/codehaus/jackson/jackson-mapper-asl/1.5.5/jackson-mapper-asl-1.5.5.jar
 /home/jenkins/.m2/repository/org/codehaus/jackson/jackson-jaxrs/1.5.5/jackson-jaxrs-1.5.5.jar
 /home/jenkins/.m2/repository/org/codehaus/jackson/jackson-xc/1.5.5/jackson-xc-1.5.5.jar
 /home/jenkins/.m2/repository/org/slf4j/slf4j-api/1.5.8/slf4j-api-1.5.8.jar
 /home/jenkins/.m2/repository/org/slf4j/slf4j-log4j12/1.5.8/slf4j-log4j12-1.5.8.jar
 /home/jenkins/.m2/repository/tomcat/jasper-compiler/5.5.23/jasper-compiler-5.5.23.jar
 /home/jenkins/.m2/repository/tomcat/jasper-runtime/5.5.23/jasper-runtime-5.5.23.jar
 /home/jenkins/.m2/repository/commons-el/commons-el/1.0/commons-el-1.0.jar
 /home/jenkins/.m2/repository/org/jamon/jamon-runtime/2.3.1/jamon-runtime-2.3.1.jar
 /home/jenkins/.m2/repository/com/google/protobuf/protobuf-java/2.4.0a/protobuf-java-2.4.0a.jar
 /home/jenkins/.m2/repository/com/sun/jersey/jersey-core/1.4/jersey-core-1.4.jar
 /home/jenkins/.m2/repository/com/sun/jersey/jersey-json/1.4/jersey-json-1.4.jar
 /home/jenkins/.m2/repository/org/codehaus/jettison/jettison/1.1/jettison-1.1.jar
 /home/jenkins/.m2/repository/com/sun/xml/bind/jaxb-impl/2.1.12/jaxb-impl-2.1.12.jar
 /home/jenkins/.m2/repository/com/sun/jersey/jersey-server/1.4/jersey-server-1.4.jar
 /home/jenkins/.m2/repository/asm/asm/3.1/asm-3.1.jar
 /home/jenkins/.m2/repository/javax/xml/bind/jaxb-api/2.1/jaxb-api-2.1.jar
 /home/jenkins/.m2/repository/javax/activation/activation/1.1/activation-1.1.jar
 /home/jenkins/.m2/repository/stax/stax-api/1.0.1/stax-api-1.0.1.jar
 /home/jenkins/.m2/repository/junit/junit/4.10/junit-4.10.jar
 /home/jenkins/.m2/repository/org/hamcrest/hamcrest-core/1.1/hamcrest-core-1.1.jar
 /home/jenkins/.m2/repository/org/mockito/mockito-all/1.8.5/mockito-all-1.8.5.jar
 /home/jenkins/.m2/repository/org/apache/commons/commons-math/2.1/commons-math-2.1.jar
 /home/jenkins/.m2/repository/org/apache/hadoop/hadoop-core/1.0.0/hadoop-core-1.0.0.jar
 /home/jenkins/.m2/repository/xmlenc/xmlenc/0.52/xmlenc-0.52.jar
 /home/jenkins/.m2/repository/commons-net/commons-net/1.4.1/commons-net-1.4.1.jar
 /home/jenkins/.m2/repository/org/apache/hadoop/hadoop-test/1.0.0/hadoop-test-1.0.0.jar
 /home/jenkins/.m2/repository/org/apache/ftpserver/ftplet-api/1.0.0/ftplet-api-1.0.0.jar
 /home/jenkins/.m2/repository/org/apache/mina/mina-core/2.0.0-M5/mina-core-2.0.0-M5.jar
 /home/jenkins/.m2/repository/org/apache/ftpserver/ftpserver-core/1.0.0/ftpserver-core-1.0.0.jar
 /home/jenkins/.m2/repository/org/apache/ftpserver/ftpserver-deprecated/1.0.0-M2/ftpserver-deprecated-1.0.0-M2.jar]
[DEBUG] Output directory: <https://builds.apache.org/job/HBase-0.92/ws/trunk/target/test-classes>
[DEBUG] Classpath:
[DEBUG]  <https://builds.apache.org/job/HBase-0.92/ws/trunk/target/test-classes>
[DEBUG]  <https://builds.apache.org/job/HBase-0.92/ws/trunk/target/classes>
[DEBUG]  /home/jenkins/.m2/repository/com/google/guava/guava/r09/guava-r09.jar
[DEBUG]  /home/jenkins/.m2/repository/commons-cli/commons-cli/1.2/commons-cli-1.2.jar
[DEBUG]  /home/jenkins/.m2/repository/commons-configuration/commons-configuration/1.6/commons-configuration-1.6.jar
[DEBUG]  /home/jenkins/.m2/repository/commons-collections/commons-collections/3.2.1/commons-collections-3.2.1.jar
[DEBUG]  /home/jenkins/.m2/repository/commons-digester/commons-digester/1.8/commons-digester-1.8.jar
[DEBUG]  /home/jenkins/.m2/repository/commons-beanutils/commons-beanutils/1.7.0/commons-beanutils-1.7.0.jar
[DEBUG]  /home/jenkins/.m2/repository/commons-beanutils/commons-beanutils-core/1.8.0/commons-beanutils-core-1.8.0.jar
[DEBUG]  /home/jenkins/.m2/repository/com/github/stephenc/high-scale-lib/high-scale-lib/1.1.1/high-scale-lib-1.1.1.jar
[DEBUG]  /home/jenkins/.m2/repository/commons-codec/commons-codec/1.4/commons-codec-1.4.jar
[DEBUG]  /home/jenkins/.m2/repository/commons-httpclient/commons-httpclient/3.1/commons-httpclient-3.1.jar
[DEBUG]  /home/jenkins/.m2/repository/commons-lang/commons-lang/2.5/commons-lang-2.5.jar
[DEBUG]  /home/jenkins/.m2/repository/commons-logging/commons-logging/1.1.1/commons-logging-1.1.1.jar
[DEBUG]  /home/jenkins/.m2/repository/log4j/log4j/1.2.16/log4j-1.2.16.jar
[DEBUG]  /home/jenkins/.m2/repository/org/apache/avro/avro/1.5.3/avro-1.5.3.jar
[DEBUG]  /home/jenkins/.m2/repository/org/xerial/snappy/snappy-java/1.0.3.2/snappy-java-1.0.3.2.jar
[DEBUG]  /home/jenkins/.m2/repository/org/apache/avro/avro-ipc/1.5.3/avro-ipc-1.5.3.jar
[DEBUG]  /home/jenkins/.m2/repository/org/jboss/netty/netty/3.2.4.Final/netty-3.2.4.Final.jar
[DEBUG]  /home/jenkins/.m2/repository/org/apache/velocity/velocity/1.7/velocity-1.7.jar
[DEBUG]  /home/jenkins/.m2/repository/org/apache/zookeeper/zookeeper/3.4.3/zookeeper-3.4.3.jar
[DEBUG]  /home/jenkins/.m2/repository/org/apache/thrift/libthrift/0.7.0/libthrift-0.7.0.jar
[DEBUG]  /home/jenkins/.m2/repository/javax/servlet/servlet-api/2.5/servlet-api-2.5.jar
[DEBUG]  /home/jenkins/.m2/repository/org/apache/httpcomponents/httpclient/4.0.1/httpclient-4.0.1.jar
[DEBUG]  /home/jenkins/.m2/repository/org/apache/httpcomponents/httpcore/4.0.1/httpcore-4.0.1.jar
[DEBUG]  /home/jenkins/.m2/repository/org/jruby/jruby-complete/1.6.5/jruby-complete-1.6.5.jar
[DEBUG]  /home/jenkins/.m2/repository/org/mortbay/jetty/jetty/6.1.26/jetty-6.1.26.jar
[DEBUG]  /home/jenkins/.m2/repository/org/mortbay/jetty/jetty-util/6.1.26/jetty-util-6.1.26.jar
[DEBUG]  /home/jenkins/.m2/repository/org/mortbay/jetty/jsp-2.1/6.1.14/jsp-2.1-6.1.14.jar
[DEBUG]  /home/jenkins/.m2/repository/org/eclipse/jdt/core/3.1.1/core-3.1.1.jar
[DEBUG]  /home/jenkins/.m2/repository/org/mortbay/jetty/jsp-api-2.1/6.1.14/jsp-api-2.1-6.1.14.jar
[DEBUG]  /home/jenkins/.m2/repository/org/mortbay/jetty/servlet-api-2.5/6.1.14/servlet-api-2.5-6.1.14.jar
[DEBUG]  /home/jenkins/.m2/repository/org/codehaus/jackson/jackson-core-asl/1.5.5/jackson-core-asl-1.5.5.jar
[DEBUG]  /home/jenkins/.m2/repository/org/codehaus/jackson/jackson-mapper-asl/1.5.5/jackson-mapper-asl-1.5.5.jar
[DEBUG]  /home/jenkins/.m2/repository/org/codehaus/jackson/jackson-jaxrs/1.5.5/jackson-jaxrs-1.5.5.jar
[DEBUG]  /home/jenkins/.m2/repository/org/codehaus/jackson/jackson-xc/1.5.5/jackson-xc-1.5.5.jar
[DEBUG]  /home/jenkins/.m2/repository/org/slf4j/slf4j-api/1.5.8/slf4j-api-1.5.8.jar
[DEBUG]  /home/jenkins/.m2/repository/org/slf4j/slf4j-log4j12/1.5.8/slf4j-log4j12-1.5.8.jar
[DEBUG]  /home/jenkins/.m2/repository/tomcat/jasper-compiler/5.5.23/jasper-compiler-5.5.23.jar
[DEBUG]  /home/jenkins/.m2/repository/tomcat/jasper-runtime/5.5.23/jasper-runtime-5.5.23.jar
[DEBUG]  /home/jenkins/.m2/repository/commons-el/commons-el/1.0/commons-el-1.0.jar
[DEBUG]  /home/jenkins/.m2/repository/org/jamon/jamon-runtime/2.3.1/jamon-runtime-2.3.1.jar
[DEBUG]  /home/jenkins/.m2/repository/com/google/protobuf/protobuf-java/2.4.0a/protobuf-java-2.4.0a.jar
[DEBUG]  /home/jenkins/.m2/repository/com/sun/jersey/jersey-core/1.4/jersey-core-1.4.jar
[DEBUG]  /home/jenkins/.m2/repository/com/sun/jersey/jersey-json/1.4/jersey-json-1.4.jar
[DEBUG]  /home/jenkins/.m2/repository/org/codehaus/jettison/jettison/1.1/jettison-1.1.jar
[DEBUG]  /home/jenkins/.m2/repository/com/sun/xml/bind/jaxb-impl/2.1.12/jaxb-impl-2.1.12.jar
[DEBUG]  /home/jenkins/.m2/repository/com/sun/jersey/jersey-server/1.4/jersey-server-1.4.jar
[DEBUG]  /home/jenkins/.m2/repository/asm/asm/3.1/asm-3.1.jar
[DEBUG]  /home/jenkins/.m2/repository/javax/xml/bind/jaxb-api/2.1/jaxb-api-2.1.jar
[DEBUG]  /home/jenkins/.m2/repository/javax/activation/activation/1.1/activation-1.1.jar
[DEBUG]  /home/jenkins/.m2/repository/stax/stax-api/1.0.1/stax-api-1.0.1.jar
[DEBUG]  /home/jenkins/.m2/repository/junit/junit/4.10/junit-4.10.jar
[DEBUG]  /home/jenkins/.m2/repository/org/hamcrest/hamcrest-core/1.1/hamcrest-core-1.1.jar
[DEBUG]  /home/jenkins/.m2/repository/org/mockito/mockito-all/1.8.5/mockito-all-1.8.5.jar
[DEBUG]  /home/jenkins/.m2/repository/org/apache/commons/commons-math/2.1/commons-math-2.1.jar
[DEBUG]  /home/jenkins/.m2/repository/org/apache/hadoop/hadoop-core/1.0.0/hadoop-core-1.0.0.jar
[DEBUG]  /home/jenkins/.m2/repository/xmlenc/xmlenc/0.52/xmlenc-0.52.jar
[DEBUG]  /home/jenkins/.m2/repository/commons-net/commons-net/1.4.1/commons-net-1.4.1.jar
[DEBUG]  /home/jenkins/.m2/repository/org/apache/hadoop/hadoop-test/1.0.0/hadoop-test-1.0.0.jar
[DEBUG]  /home/jenkins/.m2/repository/org/apache/ftpserver/ftplet-api/1.0.0/ftplet-api-1.0.0.jar
[DEBUG]  /home/jenkins/.m2/repository/org/apache/mina/mina-core/2.0.0-M5/mina-core-2.0.0-M5.jar
[DEBUG]  /home/jenkins/.m2/repository/org/apache/ftpserver/ftpserver-core/1.0.0/ftpserver-core-1.0.0.jar
[DEBUG]  /home/jenkins/.m2/repository/org/apache/ftpserver/ftpserver-deprecated/1.0.0-M2/ftpserver-deprecated-1.0.0-M2.jar
[DEBUG] Source roots:
[DEBUG]  <https://builds.apache.org/job/HBase-0.92/ws/trunk/src/test/java>
[INFO] Compiling 283 source files to <https://builds.apache.org/job/HBase-0.92/ws/trunk/target/test-classes>
[INFO] ------------------------------------------------------------------------
[INFO] BUILD FAILURE
[INFO] ------------------------------------------------------------------------
[INFO] Total time: 46.617s
[INFO] Finished at: Fri Apr 06 00:09:51 UTC 2012
[INFO] Final Memory: 52M/602M
[INFO] ------------------------------------------------------------------------
[ERROR] Failed to execute goal org.apache.maven.plugins:maven-compiler-plugin:2.0.2:testCompile
(default-testCompile) on project hbase: Compilation failure
[ERROR] <https://builds.apache.org/job/HBase-0.92/ws/trunk/src/test/java/org/apache/hadoop/hbase/TestKeyValue.java>:[402,64]
cannot find symbol
[ERROR] symbol  : variable WritableUtils
[ERROR] location: class org.apache.hadoop.hbase.TestKeyValue
[ERROR] -> [Help 1]
org.apache.maven.lifecycle.LifecycleExecutionException: Failed to execute goal org.apache.maven.plugins:maven-compiler-plugin:2.0.2:testCompile
(default-testCompile) on project hbase: Compilation failure
<https://builds.apache.org/job/HBase-0.92/ws/trunk/src/test/java/org/apache/hadoop/hbase/TestKeyValue.java>:[402,64]
cannot find symbol
symbol  : variable WritableUtils
location: class org.apache.hadoop.hbase.TestKeyValue


	at org.apache.maven.lifecycle.internal.MojoExecutor.execute(MojoExecutor.java:213)
	at org.apache.maven.lifecycle.internal.MojoExecutor.execute(MojoExecutor.java:153)
	at org.apache.maven.lifecycle.internal.MojoExecutor.execute(MojoExecutor.java:145)
	at org.apache.maven.lifecycle.internal.LifecycleModuleBuilder.buildProject(LifecycleModuleBuilder.java:84)
	at org.apache.maven.lifecycle.internal.LifecycleModuleBuilder.buildProject(LifecycleModuleBuilder.java:59)
	at org.apache.maven.lifecycle.internal.LifecycleStarter.singleThreadedBuild(LifecycleStarter.java:183)
	at org.apache.maven.lifecycle.internal.LifecycleStarter.execute(LifecycleStarter.java:161)
	at org.apache.maven.DefaultMaven.doExecute(DefaultMaven.java:319)
	at org.apache.maven.DefaultMaven.execute(DefaultMaven.java:156)
	at org.apache.maven.cli.MavenCli.execute(MavenCli.java:537)
	at org.apache.maven.cli.MavenCli.doMain(MavenCli.java:196)
	at org.apache.maven.cli.MavenCli.main(MavenCli.java:141)
	at sun.reflect.NativeMethodAccessorImpl.invoke0(Native Method)
	at sun.reflect.NativeMethodAccessorImpl.invoke(NativeMethodAccessorImpl.java:39)
	at sun.reflect.DelegatingMethodAccessorImpl.invoke(DelegatingMethodAccessorImpl.java:25)
	at java.lang.reflect.Method.invoke(Method.java:597)
	at org.codehaus.plexus.classworlds.launcher.Launcher.launchEnhanced(Launcher.java:290)
	at org.codehaus.plexus.classworlds.launcher.Launcher.launch(Launcher.java:230)
	at org.codehaus.plexus.classworlds.launcher.Launcher.mainWithExitCode(Launcher.java:409)
	at org.codehaus.plexus.classworlds.launcher.Launcher.main(Launcher.java:352)
Caused by: org.apache.maven.plugin.CompilationFailureException: Compilation failure
<https://builds.apache.org/job/HBase-0.92/ws/trunk/src/test/java/org/apache/hadoop/hbase/TestKeyValue.java>:[402,64]
cannot find symbol
symbol  : variable WritableUtils
location: class org.apache.hadoop.hbase.TestKeyValue


	at org.apache.maven.plugin.AbstractCompilerMojo.execute(AbstractCompilerMojo.java:516)
	at org.apache.maven.plugin.TestCompilerMojo.execute(TestCompilerMojo.java:102)
	at org.apache.maven.plugin.DefaultBuildPluginManager.executeMojo(DefaultBuildPluginManager.java:101)
	at org.apache.maven.lifecycle.internal.MojoExecutor.execute(MojoExecutor.java:209)
	... 19 more
[ERROR] 
[ERROR] 
[ERROR] For more information about the errors and possible solutions, please read the following
articles:
[ERROR] [Help 1] http://cwiki.apache.org/confluence/display/MAVEN/MojoFailureException
Build step 'Invoke top-level Maven targets' marked build as failure
Archiving artifacts
Updating HBASE-5711
Recording test results

Mime
View raw message