hbase-dev mailing list archives

Site index · List index
Message view « Date » · « Thread »
Top « Date » · « Thread »
From Apache Jenkins Server <jenk...@builds.apache.org>
Subject Build failed in Jenkins: HBase-TRUNK #2761
Date Sat, 14 Apr 2012 04:54:51 GMT
See <https://builds.apache.org/job/HBase-TRUNK/2761/>

------------------------------------------
[...truncated 17763 lines...]
Forking command line: /bin/sh -c cd <https://builds.apache.org/job/HBase-TRUNK/ws/trunk>
&& /home/jenkins/tools/java/jdk1.6.0_27-32/jre/bin/java -enableassertions -Xmx1900m
-Djava.security.egd=file:/dev/./urandom -jar <https://builds.apache.org/job/HBase-TRUNK/ws/trunk/target/surefire/surefirebooter4217489369275067305.jar>
<https://builds.apache.org/job/HBase-TRUNK/ws/trunk/target/surefire/surefire5696718592905022007tmp>
<https://builds.apache.org/job/HBase-TRUNK/ws/trunk/target/surefire/surefire_521863878122733064106tmp>
Running org.apache.hadoop.hbase.regionserver.wal.TestHLogBench
Tests run: 1, Failures: 0, Errors: 0, Skipped: 0, Time elapsed: 1.348 sec
Forking command line: /bin/sh -c cd <https://builds.apache.org/job/HBase-TRUNK/ws/trunk>
&& /home/jenkins/tools/java/jdk1.6.0_27-32/jre/bin/java -enableassertions -Xmx1900m
-Djava.security.egd=file:/dev/./urandom -jar <https://builds.apache.org/job/HBase-TRUNK/ws/trunk/target/surefire/surefirebooter4536224959703402406.jar>
<https://builds.apache.org/job/HBase-TRUNK/ws/trunk/target/surefire/surefire5638735868434691520tmp>
<https://builds.apache.org/job/HBase-TRUNK/ws/trunk/target/surefire/surefire_539169780654843542042tmp>
Running org.apache.hadoop.hbase.regionserver.handler.TestCloseRegionHandler
Tests run: 3, Failures: 0, Errors: 0, Skipped: 0, Time elapsed: 1.32 sec
Forking command line: /bin/sh -c cd <https://builds.apache.org/job/HBase-TRUNK/ws/trunk>
&& /home/jenkins/tools/java/jdk1.6.0_27-32/jre/bin/java -enableassertions -Xmx1900m
-Djava.security.egd=file:/dev/./urandom -jar <https://builds.apache.org/job/HBase-TRUNK/ws/trunk/target/surefire/surefirebooter5572735731614646211.jar>
<https://builds.apache.org/job/HBase-TRUNK/ws/trunk/target/surefire/surefire8149564315104172860tmp>
<https://builds.apache.org/job/HBase-TRUNK/ws/trunk/target/surefire/surefire_544022935386554208978tmp>
Running org.apache.hadoop.hbase.regionserver.handler.TestOpenRegionHandler
Tests run: 3, Failures: 0, Errors: 0, Skipped: 0, Time elapsed: 1.058 sec
Forking command line: /bin/sh -c cd <https://builds.apache.org/job/HBase-TRUNK/ws/trunk>
&& /home/jenkins/tools/java/jdk1.6.0_27-32/jre/bin/java -enableassertions -Xmx1900m
-Djava.security.egd=file:/dev/./urandom -jar <https://builds.apache.org/job/HBase-TRUNK/ws/trunk/target/surefire/surefirebooter521995510205361266.jar>
<https://builds.apache.org/job/HBase-TRUNK/ws/trunk/target/surefire/surefire6575344123623791647tmp>
<https://builds.apache.org/job/HBase-TRUNK/ws/trunk/target/surefire/surefire_558499594736299743028tmp>
Running org.apache.hadoop.hbase.filter.TestColumnRangeFilter
Tests run: 1, Failures: 0, Errors: 0, Skipped: 0, Time elapsed: 17.93 sec
Forking command line: /bin/sh -c cd <https://builds.apache.org/job/HBase-TRUNK/ws/trunk>
&& /home/jenkins/tools/java/jdk1.6.0_27-32/jre/bin/java -enableassertions -Xmx1900m
-Djava.security.egd=file:/dev/./urandom -jar <https://builds.apache.org/job/HBase-TRUNK/ws/trunk/target/surefire/surefirebooter667811963052924803.jar>
<https://builds.apache.org/job/HBase-TRUNK/ws/trunk/target/surefire/surefire1174486999859150839tmp>
<https://builds.apache.org/job/HBase-TRUNK/ws/trunk/target/surefire/surefire_568387689630806972368tmp>
Running org.apache.hadoop.hbase.coprocessor.TestClassLoading
Tests run: 6, Failures: 0, Errors: 0, Skipped: 0, Time elapsed: 29.856 sec
Forking command line: /bin/sh -c cd <https://builds.apache.org/job/HBase-TRUNK/ws/trunk>
&& /home/jenkins/tools/java/jdk1.6.0_27-32/jre/bin/java -enableassertions -Xmx1900m
-Djava.security.egd=file:/dev/./urandom -jar <https://builds.apache.org/job/HBase-TRUNK/ws/trunk/target/surefire/surefirebooter5901698959293231294.jar>
<https://builds.apache.org/job/HBase-TRUNK/ws/trunk/target/surefire/surefire340138404333548764tmp>
<https://builds.apache.org/job/HBase-TRUNK/ws/trunk/target/surefire/surefire_571654175401433429385tmp>
Running org.apache.hadoop.hbase.coprocessor.TestAggregateProtocol
Tests run: 45, Failures: 0, Errors: 0, Skipped: 0, Time elapsed: 16.662 sec
Forking command line: /bin/sh -c cd <https://builds.apache.org/job/HBase-TRUNK/ws/trunk>
&& /home/jenkins/tools/java/jdk1.6.0_27-32/jre/bin/java -enableassertions -Xmx1900m
-Djava.security.egd=file:/dev/./urandom -jar <https://builds.apache.org/job/HBase-TRUNK/ws/trunk/target/surefire/surefirebooter4992725540440705603.jar>
<https://builds.apache.org/job/HBase-TRUNK/ws/trunk/target/surefire/surefire564305489497599156tmp>
<https://builds.apache.org/job/HBase-TRUNK/ws/trunk/target/surefire/surefire_5833619004468703052tmp>
Forking command line: /bin/sh -c cd <https://builds.apache.org/job/HBase-TRUNK/ws/trunk>
&& /home/jenkins/tools/java/jdk1.6.0_27-32/jre/bin/java -enableassertions -Xmx1900m
-Djava.security.egd=file:/dev/./urandom -jar <https://builds.apache.org/job/HBase-TRUNK/ws/trunk/target/surefire/surefirebooter6345864018442220015.jar>
<https://builds.apache.org/job/HBase-TRUNK/ws/trunk/target/surefire/surefire7943085786136462025tmp>
<https://builds.apache.org/job/HBase-TRUNK/ws/trunk/target/surefire/surefire_595523645965290598438tmp>
Running org.apache.hadoop.hbase.coprocessor.TestRegionServerCoprocessorExceptionWithRemove
Tests run: 1, Failures: 0, Errors: 0, Skipped: 0, Time elapsed: 19.867 sec
Forking command line: /bin/sh -c cd <https://builds.apache.org/job/HBase-TRUNK/ws/trunk>
&& /home/jenkins/tools/java/jdk1.6.0_27-32/jre/bin/java -enableassertions -Xmx1900m
-Djava.security.egd=file:/dev/./urandom -jar <https://builds.apache.org/job/HBase-TRUNK/ws/trunk/target/surefire/surefirebooter1346911913967033511.jar>
<https://builds.apache.org/job/HBase-TRUNK/ws/trunk/target/surefire/surefire3601163127105407837tmp>
<https://builds.apache.org/job/HBase-TRUNK/ws/trunk/target/surefire/surefire_607906858319339606425tmp>
Running org.apache.hadoop.hbase.coprocessor.TestMasterObserver
Tests run: 3, Failures: 0, Errors: 0, Skipped: 0, Time elapsed: 28.761 sec
Forking command line: /bin/sh -c cd <https://builds.apache.org/job/HBase-TRUNK/ws/trunk>
&& /home/jenkins/tools/java/jdk1.6.0_27-32/jre/bin/java -enableassertions -Xmx1900m
-Djava.security.egd=file:/dev/./urandom -jar <https://builds.apache.org/job/HBase-TRUNK/ws/trunk/target/surefire/surefirebooter1854807060120581216.jar>
<https://builds.apache.org/job/HBase-TRUNK/ws/trunk/target/surefire/surefire6939623569433925406tmp>
<https://builds.apache.org/job/HBase-TRUNK/ws/trunk/target/surefire/surefire_613096703544658129242tmp>
Running org.apache.hadoop.hbase.coprocessor.TestRegionServerCoprocessorExceptionWithAbort
Tests run: 1, Failures: 0, Errors: 0, Skipped: 0, Time elapsed: 76.295 sec
Forking command line: /bin/sh -c cd <https://builds.apache.org/job/HBase-TRUNK/ws/trunk>
&& /home/jenkins/tools/java/jdk1.6.0_27-32/jre/bin/java -enableassertions -Xmx1900m
-Djava.security.egd=file:/dev/./urandom -jar <https://builds.apache.org/job/HBase-TRUNK/ws/trunk/target/surefire/surefirebooter7058373672375423935.jar>
<https://builds.apache.org/job/HBase-TRUNK/ws/trunk/target/surefire/surefire1295927227303535430tmp>
<https://builds.apache.org/job/HBase-TRUNK/ws/trunk/target/surefire/surefire_624921260648861038948tmp>
Running org.apache.hadoop.hbase.coprocessor.TestCoprocessorEndpoint
Tests run: 3, Failures: 0, Errors: 0, Skipped: 1, Time elapsed: 30.482 sec
Forking command line: /bin/sh -c cd <https://builds.apache.org/job/HBase-TRUNK/ws/trunk>
&& /home/jenkins/tools/java/jdk1.6.0_27-32/jre/bin/java -enableassertions -Xmx1900m
-Djava.security.egd=file:/dev/./urandom -jar <https://builds.apache.org/job/HBase-TRUNK/ws/trunk/target/surefire/surefirebooter3096095099954742066.jar>
<https://builds.apache.org/job/HBase-TRUNK/ws/trunk/target/surefire/surefire5138049365746882278tmp>
<https://builds.apache.org/job/HBase-TRUNK/ws/trunk/target/surefire/surefire_638085666450185991023tmp>
Running org.apache.hadoop.hbase.coprocessor.TestWALObserver
Tests run: 3, Failures: 0, Errors: 0, Skipped: 0, Time elapsed: 16.537 sec
Running org.apache.hadoop.hbase.coprocessor.TestMasterCoprocessorExceptionWithAbort
Tests run: 1, Failures: 0, Errors: 0, Skipped: 0, Time elapsed: 25.955 sec
Forking command line: /bin/sh -c cd <https://builds.apache.org/job/HBase-TRUNK/ws/trunk>
&& /home/jenkins/tools/java/jdk1.6.0_27-32/jre/bin/java -enableassertions -Xmx1900m
-Djava.security.egd=file:/dev/./urandom -jar <https://builds.apache.org/job/HBase-TRUNK/ws/trunk/target/surefire/surefirebooter3266928098259516379.jar>
<https://builds.apache.org/job/HBase-TRUNK/ws/trunk/target/surefire/surefire8592583448028522929tmp>
<https://builds.apache.org/job/HBase-TRUNK/ws/trunk/target/surefire/surefire_644009981120579078108tmp>
Forking command line: /bin/sh -c cd <https://builds.apache.org/job/HBase-TRUNK/ws/trunk>
&& /home/jenkins/tools/java/jdk1.6.0_27-32/jre/bin/java -enableassertions -Xmx1900m
-Djava.security.egd=file:/dev/./urandom -jar <https://builds.apache.org/job/HBase-TRUNK/ws/trunk/target/surefire/surefirebooter5620721156160825038.jar>
<https://builds.apache.org/job/HBase-TRUNK/ws/trunk/target/surefire/surefire4342134152862436589tmp>
<https://builds.apache.org/job/HBase-TRUNK/ws/trunk/target/surefire/surefire_658044820205668920713tmp>
Running org.apache.hadoop.hbase.coprocessor.TestMasterCoprocessorExceptionWithRemove
Tests run: 1, Failures: 0, Errors: 0, Skipped: 0, Time elapsed: 14.646 sec
Forking command line: /bin/sh -c cd <https://builds.apache.org/job/HBase-TRUNK/ws/trunk>
&& /home/jenkins/tools/java/jdk1.6.0_27-32/jre/bin/java -enableassertions -Xmx1900m
-Djava.security.egd=file:/dev/./urandom -jar <https://builds.apache.org/job/HBase-TRUNK/ws/trunk/target/surefire/surefirebooter6991116775695745955.jar>
<https://builds.apache.org/job/HBase-TRUNK/ws/trunk/target/surefire/surefire7913176038642726802tmp>
<https://builds.apache.org/job/HBase-TRUNK/ws/trunk/target/surefire/surefire_666246113756524943543tmp>
Running org.apache.hadoop.hbase.coprocessor.TestRegionObserverInterface
Tests run: 6, Failures: 0, Errors: 0, Skipped: 0, Time elapsed: 32.971 sec
Forking command line: /bin/sh -c cd <https://builds.apache.org/job/HBase-TRUNK/ws/trunk>
&& /home/jenkins/tools/java/jdk1.6.0_27-32/jre/bin/java -enableassertions -Xmx1900m
-Djava.security.egd=file:/dev/./urandom -jar <https://builds.apache.org/job/HBase-TRUNK/ws/trunk/target/surefire/surefirebooter8616323935056379992.jar>
<https://builds.apache.org/job/HBase-TRUNK/ws/trunk/target/surefire/surefire3064639936024788805tmp>
<https://builds.apache.org/job/HBase-TRUNK/ws/trunk/target/surefire/surefire_673744386921388189342tmp>
Running org.apache.hadoop.hbase.coprocessor.TestRegionObserverBypass
Tests run: 2, Failures: 0, Errors: 0, Skipped: 0, Time elapsed: 13.456 sec
Forking command line: /bin/sh -c cd <https://builds.apache.org/job/HBase-TRUNK/ws/trunk>
&& /home/jenkins/tools/java/jdk1.6.0_27-32/jre/bin/java -enableassertions -Xmx1900m
-Djava.security.egd=file:/dev/./urandom -jar <https://builds.apache.org/job/HBase-TRUNK/ws/trunk/target/surefire/surefirebooter8578544783599337346.jar>
<https://builds.apache.org/job/HBase-TRUNK/ws/trunk/target/surefire/surefire6313193993010149526tmp>
<https://builds.apache.org/job/HBase-TRUNK/ws/trunk/target/surefire/surefire_688666143131674076547tmp>
Running org.apache.hadoop.hbase.mapreduce.TestHLogRecordReader
Tests run: 2, Failures: 0, Errors: 0, Skipped: 0, Time elapsed: 4.982 sec
Forking command line: /bin/sh -c cd <https://builds.apache.org/job/HBase-TRUNK/ws/trunk>
&& /home/jenkins/tools/java/jdk1.6.0_27-32/jre/bin/java -enableassertions -Xmx1900m
-Djava.security.egd=file:/dev/./urandom -jar <https://builds.apache.org/job/HBase-TRUNK/ws/trunk/target/surefire/surefirebooter4864409509645593357.jar>
<https://builds.apache.org/job/HBase-TRUNK/ws/trunk/target/surefire/surefire2202600850137842677tmp>
<https://builds.apache.org/job/HBase-TRUNK/ws/trunk/target/surefire/surefire_694971189497712980980tmp>
Running org.apache.hadoop.hbase.TestGlobalMemStoreSize
Tests run: 1, Failures: 0, Errors: 0, Skipped: 0, Time elapsed: 14.964 sec
Forking command line: /bin/sh -c cd <https://builds.apache.org/job/HBase-TRUNK/ws/trunk>
&& /home/jenkins/tools/java/jdk1.6.0_27-32/jre/bin/java -enableassertions -Xmx1900m
-Djava.security.egd=file:/dev/./urandom -jar <https://builds.apache.org/job/HBase-TRUNK/ws/trunk/target/surefire/surefirebooter5332280740214099245.jar>
<https://builds.apache.org/job/HBase-TRUNK/ws/trunk/target/surefire/surefire4812153799027015637tmp>
<https://builds.apache.org/job/HBase-TRUNK/ws/trunk/target/surefire/surefire_706845096730156589809tmp>
Running org.apache.hadoop.hbase.mapreduce.TestImportExport
Tests run: 2, Failures: 0, Errors: 0, Skipped: 0, Time elapsed: 46.647 sec
Forking command line: /bin/sh -c cd <https://builds.apache.org/job/HBase-TRUNK/ws/trunk>
&& /home/jenkins/tools/java/jdk1.6.0_27-32/jre/bin/java -enableassertions -Xmx1900m
-Djava.security.egd=file:/dev/./urandom -jar <https://builds.apache.org/job/HBase-TRUNK/ws/trunk/target/surefire/surefirebooter5531404003372181557.jar>
<https://builds.apache.org/job/HBase-TRUNK/ws/trunk/target/surefire/surefire9177867258917740652tmp>
<https://builds.apache.org/job/HBase-TRUNK/ws/trunk/target/surefire/surefire_717775699445780148156tmp>
Running org.apache.hadoop.hbase.mapreduce.TestImportTsv
Tests run: 8, Failures: 0, Errors: 0, Skipped: 0, Time elapsed: 84.4 sec
Forking command line: /bin/sh -c cd <https://builds.apache.org/job/HBase-TRUNK/ws/trunk>
&& /home/jenkins/tools/java/jdk1.6.0_27-32/jre/bin/java -enableassertions -Xmx1900m
-Djava.security.egd=file:/dev/./urandom -jar <https://builds.apache.org/job/HBase-TRUNK/ws/trunk/target/surefire/surefirebooter8891773340145194357.jar>
<https://builds.apache.org/job/HBase-TRUNK/ws/trunk/target/surefire/surefire523026861015819554tmp>
<https://builds.apache.org/job/HBase-TRUNK/ws/trunk/target/surefire/surefire_726274157913110159574tmp>
Running org.apache.hadoop.hbase.thrift2.TestThriftHBaseServiceHandler
Tests run: 12, Failures: 0, Errors: 0, Skipped: 0, Time elapsed: 12.872 sec
Forking command line: /bin/sh -c cd <https://builds.apache.org/job/HBase-TRUNK/ws/trunk>
&& /home/jenkins/tools/java/jdk1.6.0_27-32/jre/bin/java -enableassertions -Xmx1900m
-Djava.security.egd=file:/dev/./urandom -jar <https://builds.apache.org/job/HBase-TRUNK/ws/trunk/target/surefire/surefirebooter4719467317924801778.jar>
<https://builds.apache.org/job/HBase-TRUNK/ws/trunk/target/surefire/surefire8970431170062640150tmp>
<https://builds.apache.org/job/HBase-TRUNK/ws/trunk/target/surefire/surefire_735934258883543573682tmp>
Running org.apache.hadoop.hbase.catalog.TestMetaReaderEditorNoCluster
Tests run: 1, Failures: 0, Errors: 0, Skipped: 0, Time elapsed: 4.206 sec
Forking command line: /bin/sh -c cd <https://builds.apache.org/job/HBase-TRUNK/ws/trunk>
&& /home/jenkins/tools/java/jdk1.6.0_27-32/jre/bin/java -enableassertions -Xmx1900m
-Djava.security.egd=file:/dev/./urandom -jar <https://builds.apache.org/job/HBase-TRUNK/ws/trunk/target/surefire/surefirebooter180143012346380329.jar>
<https://builds.apache.org/job/HBase-TRUNK/ws/trunk/target/surefire/surefire5292399048542972457tmp>
<https://builds.apache.org/job/HBase-TRUNK/ws/trunk/target/surefire/surefire_743141762021237930778tmp>
Running org.apache.hadoop.hbase.catalog.TestMetaReaderEditor
Tests run: 5, Failures: 0, Errors: 0, Skipped: 0, Time elapsed: 22.397 sec
Forking command line: /bin/sh -c cd <https://builds.apache.org/job/HBase-TRUNK/ws/trunk>
&& /home/jenkins/tools/java/jdk1.6.0_27-32/jre/bin/java -enableassertions -Xmx1900m
-Djava.security.egd=file:/dev/./urandom -jar <https://builds.apache.org/job/HBase-TRUNK/ws/trunk/target/surefire/surefirebooter149939827874377569.jar>
<https://builds.apache.org/job/HBase-TRUNK/ws/trunk/target/surefire/surefire4299984465172980029tmp>
<https://builds.apache.org/job/HBase-TRUNK/ws/trunk/target/surefire/surefire_758470857564566214925tmp>
Running org.apache.hadoop.hbase.catalog.TestCatalogTracker
Tests run: 9, Failures: 0, Errors: 0, Skipped: 1, Time elapsed: 5.422 sec
Forking command line: /bin/sh -c cd <https://builds.apache.org/job/HBase-TRUNK/ws/trunk>
&& /home/jenkins/tools/java/jdk1.6.0_27-32/jre/bin/java -enableassertions -Xmx1900m
-Djava.security.egd=file:/dev/./urandom -jar <https://builds.apache.org/job/HBase-TRUNK/ws/trunk/target/surefire/surefirebooter8456916071499337536.jar>
<https://builds.apache.org/job/HBase-TRUNK/ws/trunk/target/surefire/surefire4945248426371414051tmp>
<https://builds.apache.org/job/HBase-TRUNK/ws/trunk/target/surefire/surefire_763616841510236698139tmp>
Running org.apache.hadoop.hbase.TestAcidGuarantees
Tests run: 3, Failures: 0, Errors: 0, Skipped: 0, Time elapsed: 95.484 sec
Forking command line: /bin/sh -c cd <https://builds.apache.org/job/HBase-TRUNK/ws/trunk>
&& /home/jenkins/tools/java/jdk1.6.0_27-32/jre/bin/java -enableassertions -Xmx1900m
-Djava.security.egd=file:/dev/./urandom -jar <https://builds.apache.org/job/HBase-TRUNK/ws/trunk/target/surefire/surefirebooter1895318914969211104.jar>
<https://builds.apache.org/job/HBase-TRUNK/ws/trunk/target/surefire/surefire9051823012707985723tmp>
<https://builds.apache.org/job/HBase-TRUNK/ws/trunk/target/surefire/surefire_774589457462067595636tmp>
Running org.apache.hadoop.hbase.client.TestTimestampsFilter
Tests run: 3, Failures: 0, Errors: 0, Skipped: 0, Time elapsed: 22.095 sec
Forking command line: /bin/sh -c cd <https://builds.apache.org/job/HBase-TRUNK/ws/trunk>
&& /home/jenkins/tools/java/jdk1.6.0_27-32/jre/bin/java -enableassertions -Xmx1900m
-Djava.security.egd=file:/dev/./urandom -jar <https://builds.apache.org/job/HBase-TRUNK/ws/trunk/target/surefire/surefirebooter6376065807841193004.jar>
<https://builds.apache.org/job/HBase-TRUNK/ws/trunk/target/surefire/surefire8900797327020442861tmp>
<https://builds.apache.org/job/HBase-TRUNK/ws/trunk/target/surefire/surefire_781147400325770121418tmp>
Running org.apache.hadoop.hbase.client.TestMetaScanner
Tests run: 1, Failures: 0, Errors: 0, Skipped: 0, Time elapsed: 12.245 sec
Forking command line: /bin/sh -c cd <https://builds.apache.org/job/HBase-TRUNK/ws/trunk>
&& /home/jenkins/tools/java/jdk1.6.0_27-32/jre/bin/java -enableassertions -Xmx1900m
-Djava.security.egd=file:/dev/./urandom -jar <https://builds.apache.org/job/HBase-TRUNK/ws/trunk/target/surefire/surefirebooter8562674558637119453.jar>
<https://builds.apache.org/job/HBase-TRUNK/ws/trunk/target/surefire/surefire1723836958699765293tmp>
<https://builds.apache.org/job/HBase-TRUNK/ws/trunk/target/surefire/surefire_791631018416643523372tmp>
Running org.apache.hadoop.hbase.client.TestHCM
Tests run: 7, Failures: 0, Errors: 0, Skipped: 0, Time elapsed: 17.804 sec
Forking command line: /bin/sh -c cd <https://builds.apache.org/job/HBase-TRUNK/ws/trunk>
&& /home/jenkins/tools/java/jdk1.6.0_27-32/jre/bin/java -enableassertions -Xmx1900m
-Djava.security.egd=file:/dev/./urandom -jar <https://builds.apache.org/job/HBase-TRUNK/ws/trunk/target/surefire/surefirebooter755547412974309315.jar>
<https://builds.apache.org/job/HBase-TRUNK/ws/trunk/target/surefire/surefire966933935359876059tmp>
<https://builds.apache.org/job/HBase-TRUNK/ws/trunk/target/surefire/surefire_802849116890565523957tmp>
Running org.apache.hadoop.hbase.client.TestHTableUtil
Tests run: 2, Failures: 0, Errors: 0, Skipped: 0, Time elapsed: 15.788 sec
Forking command line: /bin/sh -c cd <https://builds.apache.org/job/HBase-TRUNK/ws/trunk>
&& /home/jenkins/tools/java/jdk1.6.0_27-32/jre/bin/java -enableassertions -Xmx1900m
-Djava.security.egd=file:/dev/./urandom -jar <https://builds.apache.org/job/HBase-TRUNK/ws/trunk/target/surefire/surefirebooter5826799795296960504.jar>
<https://builds.apache.org/job/HBase-TRUNK/ws/trunk/target/surefire/surefire1567056517278556677tmp>
<https://builds.apache.org/job/HBase-TRUNK/ws/trunk/target/surefire/surefire_815736732457533919444tmp>
Running org.apache.hadoop.hbase.client.TestMetaMigrationRemovingHTD
Tests run: 3, Failures: 0, Errors: 0, Skipped: 0, Time elapsed: 24.531 sec
Forking command line: /bin/sh -c cd <https://builds.apache.org/job/HBase-TRUNK/ws/trunk>
&& /home/jenkins/tools/java/jdk1.6.0_27-32/jre/bin/java -enableassertions -Xmx1900m
-Djava.security.egd=file:/dev/./urandom -jar <https://builds.apache.org/job/HBase-TRUNK/ws/trunk/target/surefire/surefirebooter5756193206091353763.jar>
<https://builds.apache.org/job/HBase-TRUNK/ws/trunk/target/surefire/surefire6677464696925942780tmp>
<https://builds.apache.org/job/HBase-TRUNK/ws/trunk/target/surefire/surefire_823397153088637215769tmp>
Running org.apache.hadoop.hbase.client.replication.TestReplicationAdmin
Tests run: 1, Failures: 0, Errors: 0, Skipped: 0, Time elapsed: 0.888 sec
Forking command line: /bin/sh -c cd <https://builds.apache.org/job/HBase-TRUNK/ws/trunk>
&& /home/jenkins/tools/java/jdk1.6.0_27-32/jre/bin/java -enableassertions -Xmx1900m
-Djava.security.egd=file:/dev/./urandom -jar <https://builds.apache.org/job/HBase-TRUNK/ws/trunk/target/surefire/surefirebooter4425758696771196428.jar>
<https://builds.apache.org/job/HBase-TRUNK/ws/trunk/target/surefire/surefire4294287412678758738tmp>
<https://builds.apache.org/job/HBase-TRUNK/ws/trunk/target/surefire/surefire_83788031920534328422tmp>
Running org.apache.hadoop.hbase.client.TestHTablePool$TestHTableReusablePool
Tests run: 9, Failures: 0, Errors: 0, Skipped: 0, Time elapsed: 5.163 sec
Running org.apache.hadoop.hbase.client.TestHTablePool$TestHTableThreadLocalPool
Tests run: 9, Failures: 0, Errors: 0, Skipped: 0, Time elapsed: 24.92 sec
Forking command line: /bin/sh -c cd <https://builds.apache.org/job/HBase-TRUNK/ws/trunk>
&& /home/jenkins/tools/java/jdk1.6.0_27-32/jre/bin/java -enableassertions -Xmx1900m
-Djava.security.egd=file:/dev/./urandom -jar <https://builds.apache.org/job/HBase-TRUNK/ws/trunk/target/surefire/surefirebooter7221597790610234302.jar>
<https://builds.apache.org/job/HBase-TRUNK/ws/trunk/target/surefire/surefire998236511236952543tmp>
<https://builds.apache.org/job/HBase-TRUNK/ws/trunk/target/surefire/surefire_841832151640725582194tmp>
Running org.apache.hadoop.hbase.metrics.TestMetricsMBeanBase
Tests run: 2, Failures: 0, Errors: 0, Skipped: 0, Time elapsed: 1.116 sec
Forking command line: /bin/sh -c cd <https://builds.apache.org/job/HBase-TRUNK/ws/trunk>
&& /home/jenkins/tools/java/jdk1.6.0_27-32/jre/bin/java -enableassertions -Xmx1900m
-Djava.security.egd=file:/dev/./urandom -jar <https://builds.apache.org/job/HBase-TRUNK/ws/trunk/target/surefire/surefirebooter471516709332687340.jar>
<https://builds.apache.org/job/HBase-TRUNK/ws/trunk/target/surefire/surefire5640239436975547600tmp>
<https://builds.apache.org/job/HBase-TRUNK/ws/trunk/target/surefire/surefire_858087026097008175609tmp>
Running org.apache.hadoop.hbase.client.TestMultiParallel
Tests run: 11, Failures: 0, Errors: 0, Skipped: 0, Time elapsed: 31.55 sec
Forking command line: /bin/sh -c cd <https://builds.apache.org/job/HBase-TRUNK/ws/trunk>
&& /home/jenkins/tools/java/jdk1.6.0_27-32/jre/bin/java -enableassertions -Xmx1900m
-Djava.security.egd=file:/dev/./urandom -jar <https://builds.apache.org/job/HBase-TRUNK/ws/trunk/target/surefire/surefirebooter1438874697857440416.jar>
<https://builds.apache.org/job/HBase-TRUNK/ws/trunk/target/surefire/surefire2659608285436003008tmp>
<https://builds.apache.org/job/HBase-TRUNK/ws/trunk/target/surefire/surefire_861410239049782209418tmp>
Running org.apache.hadoop.hbase.constraint.TestConstraint
Tests run: 5, Failures: 0, Errors: 0, Skipped: 0, Time elapsed: 26.276 sec
Forking command line: /bin/sh -c cd <https://builds.apache.org/job/HBase-TRUNK/ws/trunk>
&& /home/jenkins/tools/java/jdk1.6.0_27-32/jre/bin/java -enableassertions -Xmx1900m
-Djava.security.egd=file:/dev/./urandom -jar <https://builds.apache.org/job/HBase-TRUNK/ws/trunk/target/surefire/surefirebooter3029454148745156560.jar>
<https://builds.apache.org/job/HBase-TRUNK/ws/trunk/target/surefire/surefire8018020933228413172tmp>
<https://builds.apache.org/job/HBase-TRUNK/ws/trunk/target/surefire/surefire_875041965834874171974tmp>
Running org.apache.hadoop.hbase.rest.TestGzipFilter
Tests run: 3, Failures: 0, Errors: 0, Skipped: 0, Time elapsed: 12.617 sec
Forking command line: /bin/sh -c cd <https://builds.apache.org/job/HBase-TRUNK/ws/trunk>
&& /home/jenkins/tools/java/jdk1.6.0_27-32/jre/bin/java -enableassertions -Xmx1900m
-Djava.security.egd=file:/dev/./urandom -jar <https://builds.apache.org/job/HBase-TRUNK/ws/trunk/target/surefire/surefirebooter684336853413821120.jar>
<https://builds.apache.org/job/HBase-TRUNK/ws/trunk/target/surefire/surefire8323255569975175443tmp>
<https://builds.apache.org/job/HBase-TRUNK/ws/trunk/target/surefire/surefire_884215209664478315555tmp>
Running org.apache.hadoop.hbase.rest.TestMultiRowResource
Tests run: 3, Failures: 0, Errors: 0, Skipped: 0, Time elapsed: 14.206 sec
Forking command line: /bin/sh -c cd <https://builds.apache.org/job/HBase-TRUNK/ws/trunk>
&& /home/jenkins/tools/java/jdk1.6.0_27-32/jre/bin/java -enableassertions -Xmx1900m
-Djava.security.egd=file:/dev/./urandom -jar <https://builds.apache.org/job/HBase-TRUNK/ws/trunk/target/surefire/surefirebooter1322370189981235436.jar>
<https://builds.apache.org/job/HBase-TRUNK/ws/trunk/target/surefire/surefire8381391010499821278tmp>
<https://builds.apache.org/job/HBase-TRUNK/ws/trunk/target/surefire/surefire_896903007535877894487tmp>
Running org.apache.hadoop.hbase.rest.TestScannersWithFilters
Tests run: 10, Failures: 0, Errors: 0, Skipped: 0, Time elapsed: 18.04 sec
Forking command line: /bin/sh -c cd <https://builds.apache.org/job/HBase-TRUNK/ws/trunk>
&& /home/jenkins/tools/java/jdk1.6.0_27-32/jre/bin/java -enableassertions -Xmx1900m
-Djava.security.egd=file:/dev/./urandom -jar <https://builds.apache.org/job/HBase-TRUNK/ws/trunk/target/surefire/surefirebooter8309990607758562137.jar>
<https://builds.apache.org/job/HBase-TRUNK/ws/trunk/target/surefire/surefire5964102262325785147tmp>
<https://builds.apache.org/job/HBase-TRUNK/ws/trunk/target/surefire/surefire_906468002755918231211tmp>
Running org.apache.hadoop.hbase.rest.TestRowResource
Tests run: 11, Failures: 0, Errors: 0, Skipped: 0, Time elapsed: 15.356 sec
Forking command line: /bin/sh -c cd <https://builds.apache.org/job/HBase-TRUNK/ws/trunk>
&& /home/jenkins/tools/java/jdk1.6.0_27-32/jre/bin/java -enableassertions -Xmx1900m
-Djava.security.egd=file:/dev/./urandom -jar <https://builds.apache.org/job/HBase-TRUNK/ws/trunk/target/surefire/surefirebooter6504791271119504347.jar>
<https://builds.apache.org/job/HBase-TRUNK/ws/trunk/target/surefire/surefire782899124024851754tmp>
<https://builds.apache.org/job/HBase-TRUNK/ws/trunk/target/surefire/surefire_913638365906378934656tmp>
Running org.apache.hadoop.hbase.rest.client.TestRemoteAdmin
Tests run: 1, Failures: 0, Errors: 0, Skipped: 0, Time elapsed: 17.17 sec
Forking command line: /bin/sh -c cd <https://builds.apache.org/job/HBase-TRUNK/ws/trunk>
&& /home/jenkins/tools/java/jdk1.6.0_27-32/jre/bin/java -enableassertions -Xmx1900m
-Djava.security.egd=file:/dev/./urandom -jar <https://builds.apache.org/job/HBase-TRUNK/ws/trunk/target/surefire/surefirebooter9001652901293725649.jar>
<https://builds.apache.org/job/HBase-TRUNK/ws/trunk/target/surefire/surefire7767294073983620213tmp>
<https://builds.apache.org/job/HBase-TRUNK/ws/trunk/target/surefire/surefire_928912630711575923793tmp>
Running org.apache.hadoop.hbase.rest.client.TestRemoteTable
Tests run: 3, Failures: 0, Errors: 0, Skipped: 0, Time elapsed: 13.172 sec
Forking command line: /bin/sh -c cd <https://builds.apache.org/job/HBase-TRUNK/ws/trunk>
&& /home/jenkins/tools/java/jdk1.6.0_27-32/jre/bin/java -enableassertions -Xmx1900m
-Djava.security.egd=file:/dev/./urandom -jar <https://builds.apache.org/job/HBase-TRUNK/ws/trunk/target/surefire/surefirebooter4837038793646747557.jar>
<https://builds.apache.org/job/HBase-TRUNK/ws/trunk/target/surefire/surefire5407146822419352818tmp>
<https://builds.apache.org/job/HBase-TRUNK/ws/trunk/target/surefire/surefire_935423356431648113868tmp>
Running org.apache.hadoop.hbase.rest.TestVersionResource
Tests run: 7, Failures: 0, Errors: 0, Skipped: 0, Time elapsed: 11.565 sec
Forking command line: /bin/sh -c cd <https://builds.apache.org/job/HBase-TRUNK/ws/trunk>
&& /home/jenkins/tools/java/jdk1.6.0_27-32/jre/bin/java -enableassertions -Xmx1900m
-Djava.security.egd=file:/dev/./urandom -jar <https://builds.apache.org/job/HBase-TRUNK/ws/trunk/target/surefire/surefirebooter1037161735342431351.jar>
<https://builds.apache.org/job/HBase-TRUNK/ws/trunk/target/surefire/surefire7196257770400677368tmp>
<https://builds.apache.org/job/HBase-TRUNK/ws/trunk/target/surefire/surefire_948361176853410834730tmp>
Running org.apache.hadoop.hbase.rest.TestTableResource
Tests run: 8, Failures: 0, Errors: 0, Skipped: 0, Time elapsed: 23.445 sec
Forking command line: /bin/sh -c cd <https://builds.apache.org/job/HBase-TRUNK/ws/trunk>
&& /home/jenkins/tools/java/jdk1.6.0_27-32/jre/bin/java -enableassertions -Xmx1900m
-Djava.security.egd=file:/dev/./urandom -jar <https://builds.apache.org/job/HBase-TRUNK/ws/trunk/target/surefire/surefirebooter6447568879492492549.jar>
<https://builds.apache.org/job/HBase-TRUNK/ws/trunk/target/surefire/surefire2826552933316143069tmp>
<https://builds.apache.org/job/HBase-TRUNK/ws/trunk/target/surefire/surefire_954249627708375807633tmp>
Running org.apache.hadoop.hbase.rest.TestScannerResource
Tests run: 5, Failures: 0, Errors: 0, Skipped: 0, Time elapsed: 31.844 sec
Forking command line: /bin/sh -c cd <https://builds.apache.org/job/HBase-TRUNK/ws/trunk>
&& /home/jenkins/tools/java/jdk1.6.0_27-32/jre/bin/java -enableassertions -Xmx1900m
-Djava.security.egd=file:/dev/./urandom -jar <https://builds.apache.org/job/HBase-TRUNK/ws/trunk/target/surefire/surefirebooter7533329403586447762.jar>
<https://builds.apache.org/job/HBase-TRUNK/ws/trunk/target/surefire/surefire7019616530272507681tmp>
<https://builds.apache.org/job/HBase-TRUNK/ws/trunk/target/surefire/surefire_961039653864533480614tmp>
Running org.apache.hadoop.hbase.rest.TestStatusResource
Tests run: 2, Failures: 0, Errors: 0, Skipped: 0, Time elapsed: 11.078 sec
Forking command line: /bin/sh -c cd <https://builds.apache.org/job/HBase-TRUNK/ws/trunk>
&& /home/jenkins/tools/java/jdk1.6.0_27-32/jre/bin/java -enableassertions -Xmx1900m
-Djava.security.egd=file:/dev/./urandom -jar <https://builds.apache.org/job/HBase-TRUNK/ws/trunk/target/surefire/surefirebooter5223439883209589856.jar>
<https://builds.apache.org/job/HBase-TRUNK/ws/trunk/target/surefire/surefire960559343876103200tmp>
<https://builds.apache.org/job/HBase-TRUNK/ws/trunk/target/surefire/surefire_978444085108634155252tmp>
Running org.apache.hadoop.hbase.rest.TestSchemaResource
Tests run: 2, Failures: 0, Errors: 0, Skipped: 0, Time elapsed: 17.706 sec
Forking command line: /bin/sh -c cd <https://builds.apache.org/job/HBase-TRUNK/ws/trunk>
&& /home/jenkins/tools/java/jdk1.6.0_27-32/jre/bin/java -enableassertions -Xmx1900m
-Djava.security.egd=file:/dev/./urandom -jar <https://builds.apache.org/job/HBase-TRUNK/ws/trunk/target/surefire/surefirebooter1049007131176111363.jar>
<https://builds.apache.org/job/HBase-TRUNK/ws/trunk/target/surefire/surefire468439936905963123tmp>
<https://builds.apache.org/job/HBase-TRUNK/ws/trunk/target/surefire/surefire_987076792097644950815tmp>
Running org.apache.hadoop.hbase.io.encoding.TestLoadAndSwitchEncodeOnDisk
Tests run: 1, Failures: 0, Errors: 0, Skipped: 0, Time elapsed: 26.309 sec
Forking command line: /bin/sh -c cd <https://builds.apache.org/job/HBase-TRUNK/ws/trunk>
&& /home/jenkins/tools/java/jdk1.6.0_27-32/jre/bin/java -enableassertions -Xmx1900m
-Djava.security.egd=file:/dev/./urandom -jar <https://builds.apache.org/job/HBase-TRUNK/ws/trunk/target/surefire/surefirebooter29681805694882919.jar>
<https://builds.apache.org/job/HBase-TRUNK/ws/trunk/target/surefire/surefire6810876011108656287tmp>
<https://builds.apache.org/job/HBase-TRUNK/ws/trunk/target/surefire/surefire_994076435471195496292tmp>
Running org.apache.hadoop.hbase.io.hfile.TestHFileSeek
Tests run: 1, Failures: 0, Errors: 0, Skipped: 0, Time elapsed: 8.129 sec
Forking command line: /bin/sh -c cd <https://builds.apache.org/job/HBase-TRUNK/ws/trunk>
&& /home/jenkins/tools/java/jdk1.6.0_27-32/jre/bin/java -enableassertions -Xmx1900m
-Djava.security.egd=file:/dev/./urandom -jar <https://builds.apache.org/job/HBase-TRUNK/ws/trunk/target/surefire/surefirebooter4357437740845755869.jar>
<https://builds.apache.org/job/HBase-TRUNK/ws/trunk/target/surefire/surefire2955413146392291427tmp>
<https://builds.apache.org/job/HBase-TRUNK/ws/trunk/target/surefire/surefire_1008620153044922400229tmp>
Running org.apache.hadoop.hbase.thrift.TestThriftServer
Tests run: 1, Failures: 0, Errors: 0, Skipped: 0, Time elapsed: 63.632 sec
Running org.apache.hadoop.hbase.io.hfile.slab.TestSlabCache
Tests run: 7, Failures: 0, Errors: 0, Skipped: 0, Time elapsed: 19.984 sec
Forking command line: /bin/sh -c cd <https://builds.apache.org/job/HBase-TRUNK/ws/trunk>
&& /home/jenkins/tools/java/jdk1.6.0_27-32/jre/bin/java -enableassertions -Xmx1900m
-Djava.security.egd=file:/dev/./urandom -jar <https://builds.apache.org/job/HBase-TRUNK/ws/trunk/target/surefire/surefirebooter5345626656305842418.jar>
<https://builds.apache.org/job/HBase-TRUNK/ws/trunk/target/surefire/surefire2981023359142289575tmp>
<https://builds.apache.org/job/HBase-TRUNK/ws/trunk/target/surefire/surefire_1018689452173184601371tmp>
Forking command line: /bin/sh -c cd <https://builds.apache.org/job/HBase-TRUNK/ws/trunk>
&& /home/jenkins/tools/java/jdk1.6.0_27-32/jre/bin/java -enableassertions -Xmx1900m
-Djava.security.egd=file:/dev/./urandom -jar <https://builds.apache.org/job/HBase-TRUNK/ws/trunk/target/surefire/surefirebooter5786322131341875986.jar>
<https://builds.apache.org/job/HBase-TRUNK/ws/trunk/target/surefire/surefire9018815178215469253tmp>
<https://builds.apache.org/job/HBase-TRUNK/ws/trunk/target/surefire/surefire_1027819563621474331015tmp>
Running org.apache.hadoop.hbase.io.hfile.TestChecksum
Tests run: 3, Failures: 0, Errors: 0, Skipped: 0, Time elapsed: 0.888 sec
Forking command line: /bin/sh -c cd <https://builds.apache.org/job/HBase-TRUNK/ws/trunk>
&& /home/jenkins/tools/java/jdk1.6.0_27-32/jre/bin/java -enableassertions -Xmx1900m
-Djava.security.egd=file:/dev/./urandom -jar <https://builds.apache.org/job/HBase-TRUNK/ws/trunk/target/surefire/surefirebooter6216820786580159534.jar>
<https://builds.apache.org/job/HBase-TRUNK/ws/trunk/target/surefire/surefire3241091005476340927tmp>
<https://builds.apache.org/job/HBase-TRUNK/ws/trunk/target/surefire/surefire_1034128655975892514886tmp>
Running org.apache.hadoop.hbase.io.hfile.TestHFileBlockIndex
Tests run: 10, Failures: 0, Errors: 0, Skipped: 0, Time elapsed: 11.794 sec
Forking command line: /bin/sh -c cd <https://builds.apache.org/job/HBase-TRUNK/ws/trunk>
&& /home/jenkins/tools/java/jdk1.6.0_27-32/jre/bin/java -enableassertions -Xmx1900m
-Djava.security.egd=file:/dev/./urandom -jar <https://builds.apache.org/job/HBase-TRUNK/ws/trunk/target/surefire/surefirebooter280811228148248281.jar>
<https://builds.apache.org/job/HBase-TRUNK/ws/trunk/target/surefire/surefire9089740508539142883tmp>
<https://builds.apache.org/job/HBase-TRUNK/ws/trunk/target/surefire/surefire_1048087877748094018656tmp>
Running org.apache.hadoop.hbase.io.hfile.TestLruBlockCache
Tests run: 16, Failures: 0, Errors: 0, Skipped: 0, Time elapsed: 0.762 sec
Forking command line: /bin/sh -c cd <https://builds.apache.org/job/HBase-TRUNK/ws/trunk>
&& /home/jenkins/tools/java/jdk1.6.0_27-32/jre/bin/java -enableassertions -Xmx1900m
-Djava.security.egd=file:/dev/./urandom -jar <https://builds.apache.org/job/HBase-TRUNK/ws/trunk/target/surefire/surefirebooter2818726433806167572.jar>
<https://builds.apache.org/job/HBase-TRUNK/ws/trunk/target/surefire/surefire1593454340312579146tmp>
<https://builds.apache.org/job/HBase-TRUNK/ws/trunk/target/surefire/surefire_105370137222815504291tmp>
Running org.apache.hadoop.hbase.io.hfile.TestHFilePerformance
Tests run: 1, Failures: 0, Errors: 0, Skipped: 0, Time elapsed: 6.559 sec
Forking command line: /bin/sh -c cd <https://builds.apache.org/job/HBase-TRUNK/ws/trunk>
&& /home/jenkins/tools/java/jdk1.6.0_27-32/jre/bin/java -enableassertions -Xmx1900m
-Djava.security.egd=file:/dev/./urandom -jar <https://builds.apache.org/job/HBase-TRUNK/ws/trunk/target/surefire/surefirebooter4398331035202537592.jar>
<https://builds.apache.org/job/HBase-TRUNK/ws/trunk/target/surefire/surefire4296946099943394617tmp>
<https://builds.apache.org/job/HBase-TRUNK/ws/trunk/target/surefire/surefire_1067082448499880232271tmp>
Running org.apache.hadoop.hbase.io.hfile.TestFixedFileTrailer
Tests run: 2, Failures: 0, Errors: 0, Skipped: 0, Time elapsed: 0.627 sec
Forking command line: /bin/sh -c cd <https://builds.apache.org/job/HBase-TRUNK/ws/trunk>
&& /home/jenkins/tools/java/jdk1.6.0_27-32/jre/bin/java -enableassertions -Xmx1900m
-Djava.security.egd=file:/dev/./urandom -jar <https://builds.apache.org/job/HBase-TRUNK/ws/trunk/target/surefire/surefirebooter4249606617377752910.jar>
<https://builds.apache.org/job/HBase-TRUNK/ws/trunk/target/surefire/surefire3843800601075482034tmp>
<https://builds.apache.org/job/HBase-TRUNK/ws/trunk/target/surefire/surefire_107424362866499045772tmp>
Running org.apache.hadoop.hbase.io.hfile.TestHFileBlockCompatibility
Tests run: 10, Failures: 0, Errors: 0, Skipped: 0, Time elapsed: 1.158 sec
Forking command line: /bin/sh -c cd <https://builds.apache.org/job/HBase-TRUNK/ws/trunk>
&& /home/jenkins/tools/java/jdk1.6.0_27-32/jre/bin/java -enableassertions -Xmx1900m
-Djava.security.egd=file:/dev/./urandom -jar <https://builds.apache.org/job/HBase-TRUNK/ws/trunk/target/surefire/surefirebooter4663929546327322026.jar>
<https://builds.apache.org/job/HBase-TRUNK/ws/trunk/target/surefire/surefire5107247168580460259tmp>
<https://builds.apache.org/job/HBase-TRUNK/ws/trunk/target/surefire/surefire_1089016434611136928134tmp>
Running org.apache.hadoop.hbase.io.hfile.slab.TestSingleSizeCache
Tests run: 5, Failures: 0, Errors: 0, Skipped: 0, Time elapsed: 25.108 sec
Forking command line: /bin/sh -c cd <https://builds.apache.org/job/HBase-TRUNK/ws/trunk>
&& /home/jenkins/tools/java/jdk1.6.0_27-32/jre/bin/java -enableassertions -Xmx1900m
-Djava.security.egd=file:/dev/./urandom -jar <https://builds.apache.org/job/HBase-TRUNK/ws/trunk/target/surefire/surefirebooter4045649972607216692.jar>
<https://builds.apache.org/job/HBase-TRUNK/ws/trunk/target/surefire/surefire8468597124871490688tmp>
<https://builds.apache.org/job/HBase-TRUNK/ws/trunk/target/surefire/surefire_109429326163111915181tmp>
Running org.apache.hadoop.hbase.io.hfile.TestHFileBlock
Tests run: 16, Failures: 0, Errors: 0, Skipped: 0, Time elapsed: 48.872 sec
Forking command line: /bin/sh -c cd <https://builds.apache.org/job/HBase-TRUNK/ws/trunk>
&& /home/jenkins/tools/java/jdk1.6.0_27-32/jre/bin/java -enableassertions -Xmx1900m
-Djava.security.egd=file:/dev/./urandom -jar <https://builds.apache.org/job/HBase-TRUNK/ws/trunk/target/surefire/surefirebooter2962509299667017037.jar>
<https://builds.apache.org/job/HBase-TRUNK/ws/trunk/target/surefire/surefire3427192444532436140tmp>
<https://builds.apache.org/job/HBase-TRUNK/ws/trunk/target/surefire/surefire_110346675728767285886tmp>
Running org.apache.hadoop.hbase.io.hfile.TestForceCacheImportantBlocks
Tests run: 4, Failures: 0, Errors: 0, Skipped: 0, Time elapsed: 64.47 sec
Forking command line: /bin/sh -c cd <https://builds.apache.org/job/HBase-TRUNK/ws/trunk>
&& /home/jenkins/tools/java/jdk1.6.0_27-32/jre/bin/java -enableassertions -Xmx1900m
-Djava.security.egd=file:/dev/./urandom -jar <https://builds.apache.org/job/HBase-TRUNK/ws/trunk/target/surefire/surefirebooter1726936368610900492.jar>
<https://builds.apache.org/job/HBase-TRUNK/ws/trunk/target/surefire/surefire3862822950005284087tmp>
<https://builds.apache.org/job/HBase-TRUNK/ws/trunk/target/surefire/surefire_1112497689841500921017tmp>
Running org.apache.hadoop.hbase.io.hfile.TestCacheOnWrite
Tests run: 36, Failures: 0, Errors: 0, Skipped: 0, Time elapsed: 34.676 sec
Forking command line: /bin/sh -c cd <https://builds.apache.org/job/HBase-TRUNK/ws/trunk>
&& /home/jenkins/tools/java/jdk1.6.0_27-32/jre/bin/java -enableassertions -Xmx1900m
-Djava.security.egd=file:/dev/./urandom -jar <https://builds.apache.org/job/HBase-TRUNK/ws/trunk/target/surefire/surefirebooter3004598801958072708.jar>
<https://builds.apache.org/job/HBase-TRUNK/ws/trunk/target/surefire/surefire4239481030877485895tmp>
<https://builds.apache.org/job/HBase-TRUNK/ws/trunk/target/surefire/surefire_112169540753153205184tmp>
Running org.apache.hadoop.hbase.replication.regionserver.TestReplicationSourceManager
Tests run: 1, Failures: 0, Errors: 0, Skipped: 0, Time elapsed: 1.2 sec
Forking command line: /bin/sh -c cd <https://builds.apache.org/job/HBase-TRUNK/ws/trunk>
&& /home/jenkins/tools/java/jdk1.6.0_27-32/jre/bin/java -enableassertions -Xmx1900m
-Djava.security.egd=file:/dev/./urandom -jar <https://builds.apache.org/job/HBase-TRUNK/ws/trunk/target/surefire/surefirebooter3773891605810251343.jar>
<https://builds.apache.org/job/HBase-TRUNK/ws/trunk/target/surefire/surefire7368010307105155836tmp>
<https://builds.apache.org/job/HBase-TRUNK/ws/trunk/target/surefire/surefire_1134435859054146896643tmp>
Running org.apache.hadoop.hbase.avro.TestAvroServer
Tests run: 3, Failures: 0, Errors: 0, Skipped: 0, Time elapsed: 30.175 sec
Forking command line: /bin/sh -c cd <https://builds.apache.org/job/HBase-TRUNK/ws/trunk>
&& /home/jenkins/tools/java/jdk1.6.0_27-32/jre/bin/java -enableassertions -Xmx1900m
-Djava.security.egd=file:/dev/./urandom -jar <https://builds.apache.org/job/HBase-TRUNK/ws/trunk/target/surefire/surefirebooter4733778834993927758.jar>
<https://builds.apache.org/job/HBase-TRUNK/ws/trunk/target/surefire/surefire8536605223156194608tmp>
<https://builds.apache.org/job/HBase-TRUNK/ws/trunk/target/surefire/surefire_1142677459560039125354tmp>
Running org.apache.hadoop.hbase.replication.TestReplicationSource
Tests run: 1, Failures: 0, Errors: 0, Skipped: 0, Time elapsed: 2.369 sec
Forking command line: /bin/sh -c cd <https://builds.apache.org/job/HBase-TRUNK/ws/trunk>
&& /home/jenkins/tools/java/jdk1.6.0_27-32/jre/bin/java -enableassertions -Xmx1900m
-Djava.security.egd=file:/dev/./urandom -jar <https://builds.apache.org/job/HBase-TRUNK/ws/trunk/target/surefire/surefirebooter811069159510835974.jar>
<https://builds.apache.org/job/HBase-TRUNK/ws/trunk/target/surefire/surefire8272150335241079945tmp>
<https://builds.apache.org/job/HBase-TRUNK/ws/trunk/target/surefire/surefire_115805029349255969962tmp>
Running org.apache.hadoop.hbase.replication.TestReplicationPeer
Tests run: 1, Failures: 0, Errors: 0, Skipped: 0, Time elapsed: 1.781 sec
Forking command line: /bin/sh -c cd <https://builds.apache.org/job/HBase-TRUNK/ws/trunk>
&& /home/jenkins/tools/java/jdk1.6.0_27-32/jre/bin/java -enableassertions -Xmx1900m
-Djava.security.egd=file:/dev/./urandom -jar <https://builds.apache.org/job/HBase-TRUNK/ws/trunk/target/surefire/surefirebooter5164121437124329182.jar>
<https://builds.apache.org/job/HBase-TRUNK/ws/trunk/target/surefire/surefire5166985827458331715tmp>
<https://builds.apache.org/job/HBase-TRUNK/ws/trunk/target/surefire/surefire_116755821058945868273tmp>
Running org.apache.hadoop.hbase.replication.TestReplicationZookeeper
Tests run: 1, Failures: 0, Errors: 0, Skipped: 0, Time elapsed: 0.689 sec
Forking command line: /bin/sh -c cd <https://builds.apache.org/job/HBase-TRUNK/ws/trunk>
&& /home/jenkins/tools/java/jdk1.6.0_27-32/jre/bin/java -enableassertions -Xmx1900m
-Djava.security.egd=file:/dev/./urandom -jar <https://builds.apache.org/job/HBase-TRUNK/ws/trunk/target/surefire/surefirebooter4532017444718195801.jar>
<https://builds.apache.org/job/HBase-TRUNK/ws/trunk/target/surefire/surefire2170423386156546880tmp>
<https://builds.apache.org/job/HBase-TRUNK/ws/trunk/target/surefire/surefire_1171813045333633618572tmp>
Running org.apache.hadoop.hbase.ipc.TestDelayedRpc
Tests run: 4, Failures: 0, Errors: 0, Skipped: 0, Time elapsed: 2.638 sec
Running org.apache.hadoop.hbase.replication.regionserver.TestReplicationSink
Tests run: 5, Failures: 0, Errors: 0, Skipped: 0, Time elapsed: 31.688 sec

Results :

Tests run: 605, Failures: 0, Errors: 0, Skipped: 2

[INFO] ------------------------------------------------------------------------
[INFO] BUILD FAILURE
[INFO] ------------------------------------------------------------------------
[INFO] Total time: 34:51.949s
[INFO] Finished at: Sat Apr 14 04:54:25 UTC 2012
[INFO] Final Memory: 79M/765M
[INFO] ------------------------------------------------------------------------
[ERROR] Failed to execute goal org.apache.maven.plugins:maven-surefire-plugin:2.12-TRUNK-HBASE-2:test
(secondPartTestsExecution) on project hbase: Failure or timeout -> [Help 1]
org.apache.maven.lifecycle.LifecycleExecutionException: Failed to execute goal org.apache.maven.plugins:maven-surefire-plugin:2.12-TRUNK-HBASE-2:test
(secondPartTestsExecution) on project hbase: Failure or timeout
	at org.apache.maven.lifecycle.internal.MojoExecutor.execute(MojoExecutor.java:217)
	at org.apache.maven.lifecycle.internal.MojoExecutor.execute(MojoExecutor.java:153)
	at org.apache.maven.lifecycle.internal.MojoExecutor.execute(MojoExecutor.java:145)
	at org.apache.maven.lifecycle.internal.LifecycleModuleBuilder.buildProject(LifecycleModuleBuilder.java:84)
	at org.apache.maven.lifecycle.internal.LifecycleModuleBuilder.buildProject(LifecycleModuleBuilder.java:59)
	at org.apache.maven.lifecycle.internal.LifecycleStarter.singleThreadedBuild(LifecycleStarter.java:183)
	at org.apache.maven.lifecycle.internal.LifecycleStarter.execute(LifecycleStarter.java:161)
	at org.apache.maven.DefaultMaven.doExecute(DefaultMaven.java:319)
	at org.apache.maven.DefaultMaven.execute(DefaultMaven.java:156)
	at org.apache.maven.cli.MavenCli.execute(MavenCli.java:537)
	at org.apache.maven.cli.MavenCli.doMain(MavenCli.java:196)
	at org.apache.maven.cli.MavenCli.main(MavenCli.java:141)
	at sun.reflect.NativeMethodAccessorImpl.invoke0(Native Method)
	at sun.reflect.NativeMethodAccessorImpl.invoke(NativeMethodAccessorImpl.java:39)
	at sun.reflect.DelegatingMethodAccessorImpl.invoke(DelegatingMethodAccessorImpl.java:25)
	at java.lang.reflect.Method.invoke(Method.java:597)
	at org.codehaus.plexus.classworlds.launcher.Launcher.launchEnhanced(Launcher.java:290)
	at org.codehaus.plexus.classworlds.launcher.Launcher.launch(Launcher.java:230)
	at org.codehaus.plexus.classworlds.launcher.Launcher.mainWithExitCode(Launcher.java:409)
	at org.codehaus.plexus.classworlds.launcher.Launcher.main(Launcher.java:352)
Caused by: org.apache.maven.plugin.MojoExecutionException: Failure or timeout
	at org.apache.maven.plugin.surefire.SurefirePlugin.assertNoFailureOrTimeout(SurefirePlugin.java:643)
	at org.apache.maven.plugin.surefire.SurefirePlugin.handleSummary(SurefirePlugin.java:624)
	at org.apache.maven.plugin.surefire.AbstractSurefireMojo.executeAfterPreconditionsChecked(AbstractSurefireMojo.java:137)
	at org.apache.maven.plugin.surefire.AbstractSurefireMojo.execute(AbstractSurefireMojo.java:98)
	at org.apache.maven.plugin.DefaultBuildPluginManager.executeMojo(DefaultBuildPluginManager.java:101)
	at org.apache.maven.lifecycle.internal.MojoExecutor.execute(MojoExecutor.java:209)
	... 19 more
[ERROR] 
[ERROR] 
[ERROR] For more information about the errors and possible solutions, please read the following
articles:
[ERROR] [Help 1] http://cwiki.apache.org/confluence/display/MAVEN/MojoExecutionException
Build step 'Invoke top-level Maven targets' marked build as failure
Archiving artifacts
Recording test results

Mime
View raw message