hbase-dev mailing list archives

Site index · List index
Message view « Date » · « Thread »
Top « Date » · « Thread »
From Apache Jenkins Server <jenk...@builds.apache.org>
Subject Build failed in Jenkins: HBase-0.92 #361
Date Sat, 07 Apr 2012 01:49:14 GMT
See <https://builds.apache.org/job/HBase-0.92/361/changes>

Changes:

[jmhsieh] HBASE-5734 Change hbck sideline root (Jimmy Xiang)

------------------------------------------
[...truncated 7005 lines...]
Tests run: 7, Failures: 0, Errors: 0, Skipped: 0, Time elapsed: 17.317 sec
Forking command line: /bin/sh -c cd /x1/jenkins/jenkins-slave/workspace/HBase-0.92/trunk &&
/x1/jenkins/tools/java/jdk1.6.0_27-32/jre/bin/java -enableassertions -Xmx1400m -Djava.security.egd=file:/dev/./urandom
-jar /x1/jenkins/jenkins-slave/workspace/HBase-0.92/trunk/target/surefire/surefirebooter1170872020933973149.jar
/x1/jenkins/jenkins-slave/workspace/HBase-0.92/trunk/target/surefire/surefire6668543571020551188tmp
/x1/jenkins/jenkins-slave/workspace/HBase-0.92/trunk/target/surefire/surefire6913813693987795007tmp
Running org.apache.hadoop.hbase.rest.TestStatusResource
Tests run: 2, Failures: 0, Errors: 0, Skipped: 0, Time elapsed: 16.457 sec
Forking command line: /bin/sh -c cd /x1/jenkins/jenkins-slave/workspace/HBase-0.92/trunk &&
/x1/jenkins/tools/java/jdk1.6.0_27-32/jre/bin/java -enableassertions -Xmx1400m -Djava.security.egd=file:/dev/./urandom
-jar /x1/jenkins/jenkins-slave/workspace/HBase-0.92/trunk/target/surefire/surefirebooter8479799554475769385.jar
/x1/jenkins/jenkins-slave/workspace/HBase-0.92/trunk/target/surefire/surefire3657916544415904522tmp
/x1/jenkins/jenkins-slave/workspace/HBase-0.92/trunk/target/surefire/surefire5278466031688724829tmp
Running org.apache.hadoop.hbase.rest.TestScannersWithFilters
Tests run: 10, Failures: 0, Errors: 0, Skipped: 0, Time elapsed: 24.625 sec
Forking command line: /bin/sh -c cd /x1/jenkins/jenkins-slave/workspace/HBase-0.92/trunk &&
/x1/jenkins/tools/java/jdk1.6.0_27-32/jre/bin/java -enableassertions -Xmx1400m -Djava.security.egd=file:/dev/./urandom
-jar /x1/jenkins/jenkins-slave/workspace/HBase-0.92/trunk/target/surefire/surefirebooter6277213985470624768.jar
/x1/jenkins/jenkins-slave/workspace/HBase-0.92/trunk/target/surefire/surefire3246160715852569681tmp
/x1/jenkins/jenkins-slave/workspace/HBase-0.92/trunk/target/surefire/surefire2199330851686150448tmp
Running org.apache.hadoop.hbase.metrics.TestMetricsMBeanBase
Tests run: 2, Failures: 0, Errors: 0, Skipped: 0, Time elapsed: 1.111 sec
Forking command line: /bin/sh -c cd /x1/jenkins/jenkins-slave/workspace/HBase-0.92/trunk &&
/x1/jenkins/tools/java/jdk1.6.0_27-32/jre/bin/java -enableassertions -Xmx1400m -Djava.security.egd=file:/dev/./urandom
-jar /x1/jenkins/jenkins-slave/workspace/HBase-0.92/trunk/target/surefire/surefirebooter1881917587665145356.jar
/x1/jenkins/jenkins-slave/workspace/HBase-0.92/trunk/target/surefire/surefire388803272746880483tmp
/x1/jenkins/jenkins-slave/workspace/HBase-0.92/trunk/target/surefire/surefire6467396746465427914tmp
Running org.apache.hadoop.hbase.metrics.TestExponentiallyDecayingSample
Tests run: 2, Failures: 0, Errors: 0, Skipped: 0, Time elapsed: 0.167 sec
Forking command line: /bin/sh -c cd /x1/jenkins/jenkins-slave/workspace/HBase-0.92/trunk &&
/x1/jenkins/tools/java/jdk1.6.0_27-32/jre/bin/java -enableassertions -Xmx1400m -Djava.security.egd=file:/dev/./urandom
-jar /x1/jenkins/jenkins-slave/workspace/HBase-0.92/trunk/target/surefire/surefirebooter286422439123169275.jar
/x1/jenkins/jenkins-slave/workspace/HBase-0.92/trunk/target/surefire/surefire6698335504260759558tmp
/x1/jenkins/jenkins-slave/workspace/HBase-0.92/trunk/target/surefire/surefire8792512891236630805tmp
Running org.apache.hadoop.hbase.metrics.TestExactCounterMetric
Tests run: 1, Failures: 0, Errors: 0, Skipped: 0, Time elapsed: 0.109 sec
Forking command line: /bin/sh -c cd /x1/jenkins/jenkins-slave/workspace/HBase-0.92/trunk &&
/x1/jenkins/tools/java/jdk1.6.0_27-32/jre/bin/java -enableassertions -Xmx1400m -Djava.security.egd=file:/dev/./urandom
-jar /x1/jenkins/jenkins-slave/workspace/HBase-0.92/trunk/target/surefire/surefirebooter8409926485580193099.jar
/x1/jenkins/jenkins-slave/workspace/HBase-0.92/trunk/target/surefire/surefire2854694921151703872tmp
/x1/jenkins/jenkins-slave/workspace/HBase-0.92/trunk/target/surefire/surefire9039884004418298929tmp
Running org.apache.hadoop.hbase.metrics.TestMetricsHistogram
Tests run: 2, Failures: 0, Errors: 0, Skipped: 0, Time elapsed: 0.165 sec
Forking command line: /bin/sh -c cd /x1/jenkins/jenkins-slave/workspace/HBase-0.92/trunk &&
/x1/jenkins/tools/java/jdk1.6.0_27-32/jre/bin/java -enableassertions -Xmx1400m -Djava.security.egd=file:/dev/./urandom
-jar /x1/jenkins/jenkins-slave/workspace/HBase-0.92/trunk/target/surefire/surefirebooter8108148826022282558.jar
/x1/jenkins/jenkins-slave/workspace/HBase-0.92/trunk/target/surefire/surefire4298162930916196882tmp
/x1/jenkins/jenkins-slave/workspace/HBase-0.92/trunk/target/surefire/surefire4101169788600231008tmp
Running org.apache.hadoop.hbase.io.hfile.TestHFileWriterV2
Tests run: 1, Failures: 0, Errors: 0, Skipped: 0, Time elapsed: 1.075 sec
Forking command line: /bin/sh -c cd /x1/jenkins/jenkins-slave/workspace/HBase-0.92/trunk &&
/x1/jenkins/tools/java/jdk1.6.0_27-32/jre/bin/java -enableassertions -Xmx1400m -Djava.security.egd=file:/dev/./urandom
-jar /x1/jenkins/jenkins-slave/workspace/HBase-0.92/trunk/target/surefire/surefirebooter6583820691024506149.jar
/x1/jenkins/jenkins-slave/workspace/HBase-0.92/trunk/target/surefire/surefire627674667737824230tmp
/x1/jenkins/jenkins-slave/workspace/HBase-0.92/trunk/target/surefire/surefire434649666551681346tmp
Running org.apache.hadoop.hbase.io.hfile.TestHFile
Tests run: 6, Failures: 0, Errors: 0, Skipped: 0, Time elapsed: 0.866 sec
Forking command line: /bin/sh -c cd /x1/jenkins/jenkins-slave/workspace/HBase-0.92/trunk &&
/x1/jenkins/tools/java/jdk1.6.0_27-32/jre/bin/java -enableassertions -Xmx1400m -Djava.security.egd=file:/dev/./urandom
-jar /x1/jenkins/jenkins-slave/workspace/HBase-0.92/trunk/target/surefire/surefirebooter4386260647080104327.jar
/x1/jenkins/jenkins-slave/workspace/HBase-0.92/trunk/target/surefire/surefire4973496440002911220tmp
/x1/jenkins/jenkins-slave/workspace/HBase-0.92/trunk/target/surefire/surefire994918585828300069tmp
Running org.apache.hadoop.hbase.io.hfile.TestHFileBlockIndex
Tests run: 10, Failures: 0, Errors: 0, Skipped: 0, Time elapsed: 9.448 sec
Forking command line: /bin/sh -c cd /x1/jenkins/jenkins-slave/workspace/HBase-0.92/trunk &&
/x1/jenkins/tools/java/jdk1.6.0_27-32/jre/bin/java -enableassertions -Xmx1400m -Djava.security.egd=file:/dev/./urandom
-jar /x1/jenkins/jenkins-slave/workspace/HBase-0.92/trunk/target/surefire/surefirebooter4845398724787919868.jar
/x1/jenkins/jenkins-slave/workspace/HBase-0.92/trunk/target/surefire/surefire2048699965729435068tmp
/x1/jenkins/jenkins-slave/workspace/HBase-0.92/trunk/target/surefire/surefire3690025552673640402tmp
Running org.apache.hadoop.hbase.io.hfile.TestHFileSeek
Tests run: 1, Failures: 0, Errors: 0, Skipped: 0, Time elapsed: 5.14 sec
Forking command line: /bin/sh -c cd /x1/jenkins/jenkins-slave/workspace/HBase-0.92/trunk &&
/x1/jenkins/tools/java/jdk1.6.0_27-32/jre/bin/java -enableassertions -Xmx1400m -Djava.security.egd=file:/dev/./urandom
-jar /x1/jenkins/jenkins-slave/workspace/HBase-0.92/trunk/target/surefire/surefirebooter2003180406178739188.jar
/x1/jenkins/jenkins-slave/workspace/HBase-0.92/trunk/target/surefire/surefire6771263868172401624tmp
/x1/jenkins/jenkins-slave/workspace/HBase-0.92/trunk/target/surefire/surefire4804490976143661013tmp
Running org.apache.hadoop.hbase.io.hfile.TestLruBlockCache
Tests run: 7, Failures: 0, Errors: 0, Skipped: 0, Time elapsed: 0.358 sec
Forking command line: /bin/sh -c cd /x1/jenkins/jenkins-slave/workspace/HBase-0.92/trunk &&
/x1/jenkins/tools/java/jdk1.6.0_27-32/jre/bin/java -enableassertions -Xmx1400m -Djava.security.egd=file:/dev/./urandom
-jar /x1/jenkins/jenkins-slave/workspace/HBase-0.92/trunk/target/surefire/surefirebooter575570525818200369.jar
/x1/jenkins/jenkins-slave/workspace/HBase-0.92/trunk/target/surefire/surefire7618194353483427713tmp
/x1/jenkins/jenkins-slave/workspace/HBase-0.92/trunk/target/surefire/surefire7202246862643631026tmp
Running org.apache.hadoop.hbase.io.hfile.TestFixedFileTrailer
Tests run: 2, Failures: 0, Errors: 0, Skipped: 0, Time elapsed: 0.684 sec
Forking command line: /bin/sh -c cd /x1/jenkins/jenkins-slave/workspace/HBase-0.92/trunk &&
/x1/jenkins/tools/java/jdk1.6.0_27-32/jre/bin/java -enableassertions -Xmx1400m -Djava.security.egd=file:/dev/./urandom
-jar /x1/jenkins/jenkins-slave/workspace/HBase-0.92/trunk/target/surefire/surefirebooter9019255895691862319.jar
/x1/jenkins/jenkins-slave/workspace/HBase-0.92/trunk/target/surefire/surefire4138144955389661507tmp
/x1/jenkins/jenkins-slave/workspace/HBase-0.92/trunk/target/surefire/surefire5194890866059195388tmp
Running org.apache.hadoop.hbase.io.hfile.TestCachedBlockQueue
Tests run: 2, Failures: 0, Errors: 0, Skipped: 0, Time elapsed: 0.147 sec
Forking command line: /bin/sh -c cd /x1/jenkins/jenkins-slave/workspace/HBase-0.92/trunk &&
/x1/jenkins/tools/java/jdk1.6.0_27-32/jre/bin/java -enableassertions -Xmx1400m -Djava.security.egd=file:/dev/./urandom
-jar /x1/jenkins/jenkins-slave/workspace/HBase-0.92/trunk/target/surefire/surefirebooter4229328621153156897.jar
/x1/jenkins/jenkins-slave/workspace/HBase-0.92/trunk/target/surefire/surefire1693143605772619981tmp
/x1/jenkins/jenkins-slave/workspace/HBase-0.92/trunk/target/surefire/surefire4300572021191925311tmp
Running org.apache.hadoop.hbase.io.hfile.TestHFilePerformance
Tests run: 1, Failures: 0, Errors: 0, Skipped: 0, Time elapsed: 4.697 sec
Forking command line: /bin/sh -c cd /x1/jenkins/jenkins-slave/workspace/HBase-0.92/trunk &&
/x1/jenkins/tools/java/jdk1.6.0_27-32/jre/bin/java -enableassertions -Xmx1400m -Djava.security.egd=file:/dev/./urandom
-jar /x1/jenkins/jenkins-slave/workspace/HBase-0.92/trunk/target/surefire/surefirebooter3716954005377414034.jar
/x1/jenkins/jenkins-slave/workspace/HBase-0.92/trunk/target/surefire/surefire8585747196959870951tmp
/x1/jenkins/jenkins-slave/workspace/HBase-0.92/trunk/target/surefire/surefire8422527093588366096tmp
Running org.apache.hadoop.hbase.io.hfile.TestCacheOnWrite
Tests run: 6, Failures: 0, Errors: 0, Skipped: 0, Time elapsed: 7.127 sec
Forking command line: /bin/sh -c cd /x1/jenkins/jenkins-slave/workspace/HBase-0.92/trunk &&
/x1/jenkins/tools/java/jdk1.6.0_27-32/jre/bin/java -enableassertions -Xmx1400m -Djava.security.egd=file:/dev/./urandom
-jar /x1/jenkins/jenkins-slave/workspace/HBase-0.92/trunk/target/surefire/surefirebooter2240515084754218519.jar
/x1/jenkins/jenkins-slave/workspace/HBase-0.92/trunk/target/surefire/surefire6878314913635168840tmp
/x1/jenkins/jenkins-slave/workspace/HBase-0.92/trunk/target/surefire/surefire4079294822857165378tmp
Running org.apache.hadoop.hbase.io.hfile.TestReseekTo
Tests run: 1, Failures: 0, Errors: 0, Skipped: 0, Time elapsed: 0.726 sec
Forking command line: /bin/sh -c cd /x1/jenkins/jenkins-slave/workspace/HBase-0.92/trunk &&
/x1/jenkins/tools/java/jdk1.6.0_27-32/jre/bin/java -enableassertions -Xmx1400m -Djava.security.egd=file:/dev/./urandom
-jar /x1/jenkins/jenkins-slave/workspace/HBase-0.92/trunk/target/surefire/surefirebooter1170835030735113699.jar
/x1/jenkins/jenkins-slave/workspace/HBase-0.92/trunk/target/surefire/surefire7495260273915711227tmp
/x1/jenkins/jenkins-slave/workspace/HBase-0.92/trunk/target/surefire/surefire5249817654150117841tmp
Running org.apache.hadoop.hbase.io.hfile.TestSeekTo
Tests run: 3, Failures: 0, Errors: 0, Skipped: 0, Time elapsed: 0.709 sec
Forking command line: /bin/sh -c cd /x1/jenkins/jenkins-slave/workspace/HBase-0.92/trunk &&
/x1/jenkins/tools/java/jdk1.6.0_27-32/jre/bin/java -enableassertions -Xmx1400m -Djava.security.egd=file:/dev/./urandom
-jar /x1/jenkins/jenkins-slave/workspace/HBase-0.92/trunk/target/surefire/surefirebooter4440527800302105431.jar
/x1/jenkins/jenkins-slave/workspace/HBase-0.92/trunk/target/surefire/surefire7716405200798053608tmp
/x1/jenkins/jenkins-slave/workspace/HBase-0.92/trunk/target/surefire/surefire483245632940164054tmp
Running org.apache.hadoop.hbase.io.hfile.TestBlockCacheColumnFamilySummary
Tests run: 4, Failures: 0, Errors: 0, Skipped: 0, Time elapsed: 0.059 sec
Forking command line: /bin/sh -c cd /x1/jenkins/jenkins-slave/workspace/HBase-0.92/trunk &&
/x1/jenkins/tools/java/jdk1.6.0_27-32/jre/bin/java -enableassertions -Xmx1400m -Djava.security.egd=file:/dev/./urandom
-jar /x1/jenkins/jenkins-slave/workspace/HBase-0.92/trunk/target/surefire/surefirebooter1353922093172716543.jar
/x1/jenkins/jenkins-slave/workspace/HBase-0.92/trunk/target/surefire/surefire5873310879103591088tmp
/x1/jenkins/jenkins-slave/workspace/HBase-0.92/trunk/target/surefire/surefire5798635711750885183tmp
Running org.apache.hadoop.hbase.io.hfile.TestHFileBlock
Tests run: 7, Failures: 0, Errors: 0, Skipped: 0, Time elapsed: 25.197 sec
Forking command line: /bin/sh -c cd /x1/jenkins/jenkins-slave/workspace/HBase-0.92/trunk &&
/x1/jenkins/tools/java/jdk1.6.0_27-32/jre/bin/java -enableassertions -Xmx1400m -Djava.security.egd=file:/dev/./urandom
-jar /x1/jenkins/jenkins-slave/workspace/HBase-0.92/trunk/target/surefire/surefirebooter8484639519028612907.jar
/x1/jenkins/jenkins-slave/workspace/HBase-0.92/trunk/target/surefire/surefire8749277823594211955tmp
/x1/jenkins/jenkins-slave/workspace/HBase-0.92/trunk/target/surefire/surefire8561946870301524354tmp
Running org.apache.hadoop.hbase.io.hfile.slab.TestSlabCache
Tests run: 7, Failures: 0, Errors: 0, Skipped: 0, Time elapsed: 15.124 sec
Forking command line: /bin/sh -c cd /x1/jenkins/jenkins-slave/workspace/HBase-0.92/trunk &&
/x1/jenkins/tools/java/jdk1.6.0_27-32/jre/bin/java -enableassertions -Xmx1400m -Djava.security.egd=file:/dev/./urandom
-jar /x1/jenkins/jenkins-slave/workspace/HBase-0.92/trunk/target/surefire/surefirebooter4994182305894007411.jar
/x1/jenkins/jenkins-slave/workspace/HBase-0.92/trunk/target/surefire/surefire8435876075316170646tmp
/x1/jenkins/jenkins-slave/workspace/HBase-0.92/trunk/target/surefire/surefire3346228427749856047tmp
Running org.apache.hadoop.hbase.io.hfile.slab.TestSingleSizeCache
Tests run: 5, Failures: 0, Errors: 0, Skipped: 0, Time elapsed: 19.516 sec
Forking command line: /bin/sh -c cd /x1/jenkins/jenkins-slave/workspace/HBase-0.92/trunk &&
/x1/jenkins/tools/java/jdk1.6.0_27-32/jre/bin/java -enableassertions -Xmx1400m -Djava.security.egd=file:/dev/./urandom
-jar /x1/jenkins/jenkins-slave/workspace/HBase-0.92/trunk/target/surefire/surefirebooter5034054442342572796.jar
/x1/jenkins/jenkins-slave/workspace/HBase-0.92/trunk/target/surefire/surefire8935602051697251667tmp
/x1/jenkins/jenkins-slave/workspace/HBase-0.92/trunk/target/surefire/surefire3426380707205123581tmp
Running org.apache.hadoop.hbase.io.hfile.slab.TestSlab
Tests run: 1, Failures: 0, Errors: 0, Skipped: 0, Time elapsed: 0.113 sec
Forking command line: /bin/sh -c cd /x1/jenkins/jenkins-slave/workspace/HBase-0.92/trunk &&
/x1/jenkins/tools/java/jdk1.6.0_27-32/jre/bin/java -enableassertions -Xmx1400m -Djava.security.egd=file:/dev/./urandom
-jar /x1/jenkins/jenkins-slave/workspace/HBase-0.92/trunk/target/surefire/surefirebooter1910665497278676502.jar
/x1/jenkins/jenkins-slave/workspace/HBase-0.92/trunk/target/surefire/surefire7398668552331440463tmp
/x1/jenkins/jenkins-slave/workspace/HBase-0.92/trunk/target/surefire/surefire2832857564510595164tmp
Running org.apache.hadoop.hbase.io.hfile.TestHFileReaderV1
Tests run: 1, Failures: 0, Errors: 0, Skipped: 0, Time elapsed: 0.454 sec
Forking command line: /bin/sh -c cd /x1/jenkins/jenkins-slave/workspace/HBase-0.92/trunk &&
/x1/jenkins/tools/java/jdk1.6.0_27-32/jre/bin/java -enableassertions -Xmx1400m -Djava.security.egd=file:/dev/./urandom
-jar /x1/jenkins/jenkins-slave/workspace/HBase-0.92/trunk/target/surefire/surefirebooter3142862597737830366.jar
/x1/jenkins/jenkins-slave/workspace/HBase-0.92/trunk/target/surefire/surefire5251711213935609503tmp
/x1/jenkins/jenkins-slave/workspace/HBase-0.92/trunk/target/surefire/surefire6431109102541017552tmp
Running org.apache.hadoop.hbase.io.TestHalfStoreFileReader
Tests run: 1, Failures: 0, Errors: 0, Skipped: 0, Time elapsed: 0.668 sec
Forking command line: /bin/sh -c cd /x1/jenkins/jenkins-slave/workspace/HBase-0.92/trunk &&
/x1/jenkins/tools/java/jdk1.6.0_27-32/jre/bin/java -enableassertions -Xmx1400m -Djava.security.egd=file:/dev/./urandom
-jar /x1/jenkins/jenkins-slave/workspace/HBase-0.92/trunk/target/surefire/surefirebooter6342054175258688263.jar
/x1/jenkins/jenkins-slave/workspace/HBase-0.92/trunk/target/surefire/surefire9141173045060926071tmp
/x1/jenkins/jenkins-slave/workspace/HBase-0.92/trunk/target/surefire/surefire3360270636522304880tmp
Running org.apache.hadoop.hbase.io.TestHbaseObjectWritable
Tests run: 5, Failures: 0, Errors: 0, Skipped: 0, Time elapsed: 0.413 sec
Forking command line: /bin/sh -c cd /x1/jenkins/jenkins-slave/workspace/HBase-0.92/trunk &&
/x1/jenkins/tools/java/jdk1.6.0_27-32/jre/bin/java -enableassertions -Xmx1400m -Djava.security.egd=file:/dev/./urandom
-jar /x1/jenkins/jenkins-slave/workspace/HBase-0.92/trunk/target/surefire/surefirebooter6357594758365029195.jar
/x1/jenkins/jenkins-slave/workspace/HBase-0.92/trunk/target/surefire/surefire3669397677304296416tmp
/x1/jenkins/jenkins-slave/workspace/HBase-0.92/trunk/target/surefire/surefire2713929112852469394tmp
Running org.apache.hadoop.hbase.io.TestImmutableBytesWritable
Tests run: 3, Failures: 0, Errors: 0, Skipped: 0, Time elapsed: 0.084 sec
Forking command line: /bin/sh -c cd /x1/jenkins/jenkins-slave/workspace/HBase-0.92/trunk &&
/x1/jenkins/tools/java/jdk1.6.0_27-32/jre/bin/java -enableassertions -Xmx1400m -Djava.security.egd=file:/dev/./urandom
-jar /x1/jenkins/jenkins-slave/workspace/HBase-0.92/trunk/target/surefire/surefirebooter2328540296447245198.jar
/x1/jenkins/jenkins-slave/workspace/HBase-0.92/trunk/target/surefire/surefire4043255163682685712tmp
/x1/jenkins/jenkins-slave/workspace/HBase-0.92/trunk/target/surefire/surefire3956988878833906802tmp
Running org.apache.hadoop.hbase.io.TestHeapSize
Tests run: 2, Failures: 0, Errors: 0, Skipped: 0, Time elapsed: 0.132 sec
Forking command line: /bin/sh -c cd /x1/jenkins/jenkins-slave/workspace/HBase-0.92/trunk &&
/x1/jenkins/tools/java/jdk1.6.0_27-32/jre/bin/java -enableassertions -Xmx1400m -Djava.security.egd=file:/dev/./urandom
-jar /x1/jenkins/jenkins-slave/workspace/HBase-0.92/trunk/target/surefire/surefirebooter4870180195597146202.jar
/x1/jenkins/jenkins-slave/workspace/HBase-0.92/trunk/target/surefire/surefire4632558972111503046tmp
/x1/jenkins/jenkins-slave/workspace/HBase-0.92/trunk/target/surefire/surefire5225281105147019960tmp
Running org.apache.hadoop.hbase.TestRegionRebalancing
Tests run: 1, Failures: 0, Errors: 0, Skipped: 0, Time elapsed: 46.95 sec
Forking command line: /bin/sh -c cd /x1/jenkins/jenkins-slave/workspace/HBase-0.92/trunk &&
/x1/jenkins/tools/java/jdk1.6.0_27-32/jre/bin/java -enableassertions -Xmx1400m -Djava.security.egd=file:/dev/./urandom
-jar /x1/jenkins/jenkins-slave/workspace/HBase-0.92/trunk/target/surefire/surefirebooter7718612390845334723.jar
/x1/jenkins/jenkins-slave/workspace/HBase-0.92/trunk/target/surefire/surefire8082869190726306562tmp
/x1/jenkins/jenkins-slave/workspace/HBase-0.92/trunk/target/surefire/surefire4284885737172910568tmp
Running org.apache.hadoop.hbase.mapred.TestTableInputFormat
Tests run: 6, Failures: 0, Errors: 0, Skipped: 0, Time elapsed: 27.907 sec
Forking command line: /bin/sh -c cd /x1/jenkins/jenkins-slave/workspace/HBase-0.92/trunk &&
/x1/jenkins/tools/java/jdk1.6.0_27-32/jre/bin/java -enableassertions -Xmx1400m -Djava.security.egd=file:/dev/./urandom
-jar /x1/jenkins/jenkins-slave/workspace/HBase-0.92/trunk/target/surefire/surefirebooter5035121489234119124.jar
/x1/jenkins/jenkins-slave/workspace/HBase-0.92/trunk/target/surefire/surefire3743944649670366922tmp
/x1/jenkins/jenkins-slave/workspace/HBase-0.92/trunk/target/surefire/surefire5427798919595875307tmp
Running org.apache.hadoop.hbase.mapred.TestTableMapReduce
Tests run: 1, Failures: 0, Errors: 0, Skipped: 0, Time elapsed: 66.525 sec
Forking command line: /bin/sh -c cd /x1/jenkins/jenkins-slave/workspace/HBase-0.92/trunk &&
/x1/jenkins/tools/java/jdk1.6.0_27-32/jre/bin/java -enableassertions -Xmx1400m -Djava.security.egd=file:/dev/./urandom
-jar /x1/jenkins/jenkins-slave/workspace/HBase-0.92/trunk/target/surefire/surefirebooter8085994644704779632.jar
/x1/jenkins/jenkins-slave/workspace/HBase-0.92/trunk/target/surefire/surefire2172946596015099314tmp
/x1/jenkins/jenkins-slave/workspace/HBase-0.92/trunk/target/surefire/surefire3402802100088943127tmp
Running org.apache.hadoop.hbase.replication.TestReplicationZookeeper
Tests run: 1, Failures: 0, Errors: 0, Skipped: 0, Time elapsed: 0.548 sec
Forking command line: /bin/sh -c cd /x1/jenkins/jenkins-slave/workspace/HBase-0.92/trunk &&
/x1/jenkins/tools/java/jdk1.6.0_27-32/jre/bin/java -enableassertions -Xmx1400m -Djava.security.egd=file:/dev/./urandom
-jar /x1/jenkins/jenkins-slave/workspace/HBase-0.92/trunk/target/surefire/surefirebooter1373588504897700954.jar
/x1/jenkins/jenkins-slave/workspace/HBase-0.92/trunk/target/surefire/surefire8889712554519332679tmp
/x1/jenkins/jenkins-slave/workspace/HBase-0.92/trunk/target/surefire/surefire6419645430631284606tmp
Running org.apache.hadoop.hbase.replication.regionserver.TestReplicationSink
Tests run: 5, Failures: 0, Errors: 0, Skipped: 0, Time elapsed: 20.108 sec
Forking command line: /bin/sh -c cd /x1/jenkins/jenkins-slave/workspace/HBase-0.92/trunk &&
/x1/jenkins/tools/java/jdk1.6.0_27-32/jre/bin/java -enableassertions -Xmx1400m -Djava.security.egd=file:/dev/./urandom
-jar /x1/jenkins/jenkins-slave/workspace/HBase-0.92/trunk/target/surefire/surefirebooter7700076460448198093.jar
/x1/jenkins/jenkins-slave/workspace/HBase-0.92/trunk/target/surefire/surefire3280946536953688969tmp
/x1/jenkins/jenkins-slave/workspace/HBase-0.92/trunk/target/surefire/surefire7139267968887596651tmp
Running org.apache.hadoop.hbase.replication.regionserver.TestReplicationSourceManager
Tests run: 1, Failures: 0, Errors: 0, Skipped: 0, Time elapsed: 0.907 sec
Forking command line: /bin/sh -c cd /x1/jenkins/jenkins-slave/workspace/HBase-0.92/trunk &&
/x1/jenkins/tools/java/jdk1.6.0_27-32/jre/bin/java -enableassertions -Xmx1400m -Djava.security.egd=file:/dev/./urandom
-jar /x1/jenkins/jenkins-slave/workspace/HBase-0.92/trunk/target/surefire/surefirebooter7022722785998385725.jar
/x1/jenkins/jenkins-slave/workspace/HBase-0.92/trunk/target/surefire/surefire1011564971142348591tmp
/x1/jenkins/jenkins-slave/workspace/HBase-0.92/trunk/target/surefire/surefire5553978312808622626tmp
Running org.apache.hadoop.hbase.replication.TestReplicationSource
Tests run: 1, Failures: 0, Errors: 0, Skipped: 0, Time elapsed: 2.169 sec
Forking command line: /bin/sh -c cd /x1/jenkins/jenkins-slave/workspace/HBase-0.92/trunk &&
/x1/jenkins/tools/java/jdk1.6.0_27-32/jre/bin/java -enableassertions -Xmx1400m -Djava.security.egd=file:/dev/./urandom
-jar /x1/jenkins/jenkins-slave/workspace/HBase-0.92/trunk/target/surefire/surefirebooter7919497074532733354.jar
/x1/jenkins/jenkins-slave/workspace/HBase-0.92/trunk/target/surefire/surefire5349739306249962715tmp
/x1/jenkins/jenkins-slave/workspace/HBase-0.92/trunk/target/surefire/surefire6288584335456304643tmp
Running org.apache.hadoop.hbase.replication.TestReplication
Tests run: 8, Failures: 0, Errors: 0, Skipped: 0, Time elapsed: 125.798 sec
Forking command line: /bin/sh -c cd /x1/jenkins/jenkins-slave/workspace/HBase-0.92/trunk &&
/x1/jenkins/tools/java/jdk1.6.0_27-32/jre/bin/java -enableassertions -Xmx1400m -Djava.security.egd=file:/dev/./urandom
-jar /x1/jenkins/jenkins-slave/workspace/HBase-0.92/trunk/target/surefire/surefirebooter3172050243192169113.jar
/x1/jenkins/jenkins-slave/workspace/HBase-0.92/trunk/target/surefire/surefire616109928473946914tmp
/x1/jenkins/jenkins-slave/workspace/HBase-0.92/trunk/target/surefire/surefire8647345184583297921tmp
Running org.apache.hadoop.hbase.replication.TestReplicationPeer
Tests run: 1, Failures: 0, Errors: 0, Skipped: 0, Time elapsed: 25.483 sec
Forking command line: /bin/sh -c cd /x1/jenkins/jenkins-slave/workspace/HBase-0.92/trunk &&
/x1/jenkins/tools/java/jdk1.6.0_27-32/jre/bin/java -enableassertions -Xmx1400m -Djava.security.egd=file:/dev/./urandom
-jar /x1/jenkins/jenkins-slave/workspace/HBase-0.92/trunk/target/surefire/surefirebooter7106904135628329769.jar
/x1/jenkins/jenkins-slave/workspace/HBase-0.92/trunk/target/surefire/surefire5511639100024377148tmp
/x1/jenkins/jenkins-slave/workspace/HBase-0.92/trunk/target/surefire/surefire6655991454790379825tmp
Running org.apache.hadoop.hbase.replication.TestMultiSlaveReplication
Tests run: 1, Failures: 0, Errors: 0, Skipped: 0, Time elapsed: 57.741 sec
Forking command line: /bin/sh -c cd /x1/jenkins/jenkins-slave/workspace/HBase-0.92/trunk &&
/x1/jenkins/tools/java/jdk1.6.0_27-32/jre/bin/java -enableassertions -Xmx1400m -Djava.security.egd=file:/dev/./urandom
-jar /x1/jenkins/jenkins-slave/workspace/HBase-0.92/trunk/target/surefire/surefirebooter1509852301782999891.jar
/x1/jenkins/jenkins-slave/workspace/HBase-0.92/trunk/target/surefire/surefire4679854547786722109tmp
/x1/jenkins/jenkins-slave/workspace/HBase-0.92/trunk/target/surefire/surefire8176746827628538840tmp
Running org.apache.hadoop.hbase.replication.TestMasterReplication
Tests run: 2, Failures: 0, Errors: 0, Skipped: 0, Time elapsed: 88.332 sec
Forking command line: /bin/sh -c cd /x1/jenkins/jenkins-slave/workspace/HBase-0.92/trunk &&
/x1/jenkins/tools/java/jdk1.6.0_27-32/jre/bin/java -enableassertions -Xmx1400m -Djava.security.egd=file:/dev/./urandom
-jar /x1/jenkins/jenkins-slave/workspace/HBase-0.92/trunk/target/surefire/surefirebooter4630782781760422009.jar
/x1/jenkins/jenkins-slave/workspace/HBase-0.92/trunk/target/surefire/surefire6786550134511672195tmp
/x1/jenkins/jenkins-slave/workspace/HBase-0.92/trunk/target/surefire/surefire1378304904014688513tmp
Running org.apache.hadoop.hbase.util.TestHBaseFsckComparator
Tests run: 6, Failures: 0, Errors: 0, Skipped: 0, Time elapsed: 0.14 sec
Forking command line: /bin/sh -c cd /x1/jenkins/jenkins-slave/workspace/HBase-0.92/trunk &&
/x1/jenkins/tools/java/jdk1.6.0_27-32/jre/bin/java -enableassertions -Xmx1400m -Djava.security.egd=file:/dev/./urandom
-jar /x1/jenkins/jenkins-slave/workspace/HBase-0.92/trunk/target/surefire/surefirebooter4110042613983549533.jar
/x1/jenkins/jenkins-slave/workspace/HBase-0.92/trunk/target/surefire/surefire8024445743014380471tmp
/x1/jenkins/jenkins-slave/workspace/HBase-0.92/trunk/target/surefire/surefire2479206214275463227tmp
Running org.apache.hadoop.hbase.util.TestMergeTool
Tests run: 1, Failures: 0, Errors: 0, Skipped: 0, Time elapsed: 338.649 sec
Forking command line: /bin/sh -c cd /x1/jenkins/jenkins-slave/workspace/HBase-0.92/trunk &&
/x1/jenkins/tools/java/jdk1.6.0_27-32/jre/bin/java -enableassertions -Xmx1400m -Djava.security.egd=file:/dev/./urandom
-jar /x1/jenkins/jenkins-slave/workspace/HBase-0.92/trunk/target/surefire/surefirebooter3122558466888262520.jar
/x1/jenkins/jenkins-slave/workspace/HBase-0.92/trunk/target/surefire/surefire2626459818632424820tmp
/x1/jenkins/jenkins-slave/workspace/HBase-0.92/trunk/target/surefire/surefire2035892103188004104tmp
Running org.apache.hadoop.hbase.util.TestFSTableDescriptors
Tests run: 10, Failures: 0, Errors: 0, Skipped: 0, Time elapsed: 0.732 sec
Forking command line: /bin/sh -c cd /x1/jenkins/jenkins-slave/workspace/HBase-0.92/trunk &&
/x1/jenkins/tools/java/jdk1.6.0_27-32/jre/bin/java -enableassertions -Xmx1400m -Djava.security.egd=file:/dev/./urandom
-jar /x1/jenkins/jenkins-slave/workspace/HBase-0.92/trunk/target/surefire/surefirebooter2054772927001005397.jar
/x1/jenkins/jenkins-slave/workspace/HBase-0.92/trunk/target/surefire/surefire1723011284272559711tmp
/x1/jenkins/jenkins-slave/workspace/HBase-0.92/trunk/target/surefire/surefire4148054941767906746tmp
Running org.apache.hadoop.hbase.util.TestIdLock
Tests run: 1, Failures: 0, Errors: 0, Skipped: 0, Time elapsed: 15.217 sec
Forking command line: /bin/sh -c cd /x1/jenkins/jenkins-slave/workspace/HBase-0.92/trunk &&
/x1/jenkins/tools/java/jdk1.6.0_27-32/jre/bin/java -enableassertions -Xmx1400m -Djava.security.egd=file:/dev/./urandom
-jar /x1/jenkins/jenkins-slave/workspace/HBase-0.92/trunk/target/surefire/surefirebooter3281773232875241636.jar
/x1/jenkins/jenkins-slave/workspace/HBase-0.92/trunk/target/surefire/surefire1756503666593036606tmp
/x1/jenkins/jenkins-slave/workspace/HBase-0.92/trunk/target/surefire/surefire6777676348741635645tmp
Running org.apache.hadoop.hbase.util.TestCompressionTest
Tests run: 1, Failures: 0, Errors: 0, Skipped: 0, Time elapsed: 0.3 sec
Forking command line: /bin/sh -c cd /x1/jenkins/jenkins-slave/workspace/HBase-0.92/trunk &&
/x1/jenkins/tools/java/jdk1.6.0_27-32/jre/bin/java -enableassertions -Xmx1400m -Djava.security.egd=file:/dev/./urandom
-jar /x1/jenkins/jenkins-slave/workspace/HBase-0.92/trunk/target/surefire/surefirebooter906492006085481108.jar
/x1/jenkins/jenkins-slave/workspace/HBase-0.92/trunk/target/surefire/surefire6998768940220880802tmp
/x1/jenkins/jenkins-slave/workspace/HBase-0.92/trunk/target/surefire/surefire7389583437204004204tmp
Running org.apache.hadoop.hbase.util.TestBytes
Tests run: 13, Failures: 0, Errors: 0, Skipped: 0, Time elapsed: 0.103 sec
Forking command line: /bin/sh -c cd /x1/jenkins/jenkins-slave/workspace/HBase-0.92/trunk &&
/x1/jenkins/tools/java/jdk1.6.0_27-32/jre/bin/java -enableassertions -Xmx1400m -Djava.security.egd=file:/dev/./urandom
-jar /x1/jenkins/jenkins-slave/workspace/HBase-0.92/trunk/target/surefire/surefirebooter5989294600298236801.jar
/x1/jenkins/jenkins-slave/workspace/HBase-0.92/trunk/target/surefire/surefire8908231641437267207tmp
/x1/jenkins/jenkins-slave/workspace/HBase-0.92/trunk/target/surefire/surefire5245570223384797578tmp
Running org.apache.hadoop.hbase.util.TestSortedCopyOnWriteSet
Tests run: 2, Failures: 0, Errors: 0, Skipped: 0, Time elapsed: 0.056 sec
Forking command line: /bin/sh -c cd /x1/jenkins/jenkins-slave/workspace/HBase-0.92/trunk &&
/x1/jenkins/tools/java/jdk1.6.0_27-32/jre/bin/java -enableassertions -Xmx1400m -Djava.security.egd=file:/dev/./urandom
-jar /x1/jenkins/jenkins-slave/workspace/HBase-0.92/trunk/target/surefire/surefirebooter2575885830686891473.jar
/x1/jenkins/jenkins-slave/workspace/HBase-0.92/trunk/target/surefire/surefire5334841444884962493tmp
/x1/jenkins/jenkins-slave/workspace/HBase-0.92/trunk/target/surefire/surefire1507710299470327037tmp
Running org.apache.hadoop.hbase.util.TestEnvironmentEdgeManager
Tests run: 2, Failures: 0, Errors: 0, Skipped: 0, Time elapsed: 0.18 sec
Forking command line: /bin/sh -c cd /x1/jenkins/jenkins-slave/workspace/HBase-0.92/trunk &&
/x1/jenkins/tools/java/jdk1.6.0_27-32/jre/bin/java -enableassertions -Xmx1400m -Djava.security.egd=file:/dev/./urandom
-jar /x1/jenkins/jenkins-slave/workspace/HBase-0.92/trunk/target/surefire/surefirebooter4109355867924236118.jar
/x1/jenkins/jenkins-slave/workspace/HBase-0.92/trunk/target/surefire/surefire6812496809631934398tmp
/x1/jenkins/jenkins-slave/workspace/HBase-0.92/trunk/target/surefire/surefire6366511589912305169tmp
Running org.apache.hadoop.hbase.util.TestKeying
Tests run: 1, Failures: 0, Errors: 0, Skipped: 0, Time elapsed: 0.034 sec
Forking command line: /bin/sh -c cd /x1/jenkins/jenkins-slave/workspace/HBase-0.92/trunk &&
/x1/jenkins/tools/java/jdk1.6.0_27-32/jre/bin/java -enableassertions -Xmx1400m -Djava.security.egd=file:/dev/./urandom
-jar /x1/jenkins/jenkins-slave/workspace/HBase-0.92/trunk/target/surefire/surefirebooter3941919961921318871.jar
/x1/jenkins/jenkins-slave/workspace/HBase-0.92/trunk/target/surefire/surefire523650582382988321tmp
/x1/jenkins/jenkins-slave/workspace/HBase-0.92/trunk/target/surefire/surefire6002838630667221762tmp
Running org.apache.hadoop.hbase.util.TestByteBloomFilter
Tests run: 5, Failures: 0, Errors: 0, Skipped: 0, Time elapsed: 0.848 sec
Forking command line: /bin/sh -c cd /x1/jenkins/jenkins-slave/workspace/HBase-0.92/trunk &&
/x1/jenkins/tools/java/jdk1.6.0_27-32/jre/bin/java -enableassertions -Xmx1400m -Djava.security.egd=file:/dev/./urandom
-jar /x1/jenkins/jenkins-slave/workspace/HBase-0.92/trunk/target/surefire/surefirebooter5275513271823601594.jar
/x1/jenkins/jenkins-slave/workspace/HBase-0.92/trunk/target/surefire/surefire5753221883447794490tmp
/x1/jenkins/jenkins-slave/workspace/HBase-0.92/trunk/target/surefire/surefire7315057240632780079tmp
Running org.apache.hadoop.hbase.util.TestRootPath
Tests run: 1, Failures: 0, Errors: 0, Skipped: 0, Time elapsed: 0.087 sec
Forking command line: /bin/sh -c cd /x1/jenkins/jenkins-slave/workspace/HBase-0.92/trunk &&
/x1/jenkins/tools/java/jdk1.6.0_27-32/jre/bin/java -enableassertions -Xmx1400m -Djava.security.egd=file:/dev/./urandom
-jar /x1/jenkins/jenkins-slave/workspace/HBase-0.92/trunk/target/surefire/surefirebooter9196069184495114537.jar
/x1/jenkins/jenkins-slave/workspace/HBase-0.92/trunk/target/surefire/surefire242570922604547224tmp
/x1/jenkins/jenkins-slave/workspace/HBase-0.92/trunk/target/surefire/surefire8050245514981513502tmp
Running org.apache.hadoop.hbase.util.TestMergeTable
Tests run: 1, Failures: 0, Errors: 0, Skipped: 0, Time elapsed: 29.129 sec
Forking command line: /bin/sh -c cd /x1/jenkins/jenkins-slave/workspace/HBase-0.92/trunk &&
/x1/jenkins/tools/java/jdk1.6.0_27-32/jre/bin/java -enableassertions -Xmx1400m -Djava.security.egd=file:/dev/./urandom
-jar /x1/jenkins/jenkins-slave/workspace/HBase-0.92/trunk/target/surefire/surefirebooter4394750173027446617.jar
/x1/jenkins/jenkins-slave/workspace/HBase-0.92/trunk/target/surefire/surefire8940212321375684303tmp
/x1/jenkins/jenkins-slave/workspace/HBase-0.92/trunk/target/surefire/surefire6070301127329492145tmp
Running org.apache.hadoop.hbase.util.TestHBaseFsck
Tests run: 14, Failures: 0, Errors: 0, Skipped: 0, Time elapsed: 175.076 sec
Forking command line: /bin/sh -c cd /x1/jenkins/jenkins-slave/workspace/HBase-0.92/trunk &&
/x1/jenkins/tools/java/jdk1.6.0_27-32/jre/bin/java -enableassertions -Xmx1400m -Djava.security.egd=file:/dev/./urandom
-jar /x1/jenkins/jenkins-slave/workspace/HBase-0.92/trunk/target/surefire/surefirebooter4618506515198572497.jar
/x1/jenkins/jenkins-slave/workspace/HBase-0.92/trunk/target/surefire/surefire2020397333642237702tmp
/x1/jenkins/jenkins-slave/workspace/HBase-0.92/trunk/target/surefire/surefire6057932591410731748tmp
Running org.apache.hadoop.hbase.util.TestFSUtils
Tests run: 2, Failures: 0, Errors: 0, Skipped: 0, Time elapsed: 19.672 sec
Forking command line: /bin/sh -c cd /x1/jenkins/jenkins-slave/workspace/HBase-0.92/trunk &&
/x1/jenkins/tools/java/jdk1.6.0_27-32/jre/bin/java -enableassertions -Xmx1400m -Djava.security.egd=file:/dev/./urandom
-jar /x1/jenkins/jenkins-slave/workspace/HBase-0.92/trunk/target/surefire/surefirebooter2803417398206709526.jar
/x1/jenkins/jenkins-slave/workspace/HBase-0.92/trunk/target/surefire/surefire1247272201810385724tmp
/x1/jenkins/jenkins-slave/workspace/HBase-0.92/trunk/target/surefire/surefire4360371824399552292tmp
Running org.apache.hadoop.hbase.util.TestPoolMap
Tests run: 9, Failures: 0, Errors: 0, Skipped: 0, Time elapsed: 0.05 sec
Forking command line: /bin/sh -c cd /x1/jenkins/jenkins-slave/workspace/HBase-0.92/trunk &&
/x1/jenkins/tools/java/jdk1.6.0_27-32/jre/bin/java -enableassertions -Xmx1400m -Djava.security.egd=file:/dev/./urandom
-jar /x1/jenkins/jenkins-slave/workspace/HBase-0.92/trunk/target/surefire/surefirebooter6152791966188491939.jar
/x1/jenkins/jenkins-slave/workspace/HBase-0.92/trunk/target/surefire/surefire8202835268743855833tmp
/x1/jenkins/jenkins-slave/workspace/HBase-0.92/trunk/target/surefire/surefire3724813516741946824tmp
Running org.apache.hadoop.hbase.util.TestBase64
Tests run: 1, Failures: 0, Errors: 0, Skipped: 0, Time elapsed: 0.078 sec
Forking command line: /bin/sh -c cd /x1/jenkins/jenkins-slave/workspace/HBase-0.92/trunk &&
/x1/jenkins/tools/java/jdk1.6.0_27-32/jre/bin/java -enableassertions -Xmx1400m -Djava.security.egd=file:/dev/./urandom
-jar /x1/jenkins/jenkins-slave/workspace/HBase-0.92/trunk/target/surefire/surefirebooter411814608327691838.jar
/x1/jenkins/jenkins-slave/workspace/HBase-0.92/trunk/target/surefire/surefire1492313512055277815tmp
/x1/jenkins/jenkins-slave/workspace/HBase-0.92/trunk/target/surefire/surefire2807144474479418728tmp
Running org.apache.hadoop.hbase.util.hbck.TestOfflineMetaRebuildBase
Tests run: 1, Failures: 0, Errors: 0, Skipped: 0, Time elapsed: 35.294 sec
Forking command line: /bin/sh -c cd /x1/jenkins/jenkins-slave/workspace/HBase-0.92/trunk &&
/x1/jenkins/tools/java/jdk1.6.0_27-32/jre/bin/java -enableassertions -Xmx1400m -Djava.security.egd=file:/dev/./urandom
-jar /x1/jenkins/jenkins-slave/workspace/HBase-0.92/trunk/target/surefire/surefirebooter5505300251186611815.jar
/x1/jenkins/jenkins-slave/workspace/HBase-0.92/trunk/target/surefire/surefire7771104688950678867tmp
/x1/jenkins/jenkins-slave/workspace/HBase-0.92/trunk/target/surefire/surefire2418466724386345367tmp
Running org.apache.hadoop.hbase.util.hbck.TestOfflineMetaRebuildOverlap
Tests run: 1, Failures: 0, Errors: 0, Skipped: 0, Time elapsed: 34.379 sec
Forking command line: /bin/sh -c cd /x1/jenkins/jenkins-slave/workspace/HBase-0.92/trunk &&
/x1/jenkins/tools/java/jdk1.6.0_27-32/jre/bin/java -enableassertions -Xmx1400m -Djava.security.egd=file:/dev/./urandom
-jar /x1/jenkins/jenkins-slave/workspace/HBase-0.92/trunk/target/surefire/surefirebooter4057815243468934732.jar
/x1/jenkins/jenkins-slave/workspace/HBase-0.92/trunk/target/surefire/surefire7477171367745188384tmp
/x1/jenkins/jenkins-slave/workspace/HBase-0.92/trunk/target/surefire/surefire4850724456215393952tmp
Running org.apache.hadoop.hbase.util.hbck.TestOfflineMetaRebuildHole
Tests run: 1, Failures: 0, Errors: 0, Skipped: 0, Time elapsed: 33.847 sec
Forking command line: /bin/sh -c cd /x1/jenkins/jenkins-slave/workspace/HBase-0.92/trunk &&
/x1/jenkins/tools/java/jdk1.6.0_27-32/jre/bin/java -enableassertions -Xmx1400m -Djava.security.egd=file:/dev/./urandom
-jar /x1/jenkins/jenkins-slave/workspace/HBase-0.92/trunk/target/surefire/surefirebooter6787655878949864752.jar
/x1/jenkins/jenkins-slave/workspace/HBase-0.92/trunk/target/surefire/surefire6661578392831951626tmp
/x1/jenkins/jenkins-slave/workspace/HBase-0.92/trunk/target/surefire/surefire566150167993686497tmp
Running org.apache.hadoop.hbase.util.TestDefaultEnvironmentEdge
Tests run: 1, Failures: 0, Errors: 0, Skipped: 0, Time elapsed: 0.044 sec
Forking command line: /bin/sh -c cd /x1/jenkins/jenkins-slave/workspace/HBase-0.92/trunk &&
/x1/jenkins/tools/java/jdk1.6.0_27-32/jre/bin/java -enableassertions -Xmx1400m -Djava.security.egd=file:/dev/./urandom
-jar /x1/jenkins/jenkins-slave/workspace/HBase-0.92/trunk/target/surefire/surefirebooter817764468077558562.jar
/x1/jenkins/jenkins-slave/workspace/HBase-0.92/trunk/target/surefire/surefire1733385523196380612tmp
/x1/jenkins/jenkins-slave/workspace/HBase-0.92/trunk/target/surefire/surefire2959593304159795859tmp
Running org.apache.hadoop.hbase.util.TestIncrementingEnvironmentEdge
Tests run: 1, Failures: 0, Errors: 0, Skipped: 0, Time elapsed: 0.043 sec
Forking command line: /bin/sh -c cd /x1/jenkins/jenkins-slave/workspace/HBase-0.92/trunk &&
/x1/jenkins/tools/java/jdk1.6.0_27-32/jre/bin/java -enableassertions -Xmx1400m -Djava.security.egd=file:/dev/./urandom
-jar /x1/jenkins/jenkins-slave/workspace/HBase-0.92/trunk/target/surefire/surefirebooter1551643659127191544.jar
/x1/jenkins/jenkins-slave/workspace/HBase-0.92/trunk/target/surefire/surefire599797797916168161tmp
/x1/jenkins/jenkins-slave/workspace/HBase-0.92/trunk/target/surefire/surefire4150024860315970523tmp
Running org.apache.hadoop.hbase.util.TestRegionSplitCalculator
Tests run: 14, Failures: 0, Errors: 0, Skipped: 0, Time elapsed: 0.192 sec
Forking command line: /bin/sh -c cd /x1/jenkins/jenkins-slave/workspace/HBase-0.92/trunk &&
/x1/jenkins/tools/java/jdk1.6.0_27-32/jre/bin/java -enableassertions -Xmx1400m -Djava.security.egd=file:/dev/./urandom
-jar /x1/jenkins/jenkins-slave/workspace/HBase-0.92/trunk/target/surefire/surefirebooter7223066516417386603.jar
/x1/jenkins/jenkins-slave/workspace/HBase-0.92/trunk/target/surefire/surefire4446413689191544091tmp
/x1/jenkins/jenkins-slave/workspace/HBase-0.92/trunk/target/surefire/surefire6672795260914372787tmp
Running org.apache.hadoop.hbase.TestHRegionLocation
Tests run: 3, Failures: 0, Errors: 0, Skipped: 0, Time elapsed: 0.12 sec
Forking command line: /bin/sh -c cd /x1/jenkins/jenkins-slave/workspace/HBase-0.92/trunk &&
/x1/jenkins/tools/java/jdk1.6.0_27-32/jre/bin/java -enableassertions -Xmx1400m -Djava.security.egd=file:/dev/./urandom
-jar /x1/jenkins/jenkins-slave/workspace/HBase-0.92/trunk/target/surefire/surefirebooter3760429742510492163.jar
/x1/jenkins/jenkins-slave/workspace/HBase-0.92/trunk/target/surefire/surefire8939956582020498727tmp
/x1/jenkins/jenkins-slave/workspace/HBase-0.92/trunk/target/surefire/surefire6803736999223865012tmp
Running org.apache.hadoop.hbase.migration.TestMigrationFrom090To092
Tests run: 1, Failures: 0, Errors: 0, Skipped: 0, Time elapsed: 0.199 sec
Forking command line: /bin/sh -c cd /x1/jenkins/jenkins-slave/workspace/HBase-0.92/trunk &&
/x1/jenkins/tools/java/jdk1.6.0_27-32/jre/bin/java -enableassertions -Xmx1400m -Djava.security.egd=file:/dev/./urandom
-jar /x1/jenkins/jenkins-slave/workspace/HBase-0.92/trunk/target/surefire/surefirebooter2985802561013938305.jar
/x1/jenkins/jenkins-slave/workspace/HBase-0.92/trunk/target/surefire/surefire5546143131127338651tmp
/x1/jenkins/jenkins-slave/workspace/HBase-0.92/trunk/target/surefire/surefire8774170379834340737tmp
Running org.apache.hadoop.hbase.TestCompare
Tests run: 1, Failures: 0, Errors: 0, Skipped: 0, Time elapsed: 0.179 sec
Forking command line: /bin/sh -c cd /x1/jenkins/jenkins-slave/workspace/HBase-0.92/trunk &&
/x1/jenkins/tools/java/jdk1.6.0_27-32/jre/bin/java -enableassertions -Xmx1400m -Djava.security.egd=file:/dev/./urandom
-jar /x1/jenkins/jenkins-slave/workspace/HBase-0.92/trunk/target/surefire/surefirebooter151792895507918916.jar
/x1/jenkins/jenkins-slave/workspace/HBase-0.92/trunk/target/surefire/surefire6333851408443871169tmp
/x1/jenkins/jenkins-slave/workspace/HBase-0.92/trunk/target/surefire/surefire6733889520454643364tmp
Running org.apache.hadoop.hbase.TestInfoServers
Tests run: 2, Failures: 0, Errors: 0, Skipped: 0, Time elapsed: 17.211 sec
Forking command line: /bin/sh -c cd /x1/jenkins/jenkins-slave/workspace/HBase-0.92/trunk &&
/x1/jenkins/tools/java/jdk1.6.0_27-32/jre/bin/java -enableassertions -Xmx1400m -Djava.security.egd=file:/dev/./urandom
-jar /x1/jenkins/jenkins-slave/workspace/HBase-0.92/trunk/target/surefire/surefirebooter5628635141728468829.jar
/x1/jenkins/jenkins-slave/workspace/HBase-0.92/trunk/target/surefire/surefire2152199590660506207tmp
/x1/jenkins/jenkins-slave/workspace/HBase-0.92/trunk/target/surefire/surefire620898433698376816tmp
Running org.apache.hadoop.hbase.TestHServerAddress
Tests run: 6, Failures: 0, Errors: 0, Skipped: 0, Time elapsed: 0.053 sec
Forking command line: /bin/sh -c cd /x1/jenkins/jenkins-slave/workspace/HBase-0.92/trunk &&
/x1/jenkins/tools/java/jdk1.6.0_27-32/jre/bin/java -enableassertions -Xmx1400m -Djava.security.egd=file:/dev/./urandom
-jar /x1/jenkins/jenkins-slave/workspace/HBase-0.92/trunk/target/surefire/surefirebooter1222827914298698623.jar
/x1/jenkins/jenkins-slave/workspace/HBase-0.92/trunk/target/surefire/surefire1298473431963885571tmp
/x1/jenkins/jenkins-slave/workspace/HBase-0.92/trunk/target/surefire/surefire1781352884081520158tmp
Running org.apache.hadoop.hbase.TestServerName
Tests run: 4, Failures: 0, Errors: 0, Skipped: 0, Time elapsed: 0.105 sec

Results :

Tests run: 1101, Failures: 0, Errors: 0, Skipped: 8

[INFO] ------------------------------------------------------------------------
[INFO] BUILD FAILURE
[INFO] ------------------------------------------------------------------------
[INFO] Total time: 2:06:45.069s
[INFO] Finished at: Sat Apr 07 01:49:08 UTC 2012
[INFO] Final Memory: 55M/881M
[INFO] ------------------------------------------------------------------------
[ERROR] Failed to execute goal org.apache.maven.plugins:maven-surefire-plugin:2.10:test (default-test)
on project hbase: Failure or timeout -> [Help 1]
org.apache.maven.lifecycle.LifecycleExecutionException: Failed to execute goal org.apache.maven.plugins:maven-surefire-plugin:2.10:test
(default-test) on project hbase: Failure or timeout
	at org.apache.maven.lifecycle.internal.MojoExecutor.execute(MojoExecutor.java:217)
	at org.apache.maven.lifecycle.internal.MojoExecutor.execute(MojoExecutor.java:153)
	at org.apache.maven.lifecycle.internal.MojoExecutor.execute(MojoExecutor.java:145)
	at org.apache.maven.lifecycle.internal.LifecycleModuleBuilder.buildProject(LifecycleModuleBuilder.java:84)
	at org.apache.maven.lifecycle.internal.LifecycleModuleBuilder.buildProject(LifecycleModuleBuilder.java:59)
	at org.apache.maven.lifecycle.internal.LifecycleStarter.singleThreadedBuild(LifecycleStarter.java:183)
	at org.apache.maven.lifecycle.internal.LifecycleStarter.execute(LifecycleStarter.java:161)
	at org.apache.maven.DefaultMaven.doExecute(DefaultMaven.java:319)
	at org.apache.maven.DefaultMaven.execute(DefaultMaven.java:156)
	at org.apache.maven.cli.MavenCli.execute(MavenCli.java:537)
	at org.apache.maven.cli.MavenCli.doMain(MavenCli.java:196)
	at org.apache.maven.cli.MavenCli.main(MavenCli.java:141)
	at sun.reflect.NativeMethodAccessorImpl.invoke0(Native Method)
	at sun.reflect.NativeMethodAccessorImpl.invoke(NativeMethodAccessorImpl.java:39)
	at sun.reflect.DelegatingMethodAccessorImpl.invoke(DelegatingMethodAccessorImpl.java:25)
	at java.lang.reflect.Method.invoke(Method.java:597)
	at org.codehaus.plexus.classworlds.launcher.Launcher.launchEnhanced(Launcher.java:290)
	at org.codehaus.plexus.classworlds.launcher.Launcher.launch(Launcher.java:230)
	at org.codehaus.plexus.classworlds.launcher.Launcher.mainWithExitCode(Launcher.java:409)
	at org.codehaus.plexus.classworlds.launcher.Launcher.main(Launcher.java:352)
Caused by: org.apache.maven.plugin.MojoExecutionException: Failure or timeout
	at org.apache.maven.plugin.surefire.SurefirePlugin.assertNoFailureOrTimeout(SurefirePlugin.java:633)
	at org.apache.maven.plugin.surefire.SurefirePlugin.handleSummary(SurefirePlugin.java:614)
	at org.apache.maven.plugin.surefire.AbstractSurefireMojo.executeAfterPreconditionsChecked(AbstractSurefireMojo.java:137)
	at org.apache.maven.plugin.surefire.AbstractSurefireMojo.execute(AbstractSurefireMojo.java:98)
	at org.apache.maven.plugin.DefaultBuildPluginManager.executeMojo(DefaultBuildPluginManager.java:101)
	at org.apache.maven.lifecycle.internal.MojoExecutor.execute(MojoExecutor.java:209)
	... 19 more
[ERROR] 
[ERROR] 
[ERROR] For more information about the errors and possible solutions, please read the following
articles:
[ERROR] [Help 1] http://cwiki.apache.org/confluence/display/MAVEN/MojoExecutionException
Build step 'Invoke top-level Maven targets' marked build as failure
Archiving artifacts
Updating HBASE-5734
Recording test results

Mime
View raw message