hbase-dev mailing list archives

Site index · List index
Message view « Date » · « Thread »
Top « Date » · « Thread »
From Apache Jenkins Server <jenk...@builds.apache.org>
Subject Build failed in Jenkins: HBase-0.94 #124
Date Tue, 17 Apr 2012 03:08:22 GMT
See <https://builds.apache.org/job/HBase-0.94/124/>

------------------------------------------
[...truncated 18994 lines...]
Forking command line: /bin/sh -c cd <https://builds.apache.org/job/HBase-0.94/ws/trunk>
&& /home/hudson/tools/java/jdk1.6.0_27-32/jre/bin/java -enableassertions -Xmx1900m
-Djava.security.egd=file:/dev/./urandom -jar <https://builds.apache.org/job/HBase-0.94/ws/trunk/target/surefire/surefirebooter6894024268329594089.jar>
<https://builds.apache.org/job/HBase-0.94/ws/trunk/target/surefire/surefire5021517216548577990tmp>
<https://builds.apache.org/job/HBase-0.94/ws/trunk/target/surefire/surefire_608802423759214347517tmp>
Running org.apache.hadoop.hbase.util.TestMergeTable
Tests run: 1, Failures: 0, Errors: 0, Skipped: 0, Time elapsed: 36.327 sec
Forking command line: /bin/sh -c cd <https://builds.apache.org/job/HBase-0.94/ws/trunk>
&& /home/hudson/tools/java/jdk1.6.0_27-32/jre/bin/java -enableassertions -Xmx1900m
-Djava.security.egd=file:/dev/./urandom -jar <https://builds.apache.org/job/HBase-0.94/ws/trunk/target/surefire/surefirebooter2352725089622822258.jar>
<https://builds.apache.org/job/HBase-0.94/ws/trunk/target/surefire/surefire7776036116470213573tmp>
<https://builds.apache.org/job/HBase-0.94/ws/trunk/target/surefire/surefire_613780835038456582056tmp>
Running org.apache.hadoop.hbase.util.hbck.TestOfflineMetaRebuildOverlap
Tests run: 1, Failures: 0, Errors: 0, Skipped: 0, Time elapsed: 24.681 sec
Forking command line: /bin/sh -c cd <https://builds.apache.org/job/HBase-0.94/ws/trunk>
&& /home/hudson/tools/java/jdk1.6.0_27-32/jre/bin/java -enableassertions -Xmx1900m
-Djava.security.egd=file:/dev/./urandom -jar <https://builds.apache.org/job/HBase-0.94/ws/trunk/target/surefire/surefirebooter1705721621301422461.jar>
<https://builds.apache.org/job/HBase-0.94/ws/trunk/target/surefire/surefire6603207689430313555tmp>
<https://builds.apache.org/job/HBase-0.94/ws/trunk/target/surefire/surefire_621940252702812669186tmp>
Running org.apache.hadoop.hbase.util.hbck.TestOfflineMetaRebuildBase
Tests run: 1, Failures: 0, Errors: 0, Skipped: 0, Time elapsed: 28.401 sec
Forking command line: /bin/sh -c cd <https://builds.apache.org/job/HBase-0.94/ws/trunk>
&& /home/hudson/tools/java/jdk1.6.0_27-32/jre/bin/java -enableassertions -Xmx1900m
-Djava.security.egd=file:/dev/./urandom -jar <https://builds.apache.org/job/HBase-0.94/ws/trunk/target/surefire/surefirebooter2494135901525041830.jar>
<https://builds.apache.org/job/HBase-0.94/ws/trunk/target/surefire/surefire6879253773514055028tmp>
<https://builds.apache.org/job/HBase-0.94/ws/trunk/target/surefire/surefire_636605125817893399259tmp>
Running org.apache.hadoop.hbase.util.TestPoolMap$TestRoundRobinPoolType
Tests run: 3, Failures: 0, Errors: 0, Skipped: 0, Time elapsed: 0.014 sec
Running org.apache.hadoop.hbase.util.TestPoolMap$TestThreadLocalPoolType
Tests run: 3, Failures: 0, Errors: 0, Skipped: 0, Time elapsed: 0.019 sec
Running org.apache.hadoop.hbase.util.TestPoolMap$TestReusablePoolType
Tests run: 3, Failures: 0, Errors: 0, Skipped: 0, Time elapsed: 0.05 sec
Forking command line: /bin/sh -c cd <https://builds.apache.org/job/HBase-0.94/ws/trunk>
&& /home/hudson/tools/java/jdk1.6.0_27-32/jre/bin/java -enableassertions -Xmx1900m
-Djava.security.egd=file:/dev/./urandom -jar <https://builds.apache.org/job/HBase-0.94/ws/trunk/target/surefire/surefirebooter525654249155073767.jar>
<https://builds.apache.org/job/HBase-0.94/ws/trunk/target/surefire/surefire7089247378642145502tmp>
<https://builds.apache.org/job/HBase-0.94/ws/trunk/target/surefire/surefire_642825835333283201271tmp>
Running org.apache.hadoop.hbase.util.TestIdLock
Tests run: 1, Failures: 0, Errors: 0, Skipped: 0, Time elapsed: 15.342 sec
Forking command line: /bin/sh -c cd <https://builds.apache.org/job/HBase-0.94/ws/trunk>
&& /home/hudson/tools/java/jdk1.6.0_27-32/jre/bin/java -enableassertions -Xmx1900m
-Djava.security.egd=file:/dev/./urandom -jar <https://builds.apache.org/job/HBase-0.94/ws/trunk/target/surefire/surefirebooter1007356011939740703.jar>
<https://builds.apache.org/job/HBase-0.94/ws/trunk/target/surefire/surefire4707153766054520677tmp>
<https://builds.apache.org/job/HBase-0.94/ws/trunk/target/surefire/surefire_657330282384637710212tmp>
Running org.apache.hadoop.hbase.util.hbck.TestOfflineMetaRebuildHole
Tests run: 1, Failures: 0, Errors: 0, Skipped: 0, Time elapsed: 24.026 sec
Forking command line: /bin/sh -c cd <https://builds.apache.org/job/HBase-0.94/ws/trunk>
&& /home/hudson/tools/java/jdk1.6.0_27-32/jre/bin/java -enableassertions -Xmx1900m
-Djava.security.egd=file:/dev/./urandom -jar <https://builds.apache.org/job/HBase-0.94/ws/trunk/target/surefire/surefirebooter8526010393686593922.jar>
<https://builds.apache.org/job/HBase-0.94/ws/trunk/target/surefire/surefire8255589768327346004tmp>
<https://builds.apache.org/job/HBase-0.94/ws/trunk/target/surefire/surefire_661338772985855200871tmp>
Running org.apache.hadoop.hbase.util.TestDefaultEnvironmentEdge
Tests run: 1, Failures: 0, Errors: 0, Skipped: 0, Time elapsed: 0.196 sec
Forking command line: /bin/sh -c cd <https://builds.apache.org/job/HBase-0.94/ws/trunk>
&& /home/hudson/tools/java/jdk1.6.0_27-32/jre/bin/java -enableassertions -Xmx1900m
-Djava.security.egd=file:/dev/./urandom -jar <https://builds.apache.org/job/HBase-0.94/ws/trunk/target/surefire/surefirebooter5139578397934853450.jar>
<https://builds.apache.org/job/HBase-0.94/ws/trunk/target/surefire/surefire2022908686131980551tmp>
<https://builds.apache.org/job/HBase-0.94/ws/trunk/target/surefire/surefire_672811440772548598944tmp>
Running org.apache.hadoop.hbase.util.TestFSTableDescriptors
Tests run: 10, Failures: 0, Errors: 0, Skipped: 0, Time elapsed: 0.977 sec
Forking command line: /bin/sh -c cd <https://builds.apache.org/job/HBase-0.94/ws/trunk>
&& /home/hudson/tools/java/jdk1.6.0_27-32/jre/bin/java -enableassertions -Xmx1900m
-Djava.security.egd=file:/dev/./urandom -jar <https://builds.apache.org/job/HBase-0.94/ws/trunk/target/surefire/surefirebooter3732453582158731378.jar>
<https://builds.apache.org/job/HBase-0.94/ws/trunk/target/surefire/surefire5405326222689406160tmp>
<https://builds.apache.org/job/HBase-0.94/ws/trunk/target/surefire/surefire_682015994286807445715tmp>
Running org.apache.hadoop.hbase.util.TestEnvironmentEdgeManager
Tests run: 2, Failures: 0, Errors: 0, Skipped: 0, Time elapsed: 0.681 sec
Forking command line: /bin/sh -c cd <https://builds.apache.org/job/HBase-0.94/ws/trunk>
&& /home/hudson/tools/java/jdk1.6.0_27-32/jre/bin/java -enableassertions -Xmx1900m
-Djava.security.egd=file:/dev/./urandom -jar <https://builds.apache.org/job/HBase-0.94/ws/trunk/target/surefire/surefirebooter1858188109496171962.jar>
<https://builds.apache.org/job/HBase-0.94/ws/trunk/target/surefire/surefire4217758312711485848tmp>
<https://builds.apache.org/job/HBase-0.94/ws/trunk/target/surefire/surefire_69758783265742577867tmp>
Running org.apache.hadoop.hbase.util.TestRegionSplitter
Tests run: 5, Failures: 0, Errors: 0, Skipped: 0, Time elapsed: 53.526 sec
Forking command line: /bin/sh -c cd <https://builds.apache.org/job/HBase-0.94/ws/trunk>
&& /home/hudson/tools/java/jdk1.6.0_27-32/jre/bin/java -enableassertions -Xmx1900m
-Djava.security.egd=file:/dev/./urandom -jar <https://builds.apache.org/job/HBase-0.94/ws/trunk/target/surefire/surefirebooter8970125300611090745.jar>
<https://builds.apache.org/job/HBase-0.94/ws/trunk/target/surefire/surefire6955469278447391924tmp>
<https://builds.apache.org/job/HBase-0.94/ws/trunk/target/surefire/surefire_707217023639307983674tmp>
Running org.apache.hadoop.hbase.regionserver.TestStoreFileBlockCacheSummary
Tests run: 1, Failures: 0, Errors: 0, Skipped: 0, Time elapsed: 23.489 sec
Forking command line: /bin/sh -c cd <https://builds.apache.org/job/HBase-0.94/ws/trunk>
&& /home/hudson/tools/java/jdk1.6.0_27-32/jre/bin/java -enableassertions -Xmx1900m
-Djava.security.egd=file:/dev/./urandom -jar <https://builds.apache.org/job/HBase-0.94/ws/trunk/target/surefire/surefirebooter6026121224382370340.jar>
<https://builds.apache.org/job/HBase-0.94/ws/trunk/target/surefire/surefire6347811594432947307tmp>
<https://builds.apache.org/job/HBase-0.94/ws/trunk/target/surefire/surefire_712200147961066777742tmp>
Running org.apache.hadoop.hbase.regionserver.TestStore
Tests run: 12, Failures: 0, Errors: 0, Skipped: 0, Time elapsed: 9.451 sec
Forking command line: /bin/sh -c cd <https://builds.apache.org/job/HBase-0.94/ws/trunk>
&& /home/hudson/tools/java/jdk1.6.0_27-32/jre/bin/java -enableassertions -Xmx1900m
-Djava.security.egd=file:/dev/./urandom -jar <https://builds.apache.org/job/HBase-0.94/ws/trunk/target/surefire/surefirebooter2743311992910677572.jar>
<https://builds.apache.org/job/HBase-0.94/ws/trunk/target/surefire/surefire7171130005023962952tmp>
<https://builds.apache.org/job/HBase-0.94/ws/trunk/target/surefire/surefire_726001834516201228464tmp>
Running org.apache.hadoop.hbase.regionserver.TestRegionServerMetrics
Tests run: 1, Failures: 0, Errors: 0, Skipped: 0, Time elapsed: 51.803 sec
Forking command line: /bin/sh -c cd <https://builds.apache.org/job/HBase-0.94/ws/trunk>
&& /home/hudson/tools/java/jdk1.6.0_27-32/jre/bin/java -enableassertions -Xmx1900m
-Djava.security.egd=file:/dev/./urandom -jar <https://builds.apache.org/job/HBase-0.94/ws/trunk/target/surefire/surefirebooter8073757481445662731.jar>
<https://builds.apache.org/job/HBase-0.94/ws/trunk/target/surefire/surefire1955297325345989653tmp>
<https://builds.apache.org/job/HBase-0.94/ws/trunk/target/surefire/surefire_734431761810469585468tmp>
Running org.apache.hadoop.hbase.regionserver.handler.TestOpenRegionHandler
Tests run: 3, Failures: 0, Errors: 0, Skipped: 0, Time elapsed: 1.541 sec
Forking command line: /bin/sh -c cd <https://builds.apache.org/job/HBase-0.94/ws/trunk>
&& /home/hudson/tools/java/jdk1.6.0_27-32/jre/bin/java -enableassertions -Xmx1900m
-Djava.security.egd=file:/dev/./urandom -jar <https://builds.apache.org/job/HBase-0.94/ws/trunk/target/surefire/surefirebooter4765202327632633215.jar>
<https://builds.apache.org/job/HBase-0.94/ws/trunk/target/surefire/surefire1925674513924065821tmp>
<https://builds.apache.org/job/HBase-0.94/ws/trunk/target/surefire/surefire_742903991315923922098tmp>
Running org.apache.hadoop.hbase.regionserver.handler.TestCloseRegionHandler
Tests run: 3, Failures: 0, Errors: 0, Skipped: 0, Time elapsed: 1.973 sec
Forking command line: /bin/sh -c cd <https://builds.apache.org/job/HBase-0.94/ws/trunk>
&& /home/hudson/tools/java/jdk1.6.0_27-32/jre/bin/java -enableassertions -Xmx1900m
-Djava.security.egd=file:/dev/./urandom -jar <https://builds.apache.org/job/HBase-0.94/ws/trunk/target/surefire/surefirebooter5534067678112041249.jar>
<https://builds.apache.org/job/HBase-0.94/ws/trunk/target/surefire/surefire9163301057496939856tmp>
<https://builds.apache.org/job/HBase-0.94/ws/trunk/target/surefire/surefire_752059361063163025451tmp>
Running org.apache.hadoop.hbase.regionserver.TestParallelPut
Tests run: 2, Failures: 0, Errors: 0, Skipped: 0, Time elapsed: 5.284 sec
Forking command line: /bin/sh -c cd <https://builds.apache.org/job/HBase-0.94/ws/trunk>
&& /home/hudson/tools/java/jdk1.6.0_27-32/jre/bin/java -enableassertions -Xmx1900m
-Djava.security.egd=file:/dev/./urandom -jar <https://builds.apache.org/job/HBase-0.94/ws/trunk/target/surefire/surefirebooter4425818920218768092.jar>
<https://builds.apache.org/job/HBase-0.94/ws/trunk/target/surefire/surefire791188664627233832tmp>
<https://builds.apache.org/job/HBase-0.94/ws/trunk/target/surefire/surefire_766113175356649472208tmp>
Running org.apache.hadoop.hbase.regionserver.TestServerCustomProtocol
Tests run: 7, Failures: 0, Errors: 0, Skipped: 0, Time elapsed: 22.977 sec
Forking command line: /bin/sh -c cd <https://builds.apache.org/job/HBase-0.94/ws/trunk>
&& /home/hudson/tools/java/jdk1.6.0_27-32/jre/bin/java -enableassertions -Xmx1900m
-Djava.security.egd=file:/dev/./urandom -jar <https://builds.apache.org/job/HBase-0.94/ws/trunk/target/surefire/surefirebooter475607620583599906.jar>
<https://builds.apache.org/job/HBase-0.94/ws/trunk/target/surefire/surefire6935430240479852933tmp>
<https://builds.apache.org/job/HBase-0.94/ws/trunk/target/surefire/surefire_777338755856585923792tmp>
Running org.apache.hadoop.hbase.regionserver.TestAtomicOperation
Tests run: 5, Failures: 0, Errors: 0, Skipped: 0, Time elapsed: 27.208 sec
Forking command line: /bin/sh -c cd <https://builds.apache.org/job/HBase-0.94/ws/trunk>
&& /home/hudson/tools/java/jdk1.6.0_27-32/jre/bin/java -enableassertions -Xmx1900m
-Djava.security.egd=file:/dev/./urandom -jar <https://builds.apache.org/job/HBase-0.94/ws/trunk/target/surefire/surefirebooter5012659249422144037.jar>
<https://builds.apache.org/job/HBase-0.94/ws/trunk/target/surefire/surefire2692137601165787517tmp>
<https://builds.apache.org/job/HBase-0.94/ws/trunk/target/surefire/surefire_784944117268725252224tmp>
Running org.apache.hadoop.hbase.regionserver.TestBlocksRead
Tests run: 4, Failures: 0, Errors: 0, Skipped: 0, Time elapsed: 1.022 sec
Forking command line: /bin/sh -c cd <https://builds.apache.org/job/HBase-0.94/ws/trunk>
&& /home/hudson/tools/java/jdk1.6.0_27-32/jre/bin/java -enableassertions -Xmx1900m
-Djava.security.egd=file:/dev/./urandom -jar <https://builds.apache.org/job/HBase-0.94/ws/trunk/target/surefire/surefirebooter62933742753397870.jar>
<https://builds.apache.org/job/HBase-0.94/ws/trunk/target/surefire/surefire7184109561504522173tmp>
<https://builds.apache.org/job/HBase-0.94/ws/trunk/target/surefire/surefire_793335912913193905072tmp>
Running org.apache.hadoop.hbase.regionserver.TestMasterAddressManager
Tests run: 1, Failures: 0, Errors: 0, Skipped: 0, Time elapsed: 0.67 sec
Forking command line: /bin/sh -c cd <https://builds.apache.org/job/HBase-0.94/ws/trunk>
&& /home/hudson/tools/java/jdk1.6.0_27-32/jre/bin/java -enableassertions -Xmx1900m
-Djava.security.egd=file:/dev/./urandom -jar <https://builds.apache.org/job/HBase-0.94/ws/trunk/target/surefire/surefirebooter2960087819408693894.jar>
<https://builds.apache.org/job/HBase-0.94/ws/trunk/target/surefire/surefire8818178472061489345tmp>
<https://builds.apache.org/job/HBase-0.94/ws/trunk/target/surefire/surefire_804201023539192608538tmp>
Running org.apache.hadoop.hbase.regionserver.wal.TestWALReplayCompressed
Tests run: 5, Failures: 0, Errors: 0, Skipped: 0, Time elapsed: 42.12 sec
Forking command line: /bin/sh -c cd <https://builds.apache.org/job/HBase-0.94/ws/trunk>
&& /home/hudson/tools/java/jdk1.6.0_27-32/jre/bin/java -enableassertions -Xmx1900m
-Djava.security.egd=file:/dev/./urandom -jar <https://builds.apache.org/job/HBase-0.94/ws/trunk/target/surefire/surefirebooter5115920885217621825.jar>
<https://builds.apache.org/job/HBase-0.94/ws/trunk/target/surefire/surefire4824541046030698257tmp>
<https://builds.apache.org/job/HBase-0.94/ws/trunk/target/surefire/surefire_812045206136603997692tmp>
Running org.apache.hadoop.hbase.regionserver.wal.TestWALReplay
Tests run: 5, Failures: 0, Errors: 0, Skipped: 0, Time elapsed: 36.286 sec
Running org.apache.hadoop.hbase.util.TestHBaseFsck
Tests run: 16, Failures: 0, Errors: 0, Skipped: 0, Time elapsed: 516.449 sec
Forking command line: /bin/sh -c cd <https://builds.apache.org/job/HBase-0.94/ws/trunk>
&& /home/hudson/tools/java/jdk1.6.0_27-32/jre/bin/java -enableassertions -Xmx1900m
-Djava.security.egd=file:/dev/./urandom -jar <https://builds.apache.org/job/HBase-0.94/ws/trunk/target/surefire/surefirebooter1982497836616757960.jar>
<https://builds.apache.org/job/HBase-0.94/ws/trunk/target/surefire/surefire1305396486866171454tmp>
<https://builds.apache.org/job/HBase-0.94/ws/trunk/target/surefire/surefire_828703557909142878573tmp>
Running org.apache.hadoop.hbase.regionserver.wal.TestLogRollingNoCluster
Tests run: 1, Failures: 0, Errors: 0, Skipped: 0, Time elapsed: 2.394 sec
Forking command line: /bin/sh -c cd <https://builds.apache.org/job/HBase-0.94/ws/trunk>
&& /home/hudson/tools/java/jdk1.6.0_27-32/jre/bin/java -enableassertions -Xmx1900m
-Djava.security.egd=file:/dev/./urandom -jar <https://builds.apache.org/job/HBase-0.94/ws/trunk/target/surefire/surefirebooter2305200807864531480.jar>
<https://builds.apache.org/job/HBase-0.94/ws/trunk/target/surefire/surefire7878615141115399254tmp>
<https://builds.apache.org/job/HBase-0.94/ws/trunk/target/surefire/surefire_83135439151278489695tmp>
Running org.apache.hadoop.hbase.regionserver.wal.TestHLogBench
Tests run: 1, Failures: 0, Errors: 0, Skipped: 0, Time elapsed: 2.467 sec
Forking command line: /bin/sh -c cd <https://builds.apache.org/job/HBase-0.94/ws/trunk>
&& /home/hudson/tools/java/jdk1.6.0_27-32/jre/bin/java -enableassertions -Xmx1900m
-Djava.security.egd=file:/dev/./urandom -jar <https://builds.apache.org/job/HBase-0.94/ws/trunk/target/surefire/surefirebooter5871224065507075302.jar>
<https://builds.apache.org/job/HBase-0.94/ws/trunk/target/surefire/surefire5071887115943626401tmp>
<https://builds.apache.org/job/HBase-0.94/ws/trunk/target/surefire/surefire_844094565100278214516tmp>
Running org.apache.hadoop.hbase.regionserver.wal.TestLogRollAbort
Tests run: 1, Failures: 0, Errors: 0, Skipped: 0, Time elapsed: 23.883 sec
Forking command line: /bin/sh -c cd <https://builds.apache.org/job/HBase-0.94/ws/trunk>
&& /home/hudson/tools/java/jdk1.6.0_27-32/jre/bin/java -enableassertions -Xmx1900m
-Djava.security.egd=file:/dev/./urandom -jar <https://builds.apache.org/job/HBase-0.94/ws/trunk/target/surefire/surefirebooter5467262237897060902.jar>
<https://builds.apache.org/job/HBase-0.94/ws/trunk/target/surefire/surefire1862760632398737520tmp>
<https://builds.apache.org/job/HBase-0.94/ws/trunk/target/surefire/surefire_8573167941735348297tmp>
Running org.apache.hadoop.hbase.regionserver.metrics.TestSchemaMetrics
Tests run: 6, Failures: 0, Errors: 0, Skipped: 0, Time elapsed: 15.111 sec
Forking command line: /bin/sh -c cd <https://builds.apache.org/job/HBase-0.94/ws/trunk>
&& /home/hudson/tools/java/jdk1.6.0_27-32/jre/bin/java -enableassertions -Xmx1900m
-Djava.security.egd=file:/dev/./urandom -jar <https://builds.apache.org/job/HBase-0.94/ws/trunk/target/surefire/surefirebooter3370408508338484265.jar>
<https://builds.apache.org/job/HBase-0.94/ws/trunk/target/surefire/surefire1663528377568803209tmp>
<https://builds.apache.org/job/HBase-0.94/ws/trunk/target/surefire/surefire_864632839462598252906tmp>
Running org.apache.hadoop.hbase.regionserver.TestRpcMetrics
Tests run: 1, Failures: 0, Errors: 0, Skipped: 0, Time elapsed: 2.083 sec
Forking command line: /bin/sh -c cd <https://builds.apache.org/job/HBase-0.94/ws/trunk>
&& /home/hudson/tools/java/jdk1.6.0_27-32/jre/bin/java -enableassertions -Xmx1900m
-Djava.security.egd=file:/dev/./urandom -jar <https://builds.apache.org/job/HBase-0.94/ws/trunk/target/surefire/surefirebooter4638163111854425925.jar>
<https://builds.apache.org/job/HBase-0.94/ws/trunk/target/surefire/surefire4207928455691282118tmp>
<https://builds.apache.org/job/HBase-0.94/ws/trunk/target/surefire/surefire_872186798091213577384tmp>
Running org.apache.hadoop.hbase.regionserver.TestStoreScanner
Tests run: 16, Failures: 0, Errors: 0, Skipped: 0, Time elapsed: 0.073 sec
Forking command line: /bin/sh -c cd <https://builds.apache.org/job/HBase-0.94/ws/trunk>
&& /home/hudson/tools/java/jdk1.6.0_27-32/jre/bin/java -enableassertions -Xmx1900m
-Djava.security.egd=file:/dev/./urandom -jar <https://builds.apache.org/job/HBase-0.94/ws/trunk/target/surefire/surefirebooter8106753807450368250.jar>
<https://builds.apache.org/job/HBase-0.94/ws/trunk/target/surefire/surefire5669950241704304768tmp>
<https://builds.apache.org/job/HBase-0.94/ws/trunk/target/surefire/surefire_881897290112668932785tmp>
Running org.apache.hadoop.hbase.regionserver.TestSeekOptimizations
Tests run: 6, Failures: 0, Errors: 0, Skipped: 0, Time elapsed: 2.714 sec
Forking command line: /bin/sh -c cd <https://builds.apache.org/job/HBase-0.94/ws/trunk>
&& /home/hudson/tools/java/jdk1.6.0_27-32/jre/bin/java -enableassertions -Xmx1900m
-Djava.security.egd=file:/dev/./urandom -jar <https://builds.apache.org/job/HBase-0.94/ws/trunk/target/surefire/surefirebooter5931192099049123175.jar>
<https://builds.apache.org/job/HBase-0.94/ws/trunk/target/surefire/surefire1885422638000905823tmp>
<https://builds.apache.org/job/HBase-0.94/ws/trunk/target/surefire/surefire_89113260650436234108tmp>
Running org.apache.hadoop.hbase.regionserver.TestFSErrorsExposed
Tests run: 3, Failures: 0, Errors: 0, Skipped: 0, Time elapsed: 32.018 sec
Forking command line: /bin/sh -c cd <https://builds.apache.org/job/HBase-0.94/ws/trunk>
&& /home/hudson/tools/java/jdk1.6.0_27-32/jre/bin/java -enableassertions -Xmx1900m
-Djava.security.egd=file:/dev/./urandom -jar <https://builds.apache.org/job/HBase-0.94/ws/trunk/target/surefire/surefirebooter781817098101377144.jar>
<https://builds.apache.org/job/HBase-0.94/ws/trunk/target/surefire/surefire6892984206965420712tmp>
<https://builds.apache.org/job/HBase-0.94/ws/trunk/target/surefire/surefire_902160229484179110584tmp>
Running org.apache.hadoop.hbase.regionserver.TestSplitLogWorker
Tests run: 5, Failures: 0, Errors: 0, Skipped: 0, Time elapsed: 2.524 sec
Forking command line: /bin/sh -c cd <https://builds.apache.org/job/HBase-0.94/ws/trunk>
&& /home/hudson/tools/java/jdk1.6.0_27-32/jre/bin/java -enableassertions -Xmx1900m
-Djava.security.egd=file:/dev/./urandom -jar <https://builds.apache.org/job/HBase-0.94/ws/trunk/target/surefire/surefirebooter7896942032243241355.jar>
<https://builds.apache.org/job/HBase-0.94/ws/trunk/target/surefire/surefire4412691460380581166tmp>
<https://builds.apache.org/job/HBase-0.94/ws/trunk/target/surefire/surefire_916094806428051478595tmp>
Running org.apache.hadoop.hbase.regionserver.TestMultiColumnScanner
Tests run: 12, Failures: 0, Errors: 0, Skipped: 0, Time elapsed: 41.205 sec
Forking command line: /bin/sh -c cd <https://builds.apache.org/job/HBase-0.94/ws/trunk>
&& /home/hudson/tools/java/jdk1.6.0_27-32/jre/bin/java -enableassertions -Xmx1900m
-Djava.security.egd=file:/dev/./urandom -jar <https://builds.apache.org/job/HBase-0.94/ws/trunk/target/surefire/surefirebooter6710382924337550659.jar>
<https://builds.apache.org/job/HBase-0.94/ws/trunk/target/surefire/surefire4373390781358793066tmp>
<https://builds.apache.org/job/HBase-0.94/ws/trunk/target/surefire/surefire_922638516730179004123tmp>
Forking command line: /bin/sh -c cd <https://builds.apache.org/job/HBase-0.94/ws/trunk>
&& /home/hudson/tools/java/jdk1.6.0_27-32/jre/bin/java -enableassertions -Xmx1900m
-Djava.security.egd=file:/dev/./urandom -jar <https://builds.apache.org/job/HBase-0.94/ws/trunk/target/surefire/surefirebooter4717631522085906578.jar>
<https://builds.apache.org/job/HBase-0.94/ws/trunk/target/surefire/surefire467936987951892936tmp>
<https://builds.apache.org/job/HBase-0.94/ws/trunk/target/surefire/surefire_936493279900815614579tmp>
Running org.apache.hadoop.hbase.client.replication.TestReplicationAdmin
Tests run: 1, Failures: 0, Errors: 0, Skipped: 0, Time elapsed: 1.078 sec
Forking command line: /bin/sh -c cd <https://builds.apache.org/job/HBase-0.94/ws/trunk>
&& /home/hudson/tools/java/jdk1.6.0_27-32/jre/bin/java -enableassertions -Xmx1900m
-Djava.security.egd=file:/dev/./urandom -jar <https://builds.apache.org/job/HBase-0.94/ws/trunk/target/surefire/surefirebooter6321537888971369408.jar>
<https://builds.apache.org/job/HBase-0.94/ws/trunk/target/surefire/surefire3142471229974479749tmp>
<https://builds.apache.org/job/HBase-0.94/ws/trunk/target/surefire/surefire_944754998531919117239tmp>
Running org.apache.hadoop.hbase.client.TestTimestampsFilter
Tests run: 3, Failures: 0, Errors: 0, Skipped: 0, Time elapsed: 25.973 sec
Forking command line: /bin/sh -c cd <https://builds.apache.org/job/HBase-0.94/ws/trunk>
&& /home/hudson/tools/java/jdk1.6.0_27-32/jre/bin/java -enableassertions -Xmx1900m
-Djava.security.egd=file:/dev/./urandom -jar <https://builds.apache.org/job/HBase-0.94/ws/trunk/target/surefire/surefirebooter8326052635989012575.jar>
<https://builds.apache.org/job/HBase-0.94/ws/trunk/target/surefire/surefire5968326423730493458tmp>
<https://builds.apache.org/job/HBase-0.94/ws/trunk/target/surefire/surefire_956559781413971594598tmp>
Running org.apache.hadoop.hbase.client.TestHCM
Tests run: 6, Failures: 0, Errors: 0, Skipped: 0, Time elapsed: 36.165 sec
Forking command line: /bin/sh -c cd <https://builds.apache.org/job/HBase-0.94/ws/trunk>
&& /home/hudson/tools/java/jdk1.6.0_27-32/jre/bin/java -enableassertions -Xmx1900m
-Djava.security.egd=file:/dev/./urandom -jar <https://builds.apache.org/job/HBase-0.94/ws/trunk/target/surefire/surefirebooter1857894436605961529.jar>
<https://builds.apache.org/job/HBase-0.94/ws/trunk/target/surefire/surefire471290484308035280tmp>
<https://builds.apache.org/job/HBase-0.94/ws/trunk/target/surefire/surefire_963461604169880677284tmp>
Running org.apache.hadoop.hbase.regionserver.TestHRegion
Tests run: 62, Failures: 0, Errors: 0, Skipped: 0, Time elapsed: 72.927 sec
Forking command line: /bin/sh -c cd <https://builds.apache.org/job/HBase-0.94/ws/trunk>
&& /home/hudson/tools/java/jdk1.6.0_27-32/jre/bin/java -enableassertions -Xmx1900m
-Djava.security.egd=file:/dev/./urandom -jar <https://builds.apache.org/job/HBase-0.94/ws/trunk/target/surefire/surefirebooter1351706761496115803.jar>
<https://builds.apache.org/job/HBase-0.94/ws/trunk/target/surefire/surefire4952521162976833012tmp>
<https://builds.apache.org/job/HBase-0.94/ws/trunk/target/surefire/surefire_977891250769748021134tmp>
Running org.apache.hadoop.hbase.client.TestHTablePool$TestHTableReusablePool
Tests run: 9, Failures: 0, Errors: 0, Skipped: 0, Time elapsed: 6.217 sec
Running org.apache.hadoop.hbase.client.TestHTableUtil
Tests run: 2, Failures: 0, Errors: 0, Skipped: 0, Time elapsed: 18.101 sec
Running org.apache.hadoop.hbase.client.TestHTablePool$TestHTableThreadLocalPool
Tests run: 9, Failures: 0, Errors: 0, Skipped: 0, Time elapsed: 26.661 sec
Forking command line: /bin/sh -c cd <https://builds.apache.org/job/HBase-0.94/ws/trunk>
&& /home/hudson/tools/java/jdk1.6.0_27-32/jre/bin/java -enableassertions -Xmx1900m
-Djava.security.egd=file:/dev/./urandom -jar <https://builds.apache.org/job/HBase-0.94/ws/trunk/target/surefire/surefirebooter5188746089863056229.jar>
<https://builds.apache.org/job/HBase-0.94/ws/trunk/target/surefire/surefire5299104221825252083tmp>
<https://builds.apache.org/job/HBase-0.94/ws/trunk/target/surefire/surefire_985156016530798708242tmp>
Forking command line: /bin/sh -c cd <https://builds.apache.org/job/HBase-0.94/ws/trunk>
&& /home/hudson/tools/java/jdk1.6.0_27-32/jre/bin/java -enableassertions -Xmx1900m
-Djava.security.egd=file:/dev/./urandom -jar <https://builds.apache.org/job/HBase-0.94/ws/trunk/target/surefire/surefirebooter5189169004760006399.jar>
<https://builds.apache.org/job/HBase-0.94/ws/trunk/target/surefire/surefire166704250756936232tmp>
<https://builds.apache.org/job/HBase-0.94/ws/trunk/target/surefire/surefire_991177540786568047561tmp>
Running org.apache.hadoop.hbase.client.TestMetaScanner
Tests run: 1, Failures: 0, Errors: 0, Skipped: 0, Time elapsed: 16.603 sec
Forking command line: /bin/sh -c cd <https://builds.apache.org/job/HBase-0.94/ws/trunk>
&& /home/hudson/tools/java/jdk1.6.0_27-32/jre/bin/java -enableassertions -Xmx1900m
-Djava.security.egd=file:/dev/./urandom -jar <https://builds.apache.org/job/HBase-0.94/ws/trunk/target/surefire/surefirebooter9183855233518869001.jar>
<https://builds.apache.org/job/HBase-0.94/ws/trunk/target/surefire/surefire5573970123333020418tmp>
<https://builds.apache.org/job/HBase-0.94/ws/trunk/target/surefire/surefire_100805479994366495740tmp>
Running org.apache.hadoop.hbase.client.TestMetaMigrationRemovingHTD
Tests run: 3, Failures: 0, Errors: 0, Skipped: 0, Time elapsed: 27.511 sec
Forking command line: /bin/sh -c cd <https://builds.apache.org/job/HBase-0.94/ws/trunk>
&& /home/hudson/tools/java/jdk1.6.0_27-32/jre/bin/java -enableassertions -Xmx1900m
-Djava.security.egd=file:/dev/./urandom -jar <https://builds.apache.org/job/HBase-0.94/ws/trunk/target/surefire/surefirebooter8367269687658324407.jar>
<https://builds.apache.org/job/HBase-0.94/ws/trunk/target/surefire/surefire7508592464463372776tmp>
<https://builds.apache.org/job/HBase-0.94/ws/trunk/target/surefire/surefire_1011392629735570068759tmp>
Running org.apache.hadoop.hbase.TestMultiVersions
Tests run: 3, Failures: 0, Errors: 0, Skipped: 0, Time elapsed: 30.171 sec
Forking command line: /bin/sh -c cd <https://builds.apache.org/job/HBase-0.94/ws/trunk>
&& /home/hudson/tools/java/jdk1.6.0_27-32/jre/bin/java -enableassertions -Xmx1900m
-Djava.security.egd=file:/dev/./urandom -jar <https://builds.apache.org/job/HBase-0.94/ws/trunk/target/surefire/surefirebooter1652129994789362135.jar>
<https://builds.apache.org/job/HBase-0.94/ws/trunk/target/surefire/surefire769794398750604730tmp>
<https://builds.apache.org/job/HBase-0.94/ws/trunk/target/surefire/surefire_102312779413202068925tmp>
Running org.apache.hadoop.hbase.client.TestMultiParallel
Tests run: 11, Failures: 0, Errors: 0, Skipped: 0, Time elapsed: 46.672 sec
Forking command line: /bin/sh -c cd <https://builds.apache.org/job/HBase-0.94/ws/trunk>
&& /home/hudson/tools/java/jdk1.6.0_27-32/jre/bin/java -enableassertions -Xmx1900m
-Djava.security.egd=file:/dev/./urandom -jar <https://builds.apache.org/job/HBase-0.94/ws/trunk/target/surefire/surefirebooter4658300206700779076.jar>
<https://builds.apache.org/job/HBase-0.94/ws/trunk/target/surefire/surefire6554055582714188445tmp>
<https://builds.apache.org/job/HBase-0.94/ws/trunk/target/surefire/surefire_1034168008786809136492tmp>
Running org.apache.hadoop.hbase.master.TestActiveMasterManager
Tests run: 2, Failures: 0, Errors: 0, Skipped: 0, Time elapsed: 1.135 sec
Forking command line: /bin/sh -c cd <https://builds.apache.org/job/HBase-0.94/ws/trunk>
&& /home/hudson/tools/java/jdk1.6.0_27-32/jre/bin/java -enableassertions -Xmx1900m
-Djava.security.egd=file:/dev/./urandom -jar <https://builds.apache.org/job/HBase-0.94/ws/trunk/target/surefire/surefirebooter5146354187118929301.jar>
<https://builds.apache.org/job/HBase-0.94/ws/trunk/target/surefire/surefire6474817623641233254tmp>
<https://builds.apache.org/job/HBase-0.94/ws/trunk/target/surefire/surefire_1047439967236722574813tmp>
Running org.apache.hadoop.hbase.master.TestDeadServer
Tests run: 1, Failures: 0, Errors: 0, Skipped: 0, Time elapsed: 0.206 sec
Forking command line: /bin/sh -c cd <https://builds.apache.org/job/HBase-0.94/ws/trunk>
&& /home/hudson/tools/java/jdk1.6.0_27-32/jre/bin/java -enableassertions -Xmx1900m
-Djava.security.egd=file:/dev/./urandom -jar <https://builds.apache.org/job/HBase-0.94/ws/trunk/target/surefire/surefirebooter3258257594669879265.jar>
<https://builds.apache.org/job/HBase-0.94/ws/trunk/target/surefire/surefire5059980135768434120tmp>
<https://builds.apache.org/job/HBase-0.94/ws/trunk/target/surefire/surefire_1054876943932229661639tmp>
Running org.apache.hadoop.hbase.master.TestLogsCleaner
Tests run: 1, Failures: 0, Errors: 0, Skipped: 0, Time elapsed: 3.478 sec
Forking command line: /bin/sh -c cd <https://builds.apache.org/job/HBase-0.94/ws/trunk>
&& /home/hudson/tools/java/jdk1.6.0_27-32/jre/bin/java -enableassertions -Xmx1900m
-Djava.security.egd=file:/dev/./urandom -jar <https://builds.apache.org/job/HBase-0.94/ws/trunk/target/surefire/surefirebooter2565394344035064784.jar>
<https://builds.apache.org/job/HBase-0.94/ws/trunk/target/surefire/surefire8412609193435358108tmp>
<https://builds.apache.org/job/HBase-0.94/ws/trunk/target/surefire/surefire_106611975147449993323tmp>
Running org.apache.hadoop.hbase.master.TestZKBasedOpenCloseRegion
Tests run: 3, Failures: 0, Errors: 0, Skipped: 0, Time elapsed: 27.243 sec
Forking command line: /bin/sh -c cd <https://builds.apache.org/job/HBase-0.94/ws/trunk>
&& /home/hudson/tools/java/jdk1.6.0_27-32/jre/bin/java -enableassertions -Xmx1900m
-Djava.security.egd=file:/dev/./urandom -jar <https://builds.apache.org/job/HBase-0.94/ws/trunk/target/surefire/surefirebooter2208874404251140135.jar>
<https://builds.apache.org/job/HBase-0.94/ws/trunk/target/surefire/surefire1863782811596196384tmp>
<https://builds.apache.org/job/HBase-0.94/ws/trunk/target/surefire/surefire_1078098455763365428637tmp>
Running org.apache.hadoop.hbase.thrift.TestThriftServer
Tests run: 1, Failures: 0, Errors: 0, Skipped: 0, Time elapsed: 50.027 sec
Forking command line: /bin/sh -c cd <https://builds.apache.org/job/HBase-0.94/ws/trunk>
&& /home/hudson/tools/java/jdk1.6.0_27-32/jre/bin/java -enableassertions -Xmx1900m
-Djava.security.egd=file:/dev/./urandom -jar <https://builds.apache.org/job/HBase-0.94/ws/trunk/target/surefire/surefirebooter6211424948262022555.jar>
<https://builds.apache.org/job/HBase-0.94/ws/trunk/target/surefire/surefire7950115755712653632tmp>
<https://builds.apache.org/job/HBase-0.94/ws/trunk/target/surefire/surefire_1087374544714016439808tmp>
Running org.apache.hadoop.hbase.master.TestMaster
Tests run: 1, Failures: 0, Errors: 0, Skipped: 0, Time elapsed: 18.422 sec
Forking command line: /bin/sh -c cd <https://builds.apache.org/job/HBase-0.94/ws/trunk>
&& /home/hudson/tools/java/jdk1.6.0_27-32/jre/bin/java -enableassertions -Xmx1900m
-Djava.security.egd=file:/dev/./urandom -jar <https://builds.apache.org/job/HBase-0.94/ws/trunk/target/surefire/surefirebooter1631030274272535362.jar>
<https://builds.apache.org/job/HBase-0.94/ws/trunk/target/surefire/surefire3791801296809014681tmp>
<https://builds.apache.org/job/HBase-0.94/ws/trunk/target/surefire/surefire_1094216509585502102433tmp>
Running org.apache.hadoop.hbase.master.TestClockSkewDetection
Tests run: 1, Failures: 0, Errors: 0, Skipped: 0, Time elapsed: 0.292 sec
Forking command line: /bin/sh -c cd <https://builds.apache.org/job/HBase-0.94/ws/trunk>
&& /home/hudson/tools/java/jdk1.6.0_27-32/jre/bin/java -enableassertions -Xmx1900m
-Djava.security.egd=file:/dev/./urandom -jar <https://builds.apache.org/job/HBase-0.94/ws/trunk/target/surefire/surefirebooter523539503987135309.jar>
<https://builds.apache.org/job/HBase-0.94/ws/trunk/target/surefire/surefire2092154687949548422tmp>
<https://builds.apache.org/job/HBase-0.94/ws/trunk/target/surefire/surefire_1106399109561699493813tmp>
Running org.apache.hadoop.hbase.master.TestOpenedRegionHandler
Tests run: 2, Failures: 0, Errors: 0, Skipped: 0, Time elapsed: 17.026 sec
Forking command line: /bin/sh -c cd <https://builds.apache.org/job/HBase-0.94/ws/trunk>
&& /home/hudson/tools/java/jdk1.6.0_27-32/jre/bin/java -enableassertions -Xmx1900m
-Djava.security.egd=file:/dev/./urandom -jar <https://builds.apache.org/job/HBase-0.94/ws/trunk/target/surefire/surefirebooter5696793355564070749.jar>
<https://builds.apache.org/job/HBase-0.94/ws/trunk/target/surefire/surefire4993656936104107775tmp>
<https://builds.apache.org/job/HBase-0.94/ws/trunk/target/surefire/surefire_1113029447793685742501tmp>
Running org.apache.hadoop.hbase.master.TestDefaultLoadBalancer
Tests run: 4, Failures: 0, Errors: 0, Skipped: 0, Time elapsed: 1.458 sec
Forking command line: /bin/sh -c cd <https://builds.apache.org/job/HBase-0.94/ws/trunk>
&& /home/hudson/tools/java/jdk1.6.0_27-32/jre/bin/java -enableassertions -Xmx1900m
-Djava.security.egd=file:/dev/./urandom -jar <https://builds.apache.org/job/HBase-0.94/ws/trunk/target/surefire/surefirebooter6116353333740659558.jar>
<https://builds.apache.org/job/HBase-0.94/ws/trunk/target/surefire/surefire3494237517512912340tmp>
<https://builds.apache.org/job/HBase-0.94/ws/trunk/target/surefire/surefire_112491117416530161860tmp>
Running org.apache.hadoop.hbase.master.TestMasterStatusServlet
Tests run: 5, Failures: 0, Errors: 0, Skipped: 0, Time elapsed: 1.022 sec
Forking command line: /bin/sh -c cd <https://builds.apache.org/job/HBase-0.94/ws/trunk>
&& /home/hudson/tools/java/jdk1.6.0_27-32/jre/bin/java -enableassertions -Xmx1900m
-Djava.security.egd=file:/dev/./urandom -jar <https://builds.apache.org/job/HBase-0.94/ws/trunk/target/surefire/surefirebooter7222479543947353812.jar>
<https://builds.apache.org/job/HBase-0.94/ws/trunk/target/surefire/surefire5133685093191444550tmp>
<https://builds.apache.org/job/HBase-0.94/ws/trunk/target/surefire/surefire_1137897140927046222958tmp>
Running org.apache.hadoop.hbase.master.TestHMasterRPCException
Tests run: 1, Failures: 0, Errors: 0, Skipped: 0, Time elapsed: 1.317 sec
Forking command line: /bin/sh -c cd <https://builds.apache.org/job/HBase-0.94/ws/trunk>
&& /home/hudson/tools/java/jdk1.6.0_27-32/jre/bin/java -enableassertions -Xmx1900m
-Djava.security.egd=file:/dev/./urandom -jar <https://builds.apache.org/job/HBase-0.94/ws/trunk/target/surefire/surefirebooter6187824865588519779.jar>
<https://builds.apache.org/job/HBase-0.94/ws/trunk/target/surefire/surefire8689136136097754444tmp>
<https://builds.apache.org/job/HBase-0.94/ws/trunk/target/surefire/surefire_1147889367348318209458tmp>
Running org.apache.hadoop.hbase.master.TestSplitLogManager
Tests run: 12, Failures: 0, Errors: 0, Skipped: 0, Time elapsed: 15.869 sec
Forking command line: /bin/sh -c cd <https://builds.apache.org/job/HBase-0.94/ws/trunk>
&& /home/hudson/tools/java/jdk1.6.0_27-32/jre/bin/java -enableassertions -Xmx1900m
-Djava.security.egd=file:/dev/./urandom -jar <https://builds.apache.org/job/HBase-0.94/ws/trunk/target/surefire/surefirebooter6887608166015166532.jar>
<https://builds.apache.org/job/HBase-0.94/ws/trunk/target/surefire/surefire2931595682800425547tmp>
<https://builds.apache.org/job/HBase-0.94/ws/trunk/target/surefire/surefire_115691377154618684067tmp>
Running org.apache.hadoop.hbase.master.TestMasterZKSessionRecovery
Tests run: 2, Failures: 0, Errors: 0, Skipped: 0, Time elapsed: 23.139 sec
Forking command line: /bin/sh -c cd <https://builds.apache.org/job/HBase-0.94/ws/trunk>
&& /home/hudson/tools/java/jdk1.6.0_27-32/jre/bin/java -enableassertions -Xmx1900m
-Djava.security.egd=file:/dev/./urandom -jar <https://builds.apache.org/job/HBase-0.94/ws/trunk/target/surefire/surefirebooter2140617130788518892.jar>
<https://builds.apache.org/job/HBase-0.94/ws/trunk/target/surefire/surefire2306826520387793552tmp>
<https://builds.apache.org/job/HBase-0.94/ws/trunk/target/surefire/surefire_1165209707197106486300tmp>
Running org.apache.hadoop.hbase.avro.TestAvroServer
Tests run: 3, Failures: 0, Errors: 0, Skipped: 0, Time elapsed: 32.08 sec
Forking command line: /bin/sh -c cd <https://builds.apache.org/job/HBase-0.94/ws/trunk>
&& /home/hudson/tools/java/jdk1.6.0_27-32/jre/bin/java -enableassertions -Xmx1900m
-Djava.security.egd=file:/dev/./urandom -jar <https://builds.apache.org/job/HBase-0.94/ws/trunk/target/surefire/surefirebooter332709824539823891.jar>
<https://builds.apache.org/job/HBase-0.94/ws/trunk/target/surefire/surefire468330462970420029tmp>
<https://builds.apache.org/job/HBase-0.94/ws/trunk/target/surefire/surefire_1173452149201401635482tmp>
Running org.apache.hadoop.hbase.ipc.TestDelayedRpc
Tests run: 4, Failures: 0, Errors: 0, Skipped: 0, Time elapsed: 2.684 sec
Forking command line: /bin/sh -c cd <https://builds.apache.org/job/HBase-0.94/ws/trunk>
&& /home/hudson/tools/java/jdk1.6.0_27-32/jre/bin/java -enableassertions -Xmx1900m
-Djava.security.egd=file:/dev/./urandom -jar <https://builds.apache.org/job/HBase-0.94/ws/trunk/target/surefire/surefirebooter6137330839920360238.jar>
<https://builds.apache.org/job/HBase-0.94/ws/trunk/target/surefire/surefire4693812011246349058tmp>
<https://builds.apache.org/job/HBase-0.94/ws/trunk/target/surefire/surefire_1183717512598199046068tmp>
Running org.apache.hadoop.hbase.thrift2.TestThriftHBaseServiceHandler
Tests run: 12, Failures: 0, Errors: 0, Skipped: 0, Time elapsed: 18.171 sec
Forking command line: /bin/sh -c cd <https://builds.apache.org/job/HBase-0.94/ws/trunk>
&& /home/hudson/tools/java/jdk1.6.0_27-32/jre/bin/java -enableassertions -Xmx1900m
-Djava.security.egd=file:/dev/./urandom -jar <https://builds.apache.org/job/HBase-0.94/ws/trunk/target/surefire/surefirebooter1338755624701690828.jar>
<https://builds.apache.org/job/HBase-0.94/ws/trunk/target/surefire/surefire6794039290110343265tmp>
<https://builds.apache.org/job/HBase-0.94/ws/trunk/target/surefire/surefire_119435424477631709269tmp>
Running org.apache.hadoop.hbase.TestInfoServers
Tests run: 2, Failures: 0, Errors: 0, Skipped: 0, Time elapsed: 14.118 sec
Running org.apache.hadoop.hbase.TestAcidGuarantees
Tests run: 3, Failures: 0, Errors: 0, Skipped: 0, Time elapsed: 102.52 sec

Results :

Tests in error: 
  testTableExists(org.apache.hadoop.hbase.catalog.TestMetaReaderEditor): org.apache.hadoop.hbase.TableNotEnabledException:
testTableExists
  loadTest[0](org.apache.hadoop.hbase.io.encoding.TestLoadAndSwitchEncodeOnDisk): org.apache.hadoop.hbase.NotServingRegionException:
Region is not online: load_test_tbl,33333332,1334630635302.66509ab6deb5571b67214af9e5bf62fa.(..)

Tests run: 622, Failures: 0, Errors: 2, Skipped: 2

[INFO] ------------------------------------------------------------------------
[INFO] BUILD FAILURE
[INFO] ------------------------------------------------------------------------
[INFO] Total time: 34:12.886s
[INFO] Finished at: Tue Apr 17 03:07:42 UTC 2012
[INFO] Final Memory: 48M/423M
[INFO] ------------------------------------------------------------------------
[ERROR] Failed to execute goal org.apache.maven.plugins:maven-surefire-plugin:2.12-TRUNK-HBASE-2:test
(secondPartTestsExecution) on project hbase: There are test failures.
[ERROR] 
[ERROR] Please refer to <https://builds.apache.org/job/HBase-0.94/ws/trunk/target/surefire-reports>
for the individual test results.
[ERROR] -> [Help 1]
org.apache.maven.lifecycle.LifecycleExecutionException: Failed to execute goal org.apache.maven.plugins:maven-surefire-plugin:2.12-TRUNK-HBASE-2:test
(secondPartTestsExecution) on project hbase: There are test failures.

Please refer to <https://builds.apache.org/job/HBase-0.94/ws/trunk/target/surefire-reports>
for the individual test results.
	at org.apache.maven.lifecycle.internal.MojoExecutor.execute(MojoExecutor.java:213)
	at org.apache.maven.lifecycle.internal.MojoExecutor.execute(MojoExecutor.java:153)
	at org.apache.maven.lifecycle.internal.MojoExecutor.execute(MojoExecutor.java:145)
	at org.apache.maven.lifecycle.internal.LifecycleModuleBuilder.buildProject(LifecycleModuleBuilder.java:84)
	at org.apache.maven.lifecycle.internal.LifecycleModuleBuilder.buildProject(LifecycleModuleBuilder.java:59)
	at org.apache.maven.lifecycle.internal.LifecycleStarter.singleThreadedBuild(LifecycleStarter.java:183)
	at org.apache.maven.lifecycle.internal.LifecycleStarter.execute(LifecycleStarter.java:161)
	at org.apache.maven.DefaultMaven.doExecute(DefaultMaven.java:319)
	at org.apache.maven.DefaultMaven.execute(DefaultMaven.java:156)
	at org.apache.maven.cli.MavenCli.execute(MavenCli.java:537)
	at org.apache.maven.cli.MavenCli.doMain(MavenCli.java:196)
	at org.apache.maven.cli.MavenCli.main(MavenCli.java:141)
	at sun.reflect.NativeMethodAccessorImpl.invoke0(Native Method)
	at sun.reflect.NativeMethodAccessorImpl.invoke(NativeMethodAccessorImpl.java:39)
	at sun.reflect.DelegatingMethodAccessorImpl.invoke(DelegatingMethodAccessorImpl.java:25)
	at java.lang.reflect.Method.invoke(Method.java:597)
	at org.codehaus.plexus.classworlds.launcher.Launcher.launchEnhanced(Launcher.java:290)
	at org.codehaus.plexus.classworlds.launcher.Launcher.launch(Launcher.java:230)
	at org.codehaus.plexus.classworlds.launcher.Launcher.mainWithExitCode(Launcher.java:409)
	at org.codehaus.plexus.classworlds.launcher.Launcher.main(Launcher.java:352)
Caused by: org.apache.maven.plugin.MojoFailureException: There are test failures.

Please refer to <https://builds.apache.org/job/HBase-0.94/ws/trunk/target/surefire-reports>
for the individual test results.
	at org.apache.maven.plugin.surefire.SurefireHelper.reportExecution(SurefireHelper.java:87)
	at org.apache.maven.plugin.surefire.SurefirePlugin.writeSummary(SurefirePlugin.java:651)
	at org.apache.maven.plugin.surefire.SurefirePlugin.handleSummary(SurefirePlugin.java:625)
	at org.apache.maven.plugin.surefire.AbstractSurefireMojo.executeAfterPreconditionsChecked(AbstractSurefireMojo.java:137)
	at org.apache.maven.plugin.surefire.AbstractSurefireMojo.execute(AbstractSurefireMojo.java:98)
	at org.apache.maven.plugin.DefaultBuildPluginManager.executeMojo(DefaultBuildPluginManager.java:101)
	at org.apache.maven.lifecycle.internal.MojoExecutor.execute(MojoExecutor.java:209)
	... 19 more
[ERROR] 
[ERROR] 
[ERROR] For more information about the errors and possible solutions, please read the following
articles:
[ERROR] [Help 1] http://cwiki.apache.org/confluence/display/MAVEN/MojoFailureException
Build step 'Invoke top-level Maven targets' marked build as failure
Archiving artifacts
Recording test results

Mime
View raw message