hbase-dev mailing list archives

Site index · List index
Message view « Date » · « Thread »
Top « Date » · « Thread »
From Apache Jenkins Server <jenk...@builds.apache.org>
Subject Build failed in Jenkins: HBase-TRUNK #2759
Date Sat, 14 Apr 2012 02:41:18 GMT
See <https://builds.apache.org/job/HBase-TRUNK/2759/changes>

Changes:

[mbautin] [jira] [HBASE-5684] Make ProcessBasedLocalHBaseCluster run HDFS and make it more
robust

Summary:
Currently ProcessBasedLocalHBaseCluster runs on top of raw local filesystem. We
need it to start a process-based HDFS cluster as well. We also need to make the
whole thing more stable so we can use it in unit tests.

Also all logs of local HBase cluster daemons are now tailed to the primary log
of the unit test with the appropriate prefixes to make debugging easier.

This is a trunk diff. The 89-fb version is D2709.

Test Plan:
Run the new unit test multiple times (10x or 50x).
Run all unit tests.

Reviewers: tedyu, stack, lhofhansl, nspiegelberg, amirshim, JIRA

Reviewed By: tedyu

Differential Revision: https://reviews.facebook.net/D2757

------------------------------------------
[...truncated 17802 lines...]
Forking command line: /bin/sh -c cd <https://builds.apache.org/job/HBase-TRUNK/ws/trunk> && /home/jenkins/tools/java/jdk1.6.0_27-32/jre/bin/java -enableassertions -Xmx1900m -Djava.security.egd=file:/dev/./urandom -jar <https://builds.apache.org/job/HBase-TRUNK/ws/trunk/target/surefire/surefirebooter8347721698930860840.jar> <https://builds.apache.org/job/HBase-TRUNK/ws/trunk/target/surefire/surefire378806157258461310tmp> <https://builds.apache.org/job/HBase-TRUNK/ws/trunk/target/surefire/surefire_535782869117048118970tmp>
Running org.apache.hadoop.hbase.client.TestHTablePool$TestHTableReusablePool
Tests run: 9, Failures: 0, Errors: 0, Skipped: 0, Time elapsed: 5.137 sec
Running org.apache.hadoop.hbase.client.TestHTablePool$TestHTableThreadLocalPool
Tests run: 9, Failures: 0, Errors: 0, Skipped: 0, Time elapsed: 21.673 sec
Forking command line: /bin/sh -c cd <https://builds.apache.org/job/HBase-TRUNK/ws/trunk> && /home/jenkins/tools/java/jdk1.6.0_27-32/jre/bin/java -enableassertions -Xmx1900m -Djava.security.egd=file:/dev/./urandom -jar <https://builds.apache.org/job/HBase-TRUNK/ws/trunk/target/surefire/surefirebooter1679681304240144565.jar> <https://builds.apache.org/job/HBase-TRUNK/ws/trunk/target/surefire/surefire5489047787528557472tmp> <https://builds.apache.org/job/HBase-TRUNK/ws/trunk/target/surefire/surefire_545534344571233246450tmp>
Running org.apache.hadoop.hbase.master.TestActiveMasterManager
Tests run: 2, Failures: 0, Errors: 0, Skipped: 0, Time elapsed: 0.931 sec
Forking command line: /bin/sh -c cd <https://builds.apache.org/job/HBase-TRUNK/ws/trunk> && /home/jenkins/tools/java/jdk1.6.0_27-32/jre/bin/java -enableassertions -Xmx1900m -Djava.security.egd=file:/dev/./urandom -jar <https://builds.apache.org/job/HBase-TRUNK/ws/trunk/target/surefire/surefirebooter6964985421194598220.jar> <https://builds.apache.org/job/HBase-TRUNK/ws/trunk/target/surefire/surefire7682300341201914313tmp> <https://builds.apache.org/job/HBase-TRUNK/ws/trunk/target/surefire/surefire_555939398118821654410tmp>
Running org.apache.hadoop.hbase.master.TestMasterStatusServlet
Tests run: 5, Failures: 0, Errors: 0, Skipped: 0, Time elapsed: 1.034 sec
Forking command line: /bin/sh -c cd <https://builds.apache.org/job/HBase-TRUNK/ws/trunk> && /home/jenkins/tools/java/jdk1.6.0_27-32/jre/bin/java -enableassertions -Xmx1900m -Djava.security.egd=file:/dev/./urandom -jar <https://builds.apache.org/job/HBase-TRUNK/ws/trunk/target/surefire/surefirebooter50450387846580805.jar> <https://builds.apache.org/job/HBase-TRUNK/ws/trunk/target/surefire/surefire7572447008382475467tmp> <https://builds.apache.org/job/HBase-TRUNK/ws/trunk/target/surefire/surefire_567291363890154007594tmp>
Running org.apache.hadoop.hbase.master.TestHMasterRPCException
Tests run: 1, Failures: 0, Errors: 0, Skipped: 0, Time elapsed: 1.35 sec
Forking command line: /bin/sh -c cd <https://builds.apache.org/job/HBase-TRUNK/ws/trunk> && /home/jenkins/tools/java/jdk1.6.0_27-32/jre/bin/java -enableassertions -Xmx1900m -Djava.security.egd=file:/dev/./urandom -jar <https://builds.apache.org/job/HBase-TRUNK/ws/trunk/target/surefire/surefirebooter4442343684902898038.jar> <https://builds.apache.org/job/HBase-TRUNK/ws/trunk/target/surefire/surefire4955777115035885302tmp> <https://builds.apache.org/job/HBase-TRUNK/ws/trunk/target/surefire/surefire_576914306255407523426tmp>
Running org.apache.hadoop.hbase.master.TestLogsCleaner
Tests run: 1, Failures: 0, Errors: 0, Skipped: 0, Time elapsed: 3.106 sec
Forking command line: /bin/sh -c cd <https://builds.apache.org/job/HBase-TRUNK/ws/trunk> && /home/jenkins/tools/java/jdk1.6.0_27-32/jre/bin/java -enableassertions -Xmx1900m -Djava.security.egd=file:/dev/./urandom -jar <https://builds.apache.org/job/HBase-TRUNK/ws/trunk/target/surefire/surefirebooter6513922922223123048.jar> <https://builds.apache.org/job/HBase-TRUNK/ws/trunk/target/surefire/surefire221497197745197952tmp> <https://builds.apache.org/job/HBase-TRUNK/ws/trunk/target/surefire/surefire_582811468547447645383tmp>
Running org.apache.hadoop.hbase.master.TestOpenedRegionHandler
Tests run: 2, Failures: 0, Errors: 0, Skipped: 0, Time elapsed: 14.509 sec
Forking command line: /bin/sh -c cd <https://builds.apache.org/job/HBase-TRUNK/ws/trunk> && /home/jenkins/tools/java/jdk1.6.0_27-32/jre/bin/java -enableassertions -Xmx1900m -Djava.security.egd=file:/dev/./urandom -jar <https://builds.apache.org/job/HBase-TRUNK/ws/trunk/target/surefire/surefirebooter3121332595848574439.jar> <https://builds.apache.org/job/HBase-TRUNK/ws/trunk/target/surefire/surefire6612525661822506430tmp> <https://builds.apache.org/job/HBase-TRUNK/ws/trunk/target/surefire/surefire_59394514745182524477tmp>
Running org.apache.hadoop.hbase.master.TestZKBasedOpenCloseRegion
Tests run: 3, Failures: 0, Errors: 0, Skipped: 0, Time elapsed: 20.649 sec
Forking command line: /bin/sh -c cd <https://builds.apache.org/job/HBase-TRUNK/ws/trunk> && /home/jenkins/tools/java/jdk1.6.0_27-32/jre/bin/java -enableassertions -Xmx1900m -Djava.security.egd=file:/dev/./urandom -jar <https://builds.apache.org/job/HBase-TRUNK/ws/trunk/target/surefire/surefirebooter1143647265056291468.jar> <https://builds.apache.org/job/HBase-TRUNK/ws/trunk/target/surefire/surefire7541320790886195679tmp> <https://builds.apache.org/job/HBase-TRUNK/ws/trunk/target/surefire/surefire_605764498198199274831tmp>
Running org.apache.hadoop.hbase.master.TestDefaultLoadBalancer
Tests run: 4, Failures: 0, Errors: 0, Skipped: 0, Time elapsed: 1.444 sec
Forking command line: /bin/sh -c cd <https://builds.apache.org/job/HBase-TRUNK/ws/trunk> && /home/jenkins/tools/java/jdk1.6.0_27-32/jre/bin/java -enableassertions -Xmx1900m -Djava.security.egd=file:/dev/./urandom -jar <https://builds.apache.org/job/HBase-TRUNK/ws/trunk/target/surefire/surefirebooter5330240033906193929.jar> <https://builds.apache.org/job/HBase-TRUNK/ws/trunk/target/surefire/surefire8623034738754949090tmp> <https://builds.apache.org/job/HBase-TRUNK/ws/trunk/target/surefire/surefire_614450727551580979007tmp>
Running org.apache.hadoop.hbase.master.TestClockSkewDetection
Tests run: 1, Failures: 0, Errors: 0, Skipped: 0, Time elapsed: 0.282 sec
Forking command line: /bin/sh -c cd <https://builds.apache.org/job/HBase-TRUNK/ws/trunk> && /home/jenkins/tools/java/jdk1.6.0_27-32/jre/bin/java -enableassertions -Xmx1900m -Djava.security.egd=file:/dev/./urandom -jar <https://builds.apache.org/job/HBase-TRUNK/ws/trunk/target/surefire/surefirebooter6581523944906333964.jar> <https://builds.apache.org/job/HBase-TRUNK/ws/trunk/target/surefire/surefire8200685233408930315tmp> <https://builds.apache.org/job/HBase-TRUNK/ws/trunk/target/surefire/surefire_62146914709940736767tmp>
Running org.apache.hadoop.hbase.master.TestMaster
Tests run: 1, Failures: 0, Errors: 0, Skipped: 0, Time elapsed: 17.401 sec
Forking command line: /bin/sh -c cd <https://builds.apache.org/job/HBase-TRUNK/ws/trunk> && /home/jenkins/tools/java/jdk1.6.0_27-32/jre/bin/java -enableassertions -Xmx1900m -Djava.security.egd=file:/dev/./urandom -jar <https://builds.apache.org/job/HBase-TRUNK/ws/trunk/target/surefire/surefirebooter2198809116458452671.jar> <https://builds.apache.org/job/HBase-TRUNK/ws/trunk/target/surefire/surefire5054001353486247494tmp> <https://builds.apache.org/job/HBase-TRUNK/ws/trunk/target/surefire/surefire_634315825977311044195tmp>
Running org.apache.hadoop.hbase.master.TestSplitLogManager
Tests run: 12, Failures: 0, Errors: 0, Skipped: 0, Time elapsed: 14.584 sec
Forking command line: /bin/sh -c cd <https://builds.apache.org/job/HBase-TRUNK/ws/trunk> && /home/jenkins/tools/java/jdk1.6.0_27-32/jre/bin/java -enableassertions -Xmx1900m -Djava.security.egd=file:/dev/./urandom -jar <https://builds.apache.org/job/HBase-TRUNK/ws/trunk/target/surefire/surefirebooter1115673094420218912.jar> <https://builds.apache.org/job/HBase-TRUNK/ws/trunk/target/surefire/surefire1180770984463047587tmp> <https://builds.apache.org/job/HBase-TRUNK/ws/trunk/target/surefire/surefire_648927944459413873598tmp>
Running org.apache.hadoop.hbase.metrics.TestMetricsMBeanBase
Tests run: 2, Failures: 0, Errors: 0, Skipped: 0, Time elapsed: 1.118 sec
Forking command line: /bin/sh -c cd <https://builds.apache.org/job/HBase-TRUNK/ws/trunk> && /home/jenkins/tools/java/jdk1.6.0_27-32/jre/bin/java -enableassertions -Xmx1900m -Djava.security.egd=file:/dev/./urandom -jar <https://builds.apache.org/job/HBase-TRUNK/ws/trunk/target/surefire/surefirebooter2269379140130235998.jar> <https://builds.apache.org/job/HBase-TRUNK/ws/trunk/target/surefire/surefire6683153397858998611tmp> <https://builds.apache.org/job/HBase-TRUNK/ws/trunk/target/surefire/surefire_653180728600510274282tmp>
Running org.apache.hadoop.hbase.TestGlobalMemStoreSize
Tests run: 1, Failures: 0, Errors: 0, Skipped: 0, Time elapsed: 15.525 sec
Forking command line: /bin/sh -c cd <https://builds.apache.org/job/HBase-TRUNK/ws/trunk> && /home/jenkins/tools/java/jdk1.6.0_27-32/jre/bin/java -enableassertions -Xmx1900m -Djava.security.egd=file:/dev/./urandom -jar <https://builds.apache.org/job/HBase-TRUNK/ws/trunk/target/surefire/surefirebooter4034370596043004881.jar> <https://builds.apache.org/job/HBase-TRUNK/ws/trunk/target/surefire/surefire5230455017480100812tmp> <https://builds.apache.org/job/HBase-TRUNK/ws/trunk/target/surefire/surefire_662392941003507539702tmp>
Running org.apache.hadoop.hbase.replication.TestReplicationZookeeper
Tests run: 1, Failures: 0, Errors: 0, Skipped: 0, Time elapsed: 0.654 sec
Forking command line: /bin/sh -c cd <https://builds.apache.org/job/HBase-TRUNK/ws/trunk> && /home/jenkins/tools/java/jdk1.6.0_27-32/jre/bin/java -enableassertions -Xmx1900m -Djava.security.egd=file:/dev/./urandom -jar <https://builds.apache.org/job/HBase-TRUNK/ws/trunk/target/surefire/surefirebooter5369341770502205273.jar> <https://builds.apache.org/job/HBase-TRUNK/ws/trunk/target/surefire/surefire4601026258750357993tmp> <https://builds.apache.org/job/HBase-TRUNK/ws/trunk/target/surefire/surefire_674961413071767005006tmp>
Running org.apache.hadoop.hbase.replication.TestReplicationSource
Tests run: 1, Failures: 0, Errors: 0, Skipped: 0, Time elapsed: 2.729 sec
Forking command line: /bin/sh -c cd <https://builds.apache.org/job/HBase-TRUNK/ws/trunk> && /home/jenkins/tools/java/jdk1.6.0_27-32/jre/bin/java -enableassertions -Xmx1900m -Djava.security.egd=file:/dev/./urandom -jar <https://builds.apache.org/job/HBase-TRUNK/ws/trunk/target/surefire/surefirebooter1959255369467833511.jar> <https://builds.apache.org/job/HBase-TRUNK/ws/trunk/target/surefire/surefire1013337431106286457tmp> <https://builds.apache.org/job/HBase-TRUNK/ws/trunk/target/surefire/surefire_681381122491332535766tmp>
Running org.apache.hadoop.hbase.replication.TestReplicationPeer
Tests run: 1, Failures: 0, Errors: 0, Skipped: 0, Time elapsed: 1.43 sec
Forking command line: /bin/sh -c cd <https://builds.apache.org/job/HBase-TRUNK/ws/trunk> && /home/jenkins/tools/java/jdk1.6.0_27-32/jre/bin/java -enableassertions -Xmx1900m -Djava.security.egd=file:/dev/./urandom -jar <https://builds.apache.org/job/HBase-TRUNK/ws/trunk/target/surefire/surefirebooter4917580428595337867.jar> <https://builds.apache.org/job/HBase-TRUNK/ws/trunk/target/surefire/surefire1904748604714527059tmp> <https://builds.apache.org/job/HBase-TRUNK/ws/trunk/target/surefire/surefire_697123869758355734238tmp>
Running org.apache.hadoop.hbase.replication.regionserver.TestReplicationSink
Tests run: 5, Failures: 0, Errors: 0, Skipped: 0, Time elapsed: 28.643 sec
Forking command line: /bin/sh -c cd <https://builds.apache.org/job/HBase-TRUNK/ws/trunk> && /home/jenkins/tools/java/jdk1.6.0_27-32/jre/bin/java -enableassertions -Xmx1900m -Djava.security.egd=file:/dev/./urandom -jar <https://builds.apache.org/job/HBase-TRUNK/ws/trunk/target/surefire/surefirebooter8925268024067471758.jar> <https://builds.apache.org/job/HBase-TRUNK/ws/trunk/target/surefire/surefire7311089912110099060tmp> <https://builds.apache.org/job/HBase-TRUNK/ws/trunk/target/surefire/surefire_706959402240980129077tmp>
Running org.apache.hadoop.hbase.replication.regionserver.TestReplicationSourceManager
Tests run: 1, Failures: 0, Errors: 0, Skipped: 0, Time elapsed: 1.051 sec
Forking command line: /bin/sh -c cd <https://builds.apache.org/job/HBase-TRUNK/ws/trunk> && /home/jenkins/tools/java/jdk1.6.0_27-32/jre/bin/java -enableassertions -Xmx1900m -Djava.security.egd=file:/dev/./urandom -jar <https://builds.apache.org/job/HBase-TRUNK/ws/trunk/target/surefire/surefirebooter2165711425584945719.jar> <https://builds.apache.org/job/HBase-TRUNK/ws/trunk/target/surefire/surefire168868747129569327tmp> <https://builds.apache.org/job/HBase-TRUNK/ws/trunk/target/surefire/surefire_715117799067306012479tmp>
Running org.apache.hadoop.hbase.TestMultiVersions
Tests run: 3, Failures: 0, Errors: 0, Skipped: 0, Time elapsed: 23.41 sec
Forking command line: /bin/sh -c cd <https://builds.apache.org/job/HBase-TRUNK/ws/trunk> && /home/jenkins/tools/java/jdk1.6.0_27-32/jre/bin/java -enableassertions -Xmx1900m -Djava.security.egd=file:/dev/./urandom -jar <https://builds.apache.org/job/HBase-TRUNK/ws/trunk/target/surefire/surefirebooter391943271897722421.jar> <https://builds.apache.org/job/HBase-TRUNK/ws/trunk/target/surefire/surefire3578640747317223244tmp> <https://builds.apache.org/job/HBase-TRUNK/ws/trunk/target/surefire/surefire_728440745899809199593tmp>
Running org.apache.hadoop.hbase.catalog.TestMetaReaderEditorNoCluster
Tests run: 1, Failures: 0, Errors: 0, Skipped: 0, Time elapsed: 4.193 sec
Forking command line: /bin/sh -c cd <https://builds.apache.org/job/HBase-TRUNK/ws/trunk> && /home/jenkins/tools/java/jdk1.6.0_27-32/jre/bin/java -enableassertions -Xmx1900m -Djava.security.egd=file:/dev/./urandom -jar <https://builds.apache.org/job/HBase-TRUNK/ws/trunk/target/surefire/surefirebooter1591730169291571910.jar> <https://builds.apache.org/job/HBase-TRUNK/ws/trunk/target/surefire/surefire8073623391829026566tmp> <https://builds.apache.org/job/HBase-TRUNK/ws/trunk/target/surefire/surefire_731420695413111804609tmp>
Running org.apache.hadoop.hbase.catalog.TestMetaReaderEditor
Tests run: 5, Failures: 0, Errors: 0, Skipped: 0, Time elapsed: 22.519 sec
Forking command line: /bin/sh -c cd <https://builds.apache.org/job/HBase-TRUNK/ws/trunk> && /home/jenkins/tools/java/jdk1.6.0_27-32/jre/bin/java -enableassertions -Xmx1900m -Djava.security.egd=file:/dev/./urandom -jar <https://builds.apache.org/job/HBase-TRUNK/ws/trunk/target/surefire/surefirebooter832964641633359659.jar> <https://builds.apache.org/job/HBase-TRUNK/ws/trunk/target/surefire/surefire8728104539019855202tmp> <https://builds.apache.org/job/HBase-TRUNK/ws/trunk/target/surefire/surefire_741956249266669330266tmp>
Running org.apache.hadoop.hbase.catalog.TestCatalogTracker
Tests run: 9, Failures: 0, Errors: 0, Skipped: 1, Time elapsed: 5.428 sec
Forking command line: /bin/sh -c cd <https://builds.apache.org/job/HBase-TRUNK/ws/trunk> && /home/jenkins/tools/java/jdk1.6.0_27-32/jre/bin/java -enableassertions -Xmx1900m -Djava.security.egd=file:/dev/./urandom -jar <https://builds.apache.org/job/HBase-TRUNK/ws/trunk/target/surefire/surefirebooter2877057249458393426.jar> <https://builds.apache.org/job/HBase-TRUNK/ws/trunk/target/surefire/surefire7857706362858597289tmp> <https://builds.apache.org/job/HBase-TRUNK/ws/trunk/target/surefire/surefire_751387668663002345081tmp>
Running org.apache.hadoop.hbase.coprocessor.TestAggregateProtocol
Tests run: 45, Failures: 0, Errors: 0, Skipped: 0, Time elapsed: 16.992 sec
Forking command line: /bin/sh -c cd <https://builds.apache.org/job/HBase-TRUNK/ws/trunk> && /home/jenkins/tools/java/jdk1.6.0_27-32/jre/bin/java -enableassertions -Xmx1900m -Djava.security.egd=file:/dev/./urandom -jar <https://builds.apache.org/job/HBase-TRUNK/ws/trunk/target/surefire/surefirebooter4068436246015376387.jar> <https://builds.apache.org/job/HBase-TRUNK/ws/trunk/target/surefire/surefire1650657743897016827tmp> <https://builds.apache.org/job/HBase-TRUNK/ws/trunk/target/surefire/surefire_76450309050384395272tmp>
Running org.apache.hadoop.hbase.coprocessor.TestMasterObserver
Tests run: 3, Failures: 0, Errors: 0, Skipped: 0, Time elapsed: 26.657 sec
Forking command line: /bin/sh -c cd <https://builds.apache.org/job/HBase-TRUNK/ws/trunk> && /home/jenkins/tools/java/jdk1.6.0_27-32/jre/bin/java -enableassertions -Xmx1900m -Djava.security.egd=file:/dev/./urandom -jar <https://builds.apache.org/job/HBase-TRUNK/ws/trunk/target/surefire/surefirebooter1564086824778739337.jar> <https://builds.apache.org/job/HBase-TRUNK/ws/trunk/target/surefire/surefire5738210915514513788tmp> <https://builds.apache.org/job/HBase-TRUNK/ws/trunk/target/surefire/surefire_778538112917142588651tmp>
Running org.apache.hadoop.hbase.coprocessor.TestCoprocessorEndpoint
Tests run: 3, Failures: 0, Errors: 0, Skipped: 1, Time elapsed: 29.22 sec
Forking command line: /bin/sh -c cd <https://builds.apache.org/job/HBase-TRUNK/ws/trunk> && /home/jenkins/tools/java/jdk1.6.0_27-32/jre/bin/java -enableassertions -Xmx1900m -Djava.security.egd=file:/dev/./urandom -jar <https://builds.apache.org/job/HBase-TRUNK/ws/trunk/target/surefire/surefirebooter4914041186153172257.jar> <https://builds.apache.org/job/HBase-TRUNK/ws/trunk/target/surefire/surefire4916337463053394019tmp> <https://builds.apache.org/job/HBase-TRUNK/ws/trunk/target/surefire/surefire_788660205873750787207tmp>
Forking command line: /bin/sh -c cd <https://builds.apache.org/job/HBase-TRUNK/ws/trunk> && /home/jenkins/tools/java/jdk1.6.0_27-32/jre/bin/java -enableassertions -Xmx1900m -Djava.security.egd=file:/dev/./urandom -jar <https://builds.apache.org/job/HBase-TRUNK/ws/trunk/target/surefire/surefirebooter6381610782686654086.jar> <https://builds.apache.org/job/HBase-TRUNK/ws/trunk/target/surefire/surefire776303453864320017tmp> <https://builds.apache.org/job/HBase-TRUNK/ws/trunk/target/surefire/surefire_791984015576546753593tmp>
Running org.apache.hadoop.hbase.coprocessor.TestClassLoading
Tests run: 6, Failures: 0, Errors: 0, Skipped: 0, Time elapsed: 31.703 sec
Forking command line: /bin/sh -c cd <https://builds.apache.org/job/HBase-TRUNK/ws/trunk> && /home/jenkins/tools/java/jdk1.6.0_27-32/jre/bin/java -enableassertions -Xmx1900m -Djava.security.egd=file:/dev/./urandom -jar <https://builds.apache.org/job/HBase-TRUNK/ws/trunk/target/surefire/surefirebooter6373620076928471534.jar> <https://builds.apache.org/job/HBase-TRUNK/ws/trunk/target/surefire/surefire4547822130363715540tmp> <https://builds.apache.org/job/HBase-TRUNK/ws/trunk/target/surefire/surefire_806697182102818714383tmp>
Running org.apache.hadoop.hbase.coprocessor.TestRegionObserverInterface
Tests run: 6, Failures: 0, Errors: 0, Skipped: 0, Time elapsed: 34.192 sec
Forking command line: /bin/sh -c cd <https://builds.apache.org/job/HBase-TRUNK/ws/trunk> && /home/jenkins/tools/java/jdk1.6.0_27-32/jre/bin/java -enableassertions -Xmx1900m -Djava.security.egd=file:/dev/./urandom -jar <https://builds.apache.org/job/HBase-TRUNK/ws/trunk/target/surefire/surefirebooter7629998173299972243.jar> <https://builds.apache.org/job/HBase-TRUNK/ws/trunk/target/surefire/surefire2562064577003091746tmp> <https://builds.apache.org/job/HBase-TRUNK/ws/trunk/target/surefire/surefire_815566298994452042891tmp>
Running org.apache.hadoop.hbase.coprocessor.TestMasterCoprocessorExceptionWithRemove
Tests run: 1, Failures: 0, Errors: 0, Skipped: 0, Time elapsed: 14.776 sec
Forking command line: /bin/sh -c cd <https://builds.apache.org/job/HBase-TRUNK/ws/trunk> && /home/jenkins/tools/java/jdk1.6.0_27-32/jre/bin/java -enableassertions -Xmx1900m -Djava.security.egd=file:/dev/./urandom -jar <https://builds.apache.org/job/HBase-TRUNK/ws/trunk/target/surefire/surefirebooter3626888581888092304.jar> <https://builds.apache.org/job/HBase-TRUNK/ws/trunk/target/surefire/surefire1273042641551492703tmp> <https://builds.apache.org/job/HBase-TRUNK/ws/trunk/target/surefire/surefire_823010167471660063979tmp>
Running org.apache.hadoop.hbase.coprocessor.TestRegionServerCoprocessorExceptionWithRemove
Tests run: 1, Failures: 0, Errors: 0, Skipped: 0, Time elapsed: 18.94 sec
Forking command line: /bin/sh -c cd <https://builds.apache.org/job/HBase-TRUNK/ws/trunk> && /home/jenkins/tools/java/jdk1.6.0_27-32/jre/bin/java -enableassertions -Xmx1900m -Djava.security.egd=file:/dev/./urandom -jar <https://builds.apache.org/job/HBase-TRUNK/ws/trunk/target/surefire/surefirebooter2486864251784811426.jar> <https://builds.apache.org/job/HBase-TRUNK/ws/trunk/target/surefire/surefire3519692097494794280tmp> <https://builds.apache.org/job/HBase-TRUNK/ws/trunk/target/surefire/surefire_838818510750974380942tmp>
Running org.apache.hadoop.hbase.coprocessor.TestMasterCoprocessorExceptionWithAbort
Tests run: 1, Failures: 0, Errors: 0, Skipped: 0, Time elapsed: 25.344 sec
Forking command line: /bin/sh -c cd <https://builds.apache.org/job/HBase-TRUNK/ws/trunk> && /home/jenkins/tools/java/jdk1.6.0_27-32/jre/bin/java -enableassertions -Xmx1900m -Djava.security.egd=file:/dev/./urandom -jar <https://builds.apache.org/job/HBase-TRUNK/ws/trunk/target/surefire/surefirebooter9168156149826716399.jar> <https://builds.apache.org/job/HBase-TRUNK/ws/trunk/target/surefire/surefire5961856654045192905tmp> <https://builds.apache.org/job/HBase-TRUNK/ws/trunk/target/surefire/surefire_847177652198580628466tmp>
Running org.apache.hadoop.hbase.coprocessor.TestWALObserver
Tests run: 3, Failures: 0, Errors: 0, Skipped: 0, Time elapsed: 16.387 sec
Running org.apache.hadoop.hbase.coprocessor.TestRegionServerCoprocessorExceptionWithAbort
Tests run: 1, Failures: 0, Errors: 0, Skipped: 0, Time elapsed: 14.09 sec
Forking command line: /bin/sh -c cd <https://builds.apache.org/job/HBase-TRUNK/ws/trunk> && /home/jenkins/tools/java/jdk1.6.0_27-32/jre/bin/java -enableassertions -Xmx1900m -Djava.security.egd=file:/dev/./urandom -jar <https://builds.apache.org/job/HBase-TRUNK/ws/trunk/target/surefire/surefirebooter1381312624037646320.jar> <https://builds.apache.org/job/HBase-TRUNK/ws/trunk/target/surefire/surefire7563471259878270758tmp> <https://builds.apache.org/job/HBase-TRUNK/ws/trunk/target/surefire/surefire_853641806554969784022tmp>
Forking command line: /bin/sh -c cd <https://builds.apache.org/job/HBase-TRUNK/ws/trunk> && /home/jenkins/tools/java/jdk1.6.0_27-32/jre/bin/java -enableassertions -Xmx1900m -Djava.security.egd=file:/dev/./urandom -jar <https://builds.apache.org/job/HBase-TRUNK/ws/trunk/target/surefire/surefirebooter1346342875952841522.jar> <https://builds.apache.org/job/HBase-TRUNK/ws/trunk/target/surefire/surefire1774134943054190392tmp> <https://builds.apache.org/job/HBase-TRUNK/ws/trunk/target/surefire/surefire_862131678460680142796tmp>
Running org.apache.hadoop.hbase.coprocessor.TestRegionObserverBypass
Tests run: 2, Failures: 0, Errors: 0, Skipped: 0, Time elapsed: 12.467 sec
Forking command line: /bin/sh -c cd <https://builds.apache.org/job/HBase-TRUNK/ws/trunk> && /home/jenkins/tools/java/jdk1.6.0_27-32/jre/bin/java -enableassertions -Xmx1900m -Djava.security.egd=file:/dev/./urandom -jar <https://builds.apache.org/job/HBase-TRUNK/ws/trunk/target/surefire/surefirebooter2429420026882050630.jar> <https://builds.apache.org/job/HBase-TRUNK/ws/trunk/target/surefire/surefire4141909654590430475tmp> <https://builds.apache.org/job/HBase-TRUNK/ws/trunk/target/surefire/surefire_876155907330274774263tmp>
Running org.apache.hadoop.hbase.thrift2.TestThriftHBaseServiceHandler
Tests run: 12, Failures: 0, Errors: 0, Skipped: 0, Time elapsed: 12.318 sec
Forking command line: /bin/sh -c cd <https://builds.apache.org/job/HBase-TRUNK/ws/trunk> && /home/jenkins/tools/java/jdk1.6.0_27-32/jre/bin/java -enableassertions -Xmx1900m -Djava.security.egd=file:/dev/./urandom -jar <https://builds.apache.org/job/HBase-TRUNK/ws/trunk/target/surefire/surefirebooter1337186589915580960.jar> <https://builds.apache.org/job/HBase-TRUNK/ws/trunk/target/surefire/surefire5474106681493600523tmp> <https://builds.apache.org/job/HBase-TRUNK/ws/trunk/target/surefire/surefire_88172827958707248597tmp>
Running org.apache.hadoop.hbase.avro.TestAvroServer
Tests run: 3, Failures: 0, Errors: 0, Skipped: 0, Time elapsed: 26.893 sec
Forking command line: /bin/sh -c cd <https://builds.apache.org/job/HBase-TRUNK/ws/trunk> && /home/jenkins/tools/java/jdk1.6.0_27-32/jre/bin/java -enableassertions -Xmx1900m -Djava.security.egd=file:/dev/./urandom -jar <https://builds.apache.org/job/HBase-TRUNK/ws/trunk/target/surefire/surefirebooter3000742504600413463.jar> <https://builds.apache.org/job/HBase-TRUNK/ws/trunk/target/surefire/surefire6343496034164439108tmp> <https://builds.apache.org/job/HBase-TRUNK/ws/trunk/target/surefire/surefire_896669903285172025946tmp>
Running org.apache.hadoop.hbase.monitoring.TestTaskMonitor
Tests run: 3, Failures: 0, Errors: 0, Skipped: 0, Time elapsed: 0.299 sec
Forking command line: /bin/sh -c cd <https://builds.apache.org/job/HBase-TRUNK/ws/trunk> && /home/jenkins/tools/java/jdk1.6.0_27-32/jre/bin/java -enableassertions -Xmx1900m -Djava.security.egd=file:/dev/./urandom -jar <https://builds.apache.org/job/HBase-TRUNK/ws/trunk/target/surefire/surefirebooter5868784204668378851.jar> <https://builds.apache.org/job/HBase-TRUNK/ws/trunk/target/surefire/surefire3544029280158107722tmp> <https://builds.apache.org/job/HBase-TRUNK/ws/trunk/target/surefire/surefire_905557583224592062358tmp>
Running org.apache.hadoop.hbase.monitoring.TestMemoryBoundedLogMessageBuffer
Tests run: 2, Failures: 0, Errors: 0, Skipped: 0, Time elapsed: 0.232 sec
Forking command line: /bin/sh -c cd <https://builds.apache.org/job/HBase-TRUNK/ws/trunk> && /home/jenkins/tools/java/jdk1.6.0_27-32/jre/bin/java -enableassertions -Xmx1900m -Djava.security.egd=file:/dev/./urandom -jar <https://builds.apache.org/job/HBase-TRUNK/ws/trunk/target/surefire/surefirebooter1595496684621726516.jar> <https://builds.apache.org/job/HBase-TRUNK/ws/trunk/target/surefire/surefire6295339648249984008tmp> <https://builds.apache.org/job/HBase-TRUNK/ws/trunk/target/surefire/surefire_916536799061084878718tmp>
Running org.apache.hadoop.hbase.thrift.TestThriftServer
Tests run: 1, Failures: 0, Errors: 0, Skipped: 0, Time elapsed: 66.052 sec
Forking command line: /bin/sh -c cd <https://builds.apache.org/job/HBase-TRUNK/ws/trunk> && /home/jenkins/tools/java/jdk1.6.0_27-32/jre/bin/java -enableassertions -Xmx1900m -Djava.security.egd=file:/dev/./urandom -jar <https://builds.apache.org/job/HBase-TRUNK/ws/trunk/target/surefire/surefirebooter4261651661702288621.jar> <https://builds.apache.org/job/HBase-TRUNK/ws/trunk/target/surefire/surefire8033161132521695111tmp> <https://builds.apache.org/job/HBase-TRUNK/ws/trunk/target/surefire/surefire_927480049486777967180tmp>
Running org.apache.hadoop.hbase.regionserver.TestMasterAddressManager
Tests run: 1, Failures: 0, Errors: 0, Skipped: 0, Time elapsed: 0.73 sec
Forking command line: /bin/sh -c cd <https://builds.apache.org/job/HBase-TRUNK/ws/trunk> && /home/jenkins/tools/java/jdk1.6.0_27-32/jre/bin/java -enableassertions -Xmx1900m -Djava.security.egd=file:/dev/./urandom -jar <https://builds.apache.org/job/HBase-TRUNK/ws/trunk/target/surefire/surefirebooter1084376511952982945.jar> <https://builds.apache.org/job/HBase-TRUNK/ws/trunk/target/surefire/surefire1766418203967460297tmp> <https://builds.apache.org/job/HBase-TRUNK/ws/trunk/target/surefire/surefire_93224856413288599390tmp>
Running org.apache.hadoop.hbase.regionserver.TestHRegion
Tests run: 62, Failures: 0, Errors: 0, Skipped: 0, Time elapsed: 53.865 sec
Forking command line: /bin/sh -c cd <https://builds.apache.org/job/HBase-TRUNK/ws/trunk> && /home/jenkins/tools/java/jdk1.6.0_27-32/jre/bin/java -enableassertions -Xmx1900m -Djava.security.egd=file:/dev/./urandom -jar <https://builds.apache.org/job/HBase-TRUNK/ws/trunk/target/surefire/surefirebooter5879711938251953320.jar> <https://builds.apache.org/job/HBase-TRUNK/ws/trunk/target/surefire/surefire2707605719547866735tmp> <https://builds.apache.org/job/HBase-TRUNK/ws/trunk/target/surefire/surefire_948729574547010246405tmp>
Running org.apache.hadoop.hbase.regionserver.TestSplitLogWorker
Tests run: 5, Failures: 0, Errors: 0, Skipped: 0, Time elapsed: 2.234 sec
Forking command line: /bin/sh -c cd <https://builds.apache.org/job/HBase-TRUNK/ws/trunk> && /home/jenkins/tools/java/jdk1.6.0_27-32/jre/bin/java -enableassertions -Xmx1900m -Djava.security.egd=file:/dev/./urandom -jar <https://builds.apache.org/job/HBase-TRUNK/ws/trunk/target/surefire/surefirebooter5537938585733863843.jar> <https://builds.apache.org/job/HBase-TRUNK/ws/trunk/target/surefire/surefire499570263689136305tmp> <https://builds.apache.org/job/HBase-TRUNK/ws/trunk/target/surefire/surefire_954625778121809570894tmp>
Running org.apache.hadoop.hbase.regionserver.TestServerCustomProtocol
Tests run: 7, Failures: 1, Errors: 0, Skipped: 0, Time elapsed: 16.11 sec <<< FAILURE!
Forking command line: /bin/sh -c cd <https://builds.apache.org/job/HBase-TRUNK/ws/trunk> && /home/jenkins/tools/java/jdk1.6.0_27-32/jre/bin/java -enableassertions -Xmx1900m -Djava.security.egd=file:/dev/./urandom -jar <https://builds.apache.org/job/HBase-TRUNK/ws/trunk/target/surefire/surefirebooter3747871564072410329.jar> <https://builds.apache.org/job/HBase-TRUNK/ws/trunk/target/surefire/surefire253382899158796415tmp> <https://builds.apache.org/job/HBase-TRUNK/ws/trunk/target/surefire/surefire_96737440932387086399tmp>
Running org.apache.hadoop.hbase.regionserver.TestStoreFileBlockCacheSummary
Tests run: 1, Failures: 0, Errors: 0, Skipped: 0, Time elapsed: 15.067 sec
Forking command line: /bin/sh -c cd <https://builds.apache.org/job/HBase-TRUNK/ws/trunk> && /home/jenkins/tools/java/jdk1.6.0_27-32/jre/bin/java -enableassertions -Xmx1900m -Djava.security.egd=file:/dev/./urandom -jar <https://builds.apache.org/job/HBase-TRUNK/ws/trunk/target/surefire/surefirebooter882050481463443574.jar> <https://builds.apache.org/job/HBase-TRUNK/ws/trunk/target/surefire/surefire2716025595164589401tmp> <https://builds.apache.org/job/HBase-TRUNK/ws/trunk/target/surefire/surefire_976189853660580680337tmp>
Running org.apache.hadoop.hbase.regionserver.TestRegionServerMetrics
Tests run: 2, Failures: 0, Errors: 0, Skipped: 0, Time elapsed: 44.244 sec
Forking command line: /bin/sh -c cd <https://builds.apache.org/job/HBase-TRUNK/ws/trunk> && /home/jenkins/tools/java/jdk1.6.0_27-32/jre/bin/java -enableassertions -Xmx1900m -Djava.security.egd=file:/dev/./urandom -jar <https://builds.apache.org/job/HBase-TRUNK/ws/trunk/target/surefire/surefirebooter4424731225540639842.jar> <https://builds.apache.org/job/HBase-TRUNK/ws/trunk/target/surefire/surefire6654666696861941259tmp> <https://builds.apache.org/job/HBase-TRUNK/ws/trunk/target/surefire/surefire_986549971866603496470tmp>
Running org.apache.hadoop.hbase.regionserver.TestStore
Tests run: 12, Failures: 0, Errors: 0, Skipped: 0, Time elapsed: 9.635 sec
Forking command line: /bin/sh -c cd <https://builds.apache.org/job/HBase-TRUNK/ws/trunk> && /home/jenkins/tools/java/jdk1.6.0_27-32/jre/bin/java -enableassertions -Xmx1900m -Djava.security.egd=file:/dev/./urandom -jar <https://builds.apache.org/job/HBase-TRUNK/ws/trunk/target/surefire/surefirebooter8808755391624023641.jar> <https://builds.apache.org/job/HBase-TRUNK/ws/trunk/target/surefire/surefire3045538976185665771tmp> <https://builds.apache.org/job/HBase-TRUNK/ws/trunk/target/surefire/surefire_991249606166964890844tmp>
Running org.apache.hadoop.hbase.regionserver.TestBlocksRead
Tests run: 4, Failures: 0, Errors: 0, Skipped: 0, Time elapsed: 1.15 sec
Forking command line: /bin/sh -c cd <https://builds.apache.org/job/HBase-TRUNK/ws/trunk> && /home/jenkins/tools/java/jdk1.6.0_27-32/jre/bin/java -enableassertions -Xmx1900m -Djava.security.egd=file:/dev/./urandom -jar <https://builds.apache.org/job/HBase-TRUNK/ws/trunk/target/surefire/surefirebooter2115796397880066811.jar> <https://builds.apache.org/job/HBase-TRUNK/ws/trunk/target/surefire/surefire6899005821315444444tmp> <https://builds.apache.org/job/HBase-TRUNK/ws/trunk/target/surefire/surefire_1006441039979799347030tmp>
Running org.apache.hadoop.hbase.regionserver.TestAtomicOperation
Tests run: 5, Failures: 0, Errors: 0, Skipped: 0, Time elapsed: 27.471 sec
Forking command line: /bin/sh -c cd <https://builds.apache.org/job/HBase-TRUNK/ws/trunk> && /home/jenkins/tools/java/jdk1.6.0_27-32/jre/bin/java -enableassertions -Xmx1900m -Djava.security.egd=file:/dev/./urandom -jar <https://builds.apache.org/job/HBase-TRUNK/ws/trunk/target/surefire/surefirebooter5404169763253432155.jar> <https://builds.apache.org/job/HBase-TRUNK/ws/trunk/target/surefire/surefire2226945891126750068tmp> <https://builds.apache.org/job/HBase-TRUNK/ws/trunk/target/surefire/surefire_1016459325813564483388tmp>
Running org.apache.hadoop.hbase.regionserver.TestSeekOptimizations
Tests run: 6, Failures: 0, Errors: 0, Skipped: 0, Time elapsed: 2.893 sec
Forking command line: /bin/sh -c cd <https://builds.apache.org/job/HBase-TRUNK/ws/trunk> && /home/jenkins/tools/java/jdk1.6.0_27-32/jre/bin/java -enableassertions -Xmx1900m -Djava.security.egd=file:/dev/./urandom -jar <https://builds.apache.org/job/HBase-TRUNK/ws/trunk/target/surefire/surefirebooter5463685256658722544.jar> <https://builds.apache.org/job/HBase-TRUNK/ws/trunk/target/surefire/surefire8282053336595459899tmp> <https://builds.apache.org/job/HBase-TRUNK/ws/trunk/target/surefire/surefire_1025155642669452678309tmp>
Running org.apache.hadoop.hbase.regionserver.TestFSErrorsExposed
Tests run: 3, Failures: 0, Errors: 0, Skipped: 0, Time elapsed: 30.458 sec
Forking command line: /bin/sh -c cd <https://builds.apache.org/job/HBase-TRUNK/ws/trunk> && /home/jenkins/tools/java/jdk1.6.0_27-32/jre/bin/java -enableassertions -Xmx1900m -Djava.security.egd=file:/dev/./urandom -jar <https://builds.apache.org/job/HBase-TRUNK/ws/trunk/target/surefire/surefirebooter7358828662050742498.jar> <https://builds.apache.org/job/HBase-TRUNK/ws/trunk/target/surefire/surefire7745129013510929373tmp> <https://builds.apache.org/job/HBase-TRUNK/ws/trunk/target/surefire/surefire_1035087928200562629873tmp>
Running org.apache.hadoop.hbase.regionserver.handler.TestCloseRegionHandler
Tests run: 3, Failures: 0, Errors: 0, Skipped: 0, Time elapsed: 1.297 sec
Forking command line: /bin/sh -c cd <https://builds.apache.org/job/HBase-TRUNK/ws/trunk> && /home/jenkins/tools/java/jdk1.6.0_27-32/jre/bin/java -enableassertions -Xmx1900m -Djava.security.egd=file:/dev/./urandom -jar <https://builds.apache.org/job/HBase-TRUNK/ws/trunk/target/surefire/surefirebooter2901443489944227660.jar> <https://builds.apache.org/job/HBase-TRUNK/ws/trunk/target/surefire/surefire7116053478385989404tmp> <https://builds.apache.org/job/HBase-TRUNK/ws/trunk/target/surefire/surefire_1047574910629049859688tmp>
Running org.apache.hadoop.hbase.regionserver.handler.TestOpenRegionHandler
Tests run: 3, Failures: 0, Errors: 0, Skipped: 0, Time elapsed: 1.054 sec
Forking command line: /bin/sh -c cd <https://builds.apache.org/job/HBase-TRUNK/ws/trunk> && /home/jenkins/tools/java/jdk1.6.0_27-32/jre/bin/java -enableassertions -Xmx1900m -Djava.security.egd=file:/dev/./urandom -jar <https://builds.apache.org/job/HBase-TRUNK/ws/trunk/target/surefire/surefirebooter3293515694181277979.jar> <https://builds.apache.org/job/HBase-TRUNK/ws/trunk/target/surefire/surefire655065369623400549tmp> <https://builds.apache.org/job/HBase-TRUNK/ws/trunk/target/surefire/surefire_1053441439292937578497tmp>
Running org.apache.hadoop.hbase.regionserver.metrics.TestSchemaMetrics
Tests run: 6, Failures: 0, Errors: 0, Skipped: 0, Time elapsed: 15.13 sec
Forking command line: /bin/sh -c cd <https://builds.apache.org/job/HBase-TRUNK/ws/trunk> && /home/jenkins/tools/java/jdk1.6.0_27-32/jre/bin/java -enableassertions -Xmx1900m -Djava.security.egd=file:/dev/./urandom -jar <https://builds.apache.org/job/HBase-TRUNK/ws/trunk/target/surefire/surefirebooter7567581767992571488.jar> <https://builds.apache.org/job/HBase-TRUNK/ws/trunk/target/surefire/surefire3817551717806344467tmp> <https://builds.apache.org/job/HBase-TRUNK/ws/trunk/target/surefire/surefire_1063047468161386691880tmp>
Running org.apache.hadoop.hbase.regionserver.TestParallelPut
Tests run: 2, Failures: 0, Errors: 0, Skipped: 0, Time elapsed: 5.414 sec
Running org.apache.hadoop.hbase.regionserver.wal.TestHLogBench
Tests run: 1, Failures: 0, Errors: 0, Skipped: 0, Time elapsed: 1.392 sec
Forking command line: /bin/sh -c cd <https://builds.apache.org/job/HBase-TRUNK/ws/trunk> && /home/jenkins/tools/java/jdk1.6.0_27-32/jre/bin/java -enableassertions -Xmx1900m -Djava.security.egd=file:/dev/./urandom -jar <https://builds.apache.org/job/HBase-TRUNK/ws/trunk/target/surefire/surefirebooter1802898601383435966.jar> <https://builds.apache.org/job/HBase-TRUNK/ws/trunk/target/surefire/surefire4835922278782932037tmp> <https://builds.apache.org/job/HBase-TRUNK/ws/trunk/target/surefire/surefire_1073419543380554302708tmp>
Forking command line: /bin/sh -c cd <https://builds.apache.org/job/HBase-TRUNK/ws/trunk> && /home/jenkins/tools/java/jdk1.6.0_27-32/jre/bin/java -enableassertions -Xmx1900m -Djava.security.egd=file:/dev/./urandom -jar <https://builds.apache.org/job/HBase-TRUNK/ws/trunk/target/surefire/surefirebooter4394252382458602935.jar> <https://builds.apache.org/job/HBase-TRUNK/ws/trunk/target/surefire/surefire168741162439498623tmp> <https://builds.apache.org/job/HBase-TRUNK/ws/trunk/target/surefire/surefire_1087552529809612925585tmp>
Running org.apache.hadoop.hbase.regionserver.wal.TestLogRollingNoCluster
Tests run: 1, Failures: 0, Errors: 0, Skipped: 0, Time elapsed: 2.362 sec
Forking command line: /bin/sh -c cd <https://builds.apache.org/job/HBase-TRUNK/ws/trunk> && /home/jenkins/tools/java/jdk1.6.0_27-32/jre/bin/java -enableassertions -Xmx1900m -Djava.security.egd=file:/dev/./urandom -jar <https://builds.apache.org/job/HBase-TRUNK/ws/trunk/target/surefire/surefirebooter154244911097049171.jar> <https://builds.apache.org/job/HBase-TRUNK/ws/trunk/target/surefire/surefire5871509738272256680tmp> <https://builds.apache.org/job/HBase-TRUNK/ws/trunk/target/surefire/surefire_1091812068509338691935tmp>
Running org.apache.hadoop.hbase.regionserver.wal.TestLogRollAbort
Tests run: 1, Failures: 0, Errors: 0, Skipped: 0, Time elapsed: 18.319 sec
Forking command line: /bin/sh -c cd <https://builds.apache.org/job/HBase-TRUNK/ws/trunk> && /home/jenkins/tools/java/jdk1.6.0_27-32/jre/bin/java -enableassertions -Xmx1900m -Djava.security.egd=file:/dev/./urandom -jar <https://builds.apache.org/job/HBase-TRUNK/ws/trunk/target/surefire/surefirebooter117757478265860601.jar> <https://builds.apache.org/job/HBase-TRUNK/ws/trunk/target/surefire/surefire2426168414122544736tmp> <https://builds.apache.org/job/HBase-TRUNK/ws/trunk/target/surefire/surefire_1102289756903651147838tmp>
Running org.apache.hadoop.hbase.regionserver.wal.TestWALReplay
Tests run: 5, Failures: 0, Errors: 0, Skipped: 0, Time elapsed: 29.176 sec
Running org.apache.hadoop.hbase.regionserver.wal.TestWALReplayCompressed
Tests run: 5, Failures: 0, Errors: 0, Skipped: 0, Time elapsed: 30.549 sec
Forking command line: /bin/sh -c cd <https://builds.apache.org/job/HBase-TRUNK/ws/trunk> && /home/jenkins/tools/java/jdk1.6.0_27-32/jre/bin/java -enableassertions -Xmx1900m -Djava.security.egd=file:/dev/./urandom -jar <https://builds.apache.org/job/HBase-TRUNK/ws/trunk/target/surefire/surefirebooter697397720968857734.jar> <https://builds.apache.org/job/HBase-TRUNK/ws/trunk/target/surefire/surefire4495941204166227142tmp> <https://builds.apache.org/job/HBase-TRUNK/ws/trunk/target/surefire/surefire_1113110926167966346297tmp>
Running org.apache.hadoop.hbase.regionserver.TestStoreScanner
Tests run: 16, Failures: 0, Errors: 0, Skipped: 0, Time elapsed: 0.049 sec
Forking command line: /bin/sh -c cd <https://builds.apache.org/job/HBase-TRUNK/ws/trunk> && /home/jenkins/tools/java/jdk1.6.0_27-32/jre/bin/java -enableassertions -Xmx1900m -Djava.security.egd=file:/dev/./urandom -jar <https://builds.apache.org/job/HBase-TRUNK/ws/trunk/target/surefire/surefirebooter7203229403536384784.jar> <https://builds.apache.org/job/HBase-TRUNK/ws/trunk/target/surefire/surefire2667118143240528746tmp> <https://builds.apache.org/job/HBase-TRUNK/ws/trunk/target/surefire/surefire_1124837702760333631855tmp>
Running org.apache.hadoop.hbase.regionserver.TestRpcMetrics
Tests run: 1, Failures: 0, Errors: 0, Skipped: 0, Time elapsed: 2.167 sec
Forking command line: /bin/sh -c cd <https://builds.apache.org/job/HBase-TRUNK/ws/trunk> && /home/jenkins/tools/java/jdk1.6.0_27-32/jre/bin/java -enableassertions -Xmx1900m -Djava.security.egd=file:/dev/./urandom -jar <https://builds.apache.org/job/HBase-TRUNK/ws/trunk/target/surefire/surefirebooter6795925147574834851.jar> <https://builds.apache.org/job/HBase-TRUNK/ws/trunk/target/surefire/surefire5350093937058588098tmp> <https://builds.apache.org/job/HBase-TRUNK/ws/trunk/target/surefire/surefire_1134817378722197855777tmp>
Forking command line: /bin/sh -c cd <https://builds.apache.org/job/HBase-TRUNK/ws/trunk> && /home/jenkins/tools/java/jdk1.6.0_27-32/jre/bin/java -enableassertions -Xmx1900m -Djava.security.egd=file:/dev/./urandom -jar <https://builds.apache.org/job/HBase-TRUNK/ws/trunk/target/surefire/surefirebooter6137870973870072716.jar> <https://builds.apache.org/job/HBase-TRUNK/ws/trunk/target/surefire/surefire2145458111639358586tmp> <https://builds.apache.org/job/HBase-TRUNK/ws/trunk/target/surefire/surefire_1143424699526016652059tmp>
Running org.apache.hadoop.hbase.TestDrainingServer
Tests run: 2, Failures: 0, Errors: 0, Skipped: 0, Time elapsed: 16.558 sec
Forking command line: /bin/sh -c cd <https://builds.apache.org/job/HBase-TRUNK/ws/trunk> && /home/jenkins/tools/java/jdk1.6.0_27-32/jre/bin/java -enableassertions -Xmx1900m -Djava.security.egd=file:/dev/./urandom -jar <https://builds.apache.org/job/HBase-TRUNK/ws/trunk/target/surefire/surefirebooter6590883858959716527.jar> <https://builds.apache.org/job/HBase-TRUNK/ws/trunk/target/surefire/surefire5268462130965251922tmp> <https://builds.apache.org/job/HBase-TRUNK/ws/trunk/target/surefire/surefire_1151218356254889850939tmp>
Running org.apache.hadoop.hbase.regionserver.TestMultiColumnScanner
Tests run: 12, Failures: 0, Errors: 0, Skipped: 0, Time elapsed: 41.146 sec
Forking command line: /bin/sh -c cd <https://builds.apache.org/job/HBase-TRUNK/ws/trunk> && /home/jenkins/tools/java/jdk1.6.0_27-32/jre/bin/java -enableassertions -Xmx1900m -Djava.security.egd=file:/dev/./urandom -jar <https://builds.apache.org/job/HBase-TRUNK/ws/trunk/target/surefire/surefirebooter7121656720316614469.jar> <https://builds.apache.org/job/HBase-TRUNK/ws/trunk/target/surefire/surefire4940009465448608854tmp> <https://builds.apache.org/job/HBase-TRUNK/ws/trunk/target/surefire/surefire_1167336220066640323980tmp>
Running org.apache.hadoop.hbase.mapreduce.TestImportExport
Tests run: 2, Failures: 0, Errors: 0, Skipped: 0, Time elapsed: 48.954 sec
Forking command line: /bin/sh -c cd <https://builds.apache.org/job/HBase-TRUNK/ws/trunk> && /home/jenkins/tools/java/jdk1.6.0_27-32/jre/bin/java -enableassertions -Xmx1900m -Djava.security.egd=file:/dev/./urandom -jar <https://builds.apache.org/job/HBase-TRUNK/ws/trunk/target/surefire/surefirebooter645037484947503424.jar> <https://builds.apache.org/job/HBase-TRUNK/ws/trunk/target/surefire/surefire24193868012576742tmp> <https://builds.apache.org/job/HBase-TRUNK/ws/trunk/target/surefire/surefire_1177248000795693719730tmp>
Running org.apache.hadoop.hbase.mapreduce.TestHLogRecordReader
Tests run: 2, Failures: 0, Errors: 0, Skipped: 0, Time elapsed: 5.408 sec
Running org.apache.hadoop.hbase.mapreduce.TestImportTsv
Tests run: 8, Failures: 0, Errors: 0, Skipped: 0, Time elapsed: 78.975 sec

Results :

Failed tests:   testRowRange(org.apache.hadoop.hbase.regionserver.TestServerCustomProtocol): Results should contain region test,bbb,1334370837452.48c4de3850b343dae4bd9c49d8c10117. for row 'bbb'

Tests run: 605, Failures: 1, Errors: 0, Skipped: 2

[INFO] ------------------------------------------------------------------------
[INFO] BUILD FAILURE
[INFO] ------------------------------------------------------------------------
[INFO] Total time: 34:10.465s
[INFO] Finished at: Sat Apr 14 02:40:48 UTC 2012
[INFO] Final Memory: 70M/802M
[INFO] ------------------------------------------------------------------------
[ERROR] Failed to execute goal org.apache.maven.plugins:maven-surefire-plugin:2.12-TRUNK-HBASE-2:test (secondPartTestsExecution) on project hbase: Failure or timeout -> [Help 1]
org.apache.maven.lifecycle.LifecycleExecutionException: Failed to execute goal org.apache.maven.plugins:maven-surefire-plugin:2.12-TRUNK-HBASE-2:test (secondPartTestsExecution) on project hbase: Failure or timeout
	at org.apache.maven.lifecycle.internal.MojoExecutor.execute(MojoExecutor.java:217)
	at org.apache.maven.lifecycle.internal.MojoExecutor.execute(MojoExecutor.java:153)
	at org.apache.maven.lifecycle.internal.MojoExecutor.execute(MojoExecutor.java:145)
	at org.apache.maven.lifecycle.internal.LifecycleModuleBuilder.buildProject(LifecycleModuleBuilder.java:84)
	at org.apache.maven.lifecycle.internal.LifecycleModuleBuilder.buildProject(LifecycleModuleBuilder.java:59)
	at org.apache.maven.lifecycle.internal.LifecycleStarter.singleThreadedBuild(LifecycleStarter.java:183)
	at org.apache.maven.lifecycle.internal.LifecycleStarter.execute(LifecycleStarter.java:161)
	at org.apache.maven.DefaultMaven.doExecute(DefaultMaven.java:319)
	at org.apache.maven.DefaultMaven.execute(DefaultMaven.java:156)
	at org.apache.maven.cli.MavenCli.execute(MavenCli.java:537)
	at org.apache.maven.cli.MavenCli.doMain(MavenCli.java:196)
	at org.apache.maven.cli.MavenCli.main(MavenCli.java:141)
	at sun.reflect.NativeMethodAccessorImpl.invoke0(Native Method)
	at sun.reflect.NativeMethodAccessorImpl.invoke(NativeMethodAccessorImpl.java:39)
	at sun.reflect.DelegatingMethodAccessorImpl.invoke(DelegatingMethodAccessorImpl.java:25)
	at java.lang.reflect.Method.invoke(Method.java:597)
	at org.codehaus.plexus.classworlds.launcher.Launcher.launchEnhanced(Launcher.java:290)
	at org.codehaus.plexus.classworlds.launcher.Launcher.launch(Launcher.java:230)
	at org.codehaus.plexus.classworlds.launcher.Launcher.mainWithExitCode(Launcher.java:409)
	at org.codehaus.plexus.classworlds.launcher.Launcher.main(Launcher.java:352)
Caused by: org.apache.maven.plugin.MojoExecutionException: Failure or timeout
	at org.apache.maven.plugin.surefire.SurefirePlugin.assertNoFailureOrTimeout(SurefirePlugin.java:643)
	at org.apache.maven.plugin.surefire.SurefirePlugin.handleSummary(SurefirePlugin.java:624)
	at org.apache.maven.plugin.surefire.AbstractSurefireMojo.executeAfterPreconditionsChecked(AbstractSurefireMojo.java:137)
	at org.apache.maven.plugin.surefire.AbstractSurefireMojo.execute(AbstractSurefireMojo.java:98)
	at org.apache.maven.plugin.DefaultBuildPluginManager.executeMojo(DefaultBuildPluginManager.java:101)
	at org.apache.maven.lifecycle.internal.MojoExecutor.execute(MojoExecutor.java:209)
	... 19 more
[ERROR] 
[ERROR] 
[ERROR] For more information about the errors and possible solutions, please read the following articles:
[ERROR] [Help 1] http://cwiki.apache.org/confluence/display/MAVEN/MojoExecutionException
Build step 'Invoke top-level Maven targets' marked build as failure
Archiving artifacts
Recording test results
Updating HBASE-5684

Mime
View raw message