hbase-dev mailing list archives

Site index · List index
Message view « Date » · « Thread »
Top « Date » · « Thread »
From Apache Jenkins Server <jenk...@builds.apache.org>
Subject Build failed in Jenkins: HBase-TRUNK #2760
Date Sat, 14 Apr 2012 03:29:20 GMT
See <https://builds.apache.org/job/HBase-TRUNK/2760/>

------------------------------------------
[...truncated 17800 lines...]
Tests run: 1, Failures: 0, Errors: 0, Skipped: 0, Time elapsed: 2.64 sec
Forking command line: /bin/sh -c cd /x1/jenkins/jenkins-slave/workspace/HBase-TRUNK/trunk
&& /x1/jenkins/tools/java/jdk1.6.0_27-32/jre/bin/java -enableassertions -Xmx1900m
-Djava.security.egd=file:/dev/./urandom -jar /x1/jenkins/jenkins-slave/workspace/HBase-TRUNK/trunk/target/surefire/surefirebooter3576998812760212068.jar
/x1/jenkins/jenkins-slave/workspace/HBase-TRUNK/trunk/target/surefire/surefire3708663123610005582tmp
/x1/jenkins/jenkins-slave/workspace/HBase-TRUNK/trunk/target/surefire/surefire_533773073124951128850tmp
Running org.apache.hadoop.hbase.mapreduce.TestImportTsv
Tests run: 8, Failures: 0, Errors: 0, Skipped: 0, Time elapsed: 79.059 sec
Forking command line: /bin/sh -c cd /x1/jenkins/jenkins-slave/workspace/HBase-TRUNK/trunk
&& /x1/jenkins/tools/java/jdk1.6.0_27-32/jre/bin/java -enableassertions -Xmx1900m
-Djava.security.egd=file:/dev/./urandom -jar /x1/jenkins/jenkins-slave/workspace/HBase-TRUNK/trunk/target/surefire/surefirebooter704795911678458034.jar
/x1/jenkins/jenkins-slave/workspace/HBase-TRUNK/trunk/target/surefire/surefire2032269265467676668tmp
/x1/jenkins/jenkins-slave/workspace/HBase-TRUNK/trunk/target/surefire/surefire_542776587877317834402tmp
Running org.apache.hadoop.hbase.regionserver.wal.TestWALReplay
Tests run: 5, Failures: 0, Errors: 0, Skipped: 0, Time elapsed: 30.029 sec
Running org.apache.hadoop.hbase.regionserver.wal.TestWALReplayCompressed
Tests run: 5, Failures: 0, Errors: 0, Skipped: 0, Time elapsed: 32.035 sec
Forking command line: /bin/sh -c cd /x1/jenkins/jenkins-slave/workspace/HBase-TRUNK/trunk
&& /x1/jenkins/tools/java/jdk1.6.0_27-32/jre/bin/java -enableassertions -Xmx1900m
-Djava.security.egd=file:/dev/./urandom -jar /x1/jenkins/jenkins-slave/workspace/HBase-TRUNK/trunk/target/surefire/surefirebooter1754641898355705582.jar
/x1/jenkins/jenkins-slave/workspace/HBase-TRUNK/trunk/target/surefire/surefire5376545628001629589tmp
/x1/jenkins/jenkins-slave/workspace/HBase-TRUNK/trunk/target/surefire/surefire_554626144491481712864tmp
Forking command line: /bin/sh -c cd /x1/jenkins/jenkins-slave/workspace/HBase-TRUNK/trunk
&& /x1/jenkins/tools/java/jdk1.6.0_27-32/jre/bin/java -enableassertions -Xmx1900m
-Djava.security.egd=file:/dev/./urandom -jar /x1/jenkins/jenkins-slave/workspace/HBase-TRUNK/trunk/target/surefire/surefirebooter7867619218882463292.jar
/x1/jenkins/jenkins-slave/workspace/HBase-TRUNK/trunk/target/surefire/surefire1576035120226470921tmp
/x1/jenkins/jenkins-slave/workspace/HBase-TRUNK/trunk/target/surefire/surefire_568750466347840518079tmp
Running org.apache.hadoop.hbase.regionserver.TestAtomicOperation
Tests run: 5, Failures: 0, Errors: 0, Skipped: 0, Time elapsed: 18.705 sec
Forking command line: /bin/sh -c cd /x1/jenkins/jenkins-slave/workspace/HBase-TRUNK/trunk
&& /x1/jenkins/tools/java/jdk1.6.0_27-32/jre/bin/java -enableassertions -Xmx1900m
-Djava.security.egd=file:/dev/./urandom -jar /x1/jenkins/jenkins-slave/workspace/HBase-TRUNK/trunk/target/surefire/surefirebooter5960421943847074690.jar
/x1/jenkins/jenkins-slave/workspace/HBase-TRUNK/trunk/target/surefire/surefire5037902987437621772tmp
/x1/jenkins/jenkins-slave/workspace/HBase-TRUNK/trunk/target/surefire/surefire_572730763657632089292tmp
Running org.apache.hadoop.hbase.regionserver.TestRegionServerMetrics
Tests run: 2, Failures: 0, Errors: 0, Skipped: 0, Time elapsed: 44.6 sec
Forking command line: /bin/sh -c cd /x1/jenkins/jenkins-slave/workspace/HBase-TRUNK/trunk
&& /x1/jenkins/tools/java/jdk1.6.0_27-32/jre/bin/java -enableassertions -Xmx1900m
-Djava.security.egd=file:/dev/./urandom -jar /x1/jenkins/jenkins-slave/workspace/HBase-TRUNK/trunk/target/surefire/surefirebooter3401036050167356205.jar
/x1/jenkins/jenkins-slave/workspace/HBase-TRUNK/trunk/target/surefire/surefire8183628476281996669tmp
/x1/jenkins/jenkins-slave/workspace/HBase-TRUNK/trunk/target/surefire/surefire_58414774824186556820tmp
Running org.apache.hadoop.hbase.regionserver.TestServerCustomProtocol
Tests run: 7, Failures: 0, Errors: 0, Skipped: 0, Time elapsed: 14.395 sec
Forking command line: /bin/sh -c cd /x1/jenkins/jenkins-slave/workspace/HBase-TRUNK/trunk
&& /x1/jenkins/tools/java/jdk1.6.0_27-32/jre/bin/java -enableassertions -Xmx1900m
-Djava.security.egd=file:/dev/./urandom -jar /x1/jenkins/jenkins-slave/workspace/HBase-TRUNK/trunk/target/surefire/surefirebooter3633962307222447890.jar
/x1/jenkins/jenkins-slave/workspace/HBase-TRUNK/trunk/target/surefire/surefire892586162657875864tmp
/x1/jenkins/jenkins-slave/workspace/HBase-TRUNK/trunk/target/surefire/surefire_592521579292057268601tmp
Running org.apache.hadoop.hbase.regionserver.TestParallelPut
Tests run: 2, Failures: 0, Errors: 0, Skipped: 0, Time elapsed: 3.362 sec
Forking command line: /bin/sh -c cd /x1/jenkins/jenkins-slave/workspace/HBase-TRUNK/trunk
&& /x1/jenkins/tools/java/jdk1.6.0_27-32/jre/bin/java -enableassertions -Xmx1900m
-Djava.security.egd=file:/dev/./urandom -jar /x1/jenkins/jenkins-slave/workspace/HBase-TRUNK/trunk/target/surefire/surefirebooter2740890005549607909.jar
/x1/jenkins/jenkins-slave/workspace/HBase-TRUNK/trunk/target/surefire/surefire3420253890851431647tmp
/x1/jenkins/jenkins-slave/workspace/HBase-TRUNK/trunk/target/surefire/surefire_605929333100296581933tmp
Running org.apache.hadoop.hbase.regionserver.TestFSErrorsExposed
Tests run: 3, Failures: 0, Errors: 0, Skipped: 0, Time elapsed: 28.871 sec
Forking command line: /bin/sh -c cd /x1/jenkins/jenkins-slave/workspace/HBase-TRUNK/trunk
&& /x1/jenkins/tools/java/jdk1.6.0_27-32/jre/bin/java -enableassertions -Xmx1900m
-Djava.security.egd=file:/dev/./urandom -jar /x1/jenkins/jenkins-slave/workspace/HBase-TRUNK/trunk/target/surefire/surefirebooter4714233239643619898.jar
/x1/jenkins/jenkins-slave/workspace/HBase-TRUNK/trunk/target/surefire/surefire6804647099348797646tmp
/x1/jenkins/jenkins-slave/workspace/HBase-TRUNK/trunk/target/surefire/surefire_614125113039051534459tmp
Running org.apache.hadoop.hbase.regionserver.TestRpcMetrics
Tests run: 1, Failures: 0, Errors: 0, Skipped: 0, Time elapsed: 2.084 sec
Forking command line: /bin/sh -c cd /x1/jenkins/jenkins-slave/workspace/HBase-TRUNK/trunk
&& /x1/jenkins/tools/java/jdk1.6.0_27-32/jre/bin/java -enableassertions -Xmx1900m
-Djava.security.egd=file:/dev/./urandom -jar /x1/jenkins/jenkins-slave/workspace/HBase-TRUNK/trunk/target/surefire/surefirebooter2214550707187901085.jar
/x1/jenkins/jenkins-slave/workspace/HBase-TRUNK/trunk/target/surefire/surefire8996048178251370052tmp
/x1/jenkins/jenkins-slave/workspace/HBase-TRUNK/trunk/target/surefire/surefire_622698375243957461373tmp
Running org.apache.hadoop.hbase.regionserver.handler.TestCloseRegionHandler
Tests run: 3, Failures: 0, Errors: 0, Skipped: 0, Time elapsed: 1.075 sec
Forking command line: /bin/sh -c cd /x1/jenkins/jenkins-slave/workspace/HBase-TRUNK/trunk
&& /x1/jenkins/tools/java/jdk1.6.0_27-32/jre/bin/java -enableassertions -Xmx1900m
-Djava.security.egd=file:/dev/./urandom -jar /x1/jenkins/jenkins-slave/workspace/HBase-TRUNK/trunk/target/surefire/surefirebooter2994458494987979068.jar
/x1/jenkins/jenkins-slave/workspace/HBase-TRUNK/trunk/target/surefire/surefire4647292213162273005tmp
/x1/jenkins/jenkins-slave/workspace/HBase-TRUNK/trunk/target/surefire/surefire_637666487853174179487tmp
Running org.apache.hadoop.hbase.regionserver.TestSeekOptimizations
Tests run: 6, Failures: 0, Errors: 0, Skipped: 0, Time elapsed: 2.589 sec
Forking command line: /bin/sh -c cd /x1/jenkins/jenkins-slave/workspace/HBase-TRUNK/trunk
&& /x1/jenkins/tools/java/jdk1.6.0_27-32/jre/bin/java -enableassertions -Xmx1900m
-Djava.security.egd=file:/dev/./urandom -jar /x1/jenkins/jenkins-slave/workspace/HBase-TRUNK/trunk/target/surefire/surefirebooter3340223529573358479.jar
/x1/jenkins/jenkins-slave/workspace/HBase-TRUNK/trunk/target/surefire/surefire3585331767953365312tmp
/x1/jenkins/jenkins-slave/workspace/HBase-TRUNK/trunk/target/surefire/surefire_643148310922751128276tmp
Running org.apache.hadoop.hbase.regionserver.handler.TestOpenRegionHandler
Tests run: 3, Failures: 0, Errors: 0, Skipped: 0, Time elapsed: 0.856 sec
Forking command line: /bin/sh -c cd /x1/jenkins/jenkins-slave/workspace/HBase-TRUNK/trunk
&& /x1/jenkins/tools/java/jdk1.6.0_27-32/jre/bin/java -enableassertions -Xmx1900m
-Djava.security.egd=file:/dev/./urandom -jar /x1/jenkins/jenkins-slave/workspace/HBase-TRUNK/trunk/target/surefire/surefirebooter4888115513676301459.jar
/x1/jenkins/jenkins-slave/workspace/HBase-TRUNK/trunk/target/surefire/surefire3780646022016571742tmp
/x1/jenkins/jenkins-slave/workspace/HBase-TRUNK/trunk/target/surefire/surefire_657184065213182975152tmp
Running org.apache.hadoop.hbase.regionserver.TestBlocksRead
Tests run: 4, Failures: 0, Errors: 0, Skipped: 0, Time elapsed: 0.915 sec
Forking command line: /bin/sh -c cd /x1/jenkins/jenkins-slave/workspace/HBase-TRUNK/trunk
&& /x1/jenkins/tools/java/jdk1.6.0_27-32/jre/bin/java -enableassertions -Xmx1900m
-Djava.security.egd=file:/dev/./urandom -jar /x1/jenkins/jenkins-slave/workspace/HBase-TRUNK/trunk/target/surefire/surefirebooter6730371888670266238.jar
/x1/jenkins/jenkins-slave/workspace/HBase-TRUNK/trunk/target/surefire/surefire6421880035304279132tmp
/x1/jenkins/jenkins-slave/workspace/HBase-TRUNK/trunk/target/surefire/surefire_662120131367811465368tmp
Running org.apache.hadoop.hbase.regionserver.TestStoreScanner
Tests run: 16, Failures: 0, Errors: 0, Skipped: 0, Time elapsed: 0.038 sec
Forking command line: /bin/sh -c cd /x1/jenkins/jenkins-slave/workspace/HBase-TRUNK/trunk
&& /x1/jenkins/tools/java/jdk1.6.0_27-32/jre/bin/java -enableassertions -Xmx1900m
-Djava.security.egd=file:/dev/./urandom -jar /x1/jenkins/jenkins-slave/workspace/HBase-TRUNK/trunk/target/surefire/surefirebooter7899648937580862621.jar
/x1/jenkins/jenkins-slave/workspace/HBase-TRUNK/trunk/target/surefire/surefire2464431737675896697tmp
/x1/jenkins/jenkins-slave/workspace/HBase-TRUNK/trunk/target/surefire/surefire_678821452234619193011tmp
Running org.apache.hadoop.hbase.regionserver.TestSplitLogWorker
Tests run: 5, Failures: 0, Errors: 0, Skipped: 0, Time elapsed: 2.19 sec
Forking command line: /bin/sh -c cd /x1/jenkins/jenkins-slave/workspace/HBase-TRUNK/trunk
&& /x1/jenkins/tools/java/jdk1.6.0_27-32/jre/bin/java -enableassertions -Xmx1900m
-Djava.security.egd=file:/dev/./urandom -jar /x1/jenkins/jenkins-slave/workspace/HBase-TRUNK/trunk/target/surefire/surefirebooter1748943704287390913.jar
/x1/jenkins/jenkins-slave/workspace/HBase-TRUNK/trunk/target/surefire/surefire1190395141617193644tmp
/x1/jenkins/jenkins-slave/workspace/HBase-TRUNK/trunk/target/surefire/surefire_68471523212206758808tmp
Running org.apache.hadoop.hbase.regionserver.metrics.TestSchemaMetrics
Tests run: 6, Failures: 0, Errors: 0, Skipped: 0, Time elapsed: 10.853 sec
Forking command line: /bin/sh -c cd /x1/jenkins/jenkins-slave/workspace/HBase-TRUNK/trunk
&& /x1/jenkins/tools/java/jdk1.6.0_27-32/jre/bin/java -enableassertions -Xmx1900m
-Djava.security.egd=file:/dev/./urandom -jar /x1/jenkins/jenkins-slave/workspace/HBase-TRUNK/trunk/target/surefire/surefirebooter8820455963218261025.jar
/x1/jenkins/jenkins-slave/workspace/HBase-TRUNK/trunk/target/surefire/surefire2721006555664870691tmp
/x1/jenkins/jenkins-slave/workspace/HBase-TRUNK/trunk/target/surefire/surefire_694355254444600786750tmp
Running org.apache.hadoop.hbase.regionserver.TestStoreFileBlockCacheSummary
Tests run: 1, Failures: 0, Errors: 0, Skipped: 0, Time elapsed: 14.99 sec
Forking command line: /bin/sh -c cd /x1/jenkins/jenkins-slave/workspace/HBase-TRUNK/trunk
&& /x1/jenkins/tools/java/jdk1.6.0_27-32/jre/bin/java -enableassertions -Xmx1900m
-Djava.security.egd=file:/dev/./urandom -jar /x1/jenkins/jenkins-slave/workspace/HBase-TRUNK/trunk/target/surefire/surefirebooter5485280020954830328.jar
/x1/jenkins/jenkins-slave/workspace/HBase-TRUNK/trunk/target/surefire/surefire161110798078509374tmp
/x1/jenkins/jenkins-slave/workspace/HBase-TRUNK/trunk/target/surefire/surefire_705505695363252972269tmp
Running org.apache.hadoop.hbase.regionserver.TestMasterAddressManager
Tests run: 1, Failures: 0, Errors: 0, Skipped: 0, Time elapsed: 0.552 sec
Forking command line: /bin/sh -c cd /x1/jenkins/jenkins-slave/workspace/HBase-TRUNK/trunk
&& /x1/jenkins/tools/java/jdk1.6.0_27-32/jre/bin/java -enableassertions -Xmx1900m
-Djava.security.egd=file:/dev/./urandom -jar /x1/jenkins/jenkins-slave/workspace/HBase-TRUNK/trunk/target/surefire/surefirebooter5117892602295116558.jar
/x1/jenkins/jenkins-slave/workspace/HBase-TRUNK/trunk/target/surefire/surefire7522553291761746996tmp
/x1/jenkins/jenkins-slave/workspace/HBase-TRUNK/trunk/target/surefire/surefire_713295029073966698534tmp
Running org.apache.hadoop.hbase.regionserver.TestMultiColumnScanner
Tests run: 12, Failures: 0, Errors: 0, Skipped: 0, Time elapsed: 27.954 sec
Forking command line: /bin/sh -c cd /x1/jenkins/jenkins-slave/workspace/HBase-TRUNK/trunk
&& /x1/jenkins/tools/java/jdk1.6.0_27-32/jre/bin/java -enableassertions -Xmx1900m
-Djava.security.egd=file:/dev/./urandom -jar /x1/jenkins/jenkins-slave/workspace/HBase-TRUNK/trunk/target/surefire/surefirebooter6838117390542480938.jar
/x1/jenkins/jenkins-slave/workspace/HBase-TRUNK/trunk/target/surefire/surefire7396739608922524386tmp
/x1/jenkins/jenkins-slave/workspace/HBase-TRUNK/trunk/target/surefire/surefire_728593152834524201734tmp
Running org.apache.hadoop.hbase.ipc.TestDelayedRpc
Tests run: 4, Failures: 0, Errors: 0, Skipped: 0, Time elapsed: 2.376 sec
Forking command line: /bin/sh -c cd /x1/jenkins/jenkins-slave/workspace/HBase-TRUNK/trunk
&& /x1/jenkins/tools/java/jdk1.6.0_27-32/jre/bin/java -enableassertions -Xmx1900m
-Djava.security.egd=file:/dev/./urandom -jar /x1/jenkins/jenkins-slave/workspace/HBase-TRUNK/trunk/target/surefire/surefirebooter1678545540605682921.jar
/x1/jenkins/jenkins-slave/workspace/HBase-TRUNK/trunk/target/surefire/surefire7104884622035597107tmp
/x1/jenkins/jenkins-slave/workspace/HBase-TRUNK/trunk/target/surefire/surefire_734053022184671761252tmp
Running org.apache.hadoop.hbase.TestGlobalMemStoreSize
Tests run: 1, Failures: 0, Errors: 0, Skipped: 0, Time elapsed: 14.521 sec
Forking command line: /bin/sh -c cd /x1/jenkins/jenkins-slave/workspace/HBase-TRUNK/trunk
&& /x1/jenkins/tools/java/jdk1.6.0_27-32/jre/bin/java -enableassertions -Xmx1900m
-Djava.security.egd=file:/dev/./urandom -jar /x1/jenkins/jenkins-slave/workspace/HBase-TRUNK/trunk/target/surefire/surefirebooter2603781812632116719.jar
/x1/jenkins/jenkins-slave/workspace/HBase-TRUNK/trunk/target/surefire/surefire1154380791004683532tmp
/x1/jenkins/jenkins-slave/workspace/HBase-TRUNK/trunk/target/surefire/surefire_745859038943528898906tmp
Running org.apache.hadoop.hbase.regionserver.TestHRegion
Tests run: 62, Failures: 0, Errors: 0, Skipped: 0, Time elapsed: 47.735 sec
Forking command line: /bin/sh -c cd /x1/jenkins/jenkins-slave/workspace/HBase-TRUNK/trunk
&& /x1/jenkins/tools/java/jdk1.6.0_27-32/jre/bin/java -enableassertions -Xmx1900m
-Djava.security.egd=file:/dev/./urandom -jar /x1/jenkins/jenkins-slave/workspace/HBase-TRUNK/trunk/target/surefire/surefirebooter8613163996258230929.jar
/x1/jenkins/jenkins-slave/workspace/HBase-TRUNK/trunk/target/surefire/surefire1207113695449883830tmp
/x1/jenkins/jenkins-slave/workspace/HBase-TRUNK/trunk/target/surefire/surefire_753992017672366807790tmp
Running org.apache.hadoop.hbase.constraint.TestConstraint
Tests run: 5, Failures: 0, Errors: 0, Skipped: 0, Time elapsed: 29.463 sec
Running org.apache.hadoop.hbase.rest.TestSchemaResource
Tests run: 2, Failures: 0, Errors: 0, Skipped: 0, Time elapsed: 20.628 sec
Forking command line: /bin/sh -c cd /x1/jenkins/jenkins-slave/workspace/HBase-TRUNK/trunk
&& /x1/jenkins/tools/java/jdk1.6.0_27-32/jre/bin/java -enableassertions -Xmx1900m
-Djava.security.egd=file:/dev/./urandom -jar /x1/jenkins/jenkins-slave/workspace/HBase-TRUNK/trunk/target/surefire/surefirebooter4581990834189044256.jar
/x1/jenkins/jenkins-slave/workspace/HBase-TRUNK/trunk/target/surefire/surefire632860464058187685tmp
/x1/jenkins/jenkins-slave/workspace/HBase-TRUNK/trunk/target/surefire/surefire_768977236487489843289tmp
Forking command line: /bin/sh -c cd /x1/jenkins/jenkins-slave/workspace/HBase-TRUNK/trunk
&& /x1/jenkins/tools/java/jdk1.6.0_27-32/jre/bin/java -enableassertions -Xmx1900m
-Djava.security.egd=file:/dev/./urandom -jar /x1/jenkins/jenkins-slave/workspace/HBase-TRUNK/trunk/target/surefire/surefirebooter5193847936065869210.jar
/x1/jenkins/jenkins-slave/workspace/HBase-TRUNK/trunk/target/surefire/surefire8740493189000022452tmp
/x1/jenkins/jenkins-slave/workspace/HBase-TRUNK/trunk/target/surefire/surefire_776743763270444070592tmp
Running org.apache.hadoop.hbase.rest.client.TestRemoteTable
Tests run: 3, Failures: 0, Errors: 0, Skipped: 0, Time elapsed: 14.662 sec
Running org.apache.hadoop.hbase.rest.client.TestRemoteAdmin
Tests run: 1, Failures: 0, Errors: 0, Skipped: 0, Time elapsed: 15.045 sec
Forking command line: /bin/sh -c cd /x1/jenkins/jenkins-slave/workspace/HBase-TRUNK/trunk
&& /x1/jenkins/tools/java/jdk1.6.0_27-32/jre/bin/java -enableassertions -Xmx1900m
-Djava.security.egd=file:/dev/./urandom -jar /x1/jenkins/jenkins-slave/workspace/HBase-TRUNK/trunk/target/surefire/surefirebooter5588987531104763498.jar
/x1/jenkins/jenkins-slave/workspace/HBase-TRUNK/trunk/target/surefire/surefire7736790193124748527tmp
/x1/jenkins/jenkins-slave/workspace/HBase-TRUNK/trunk/target/surefire/surefire_782479125400398542410tmp
Forking command line: /bin/sh -c cd /x1/jenkins/jenkins-slave/workspace/HBase-TRUNK/trunk
&& /x1/jenkins/tools/java/jdk1.6.0_27-32/jre/bin/java -enableassertions -Xmx1900m
-Djava.security.egd=file:/dev/./urandom -jar /x1/jenkins/jenkins-slave/workspace/HBase-TRUNK/trunk/target/surefire/surefirebooter5211211665459262338.jar
/x1/jenkins/jenkins-slave/workspace/HBase-TRUNK/trunk/target/surefire/surefire2716800013519952338tmp
/x1/jenkins/jenkins-slave/workspace/HBase-TRUNK/trunk/target/surefire/surefire_796432982485651429tmp
Running org.apache.hadoop.hbase.rest.TestMultiRowResource
Tests run: 3, Failures: 0, Errors: 0, Skipped: 0, Time elapsed: 13.881 sec
Forking command line: /bin/sh -c cd /x1/jenkins/jenkins-slave/workspace/HBase-TRUNK/trunk
&& /x1/jenkins/tools/java/jdk1.6.0_27-32/jre/bin/java -enableassertions -Xmx1900m
-Djava.security.egd=file:/dev/./urandom -jar /x1/jenkins/jenkins-slave/workspace/HBase-TRUNK/trunk/target/surefire/surefirebooter4989091074494402974.jar
/x1/jenkins/jenkins-slave/workspace/HBase-TRUNK/trunk/target/surefire/surefire5453267820740453376tmp
/x1/jenkins/jenkins-slave/workspace/HBase-TRUNK/trunk/target/surefire/surefire_804997463309201067363tmp
Running org.apache.hadoop.hbase.rest.TestTableResource
Tests run: 8, Failures: 0, Errors: 0, Skipped: 0, Time elapsed: 20.903 sec
Forking command line: /bin/sh -c cd /x1/jenkins/jenkins-slave/workspace/HBase-TRUNK/trunk
&& /x1/jenkins/tools/java/jdk1.6.0_27-32/jre/bin/java -enableassertions -Xmx1900m
-Djava.security.egd=file:/dev/./urandom -jar /x1/jenkins/jenkins-slave/workspace/HBase-TRUNK/trunk/target/surefire/surefirebooter5476001679901138077.jar
/x1/jenkins/jenkins-slave/workspace/HBase-TRUNK/trunk/target/surefire/surefire7045930494389639393tmp
/x1/jenkins/jenkins-slave/workspace/HBase-TRUNK/trunk/target/surefire/surefire_813582550549865323077tmp
Running org.apache.hadoop.hbase.rest.TestGzipFilter
Tests run: 3, Failures: 0, Errors: 0, Skipped: 0, Time elapsed: 14.167 sec
Forking command line: /bin/sh -c cd /x1/jenkins/jenkins-slave/workspace/HBase-TRUNK/trunk
&& /x1/jenkins/tools/java/jdk1.6.0_27-32/jre/bin/java -enableassertions -Xmx1900m
-Djava.security.egd=file:/dev/./urandom -jar /x1/jenkins/jenkins-slave/workspace/HBase-TRUNK/trunk/target/surefire/surefirebooter1978288019206754479.jar
/x1/jenkins/jenkins-slave/workspace/HBase-TRUNK/trunk/target/surefire/surefire8889326102667360135tmp
/x1/jenkins/jenkins-slave/workspace/HBase-TRUNK/trunk/target/surefire/surefire_824024931782467993583tmp
Running org.apache.hadoop.hbase.rest.TestRowResource
Tests run: 11, Failures: 0, Errors: 0, Skipped: 0, Time elapsed: 15.105 sec
Forking command line: /bin/sh -c cd /x1/jenkins/jenkins-slave/workspace/HBase-TRUNK/trunk
&& /x1/jenkins/tools/java/jdk1.6.0_27-32/jre/bin/java -enableassertions -Xmx1900m
-Djava.security.egd=file:/dev/./urandom -jar /x1/jenkins/jenkins-slave/workspace/HBase-TRUNK/trunk/target/surefire/surefirebooter8112003123437296013.jar
/x1/jenkins/jenkins-slave/workspace/HBase-TRUNK/trunk/target/surefire/surefire1729676686515839432tmp
/x1/jenkins/jenkins-slave/workspace/HBase-TRUNK/trunk/target/surefire/surefire_834413417978724653939tmp
Running org.apache.hadoop.hbase.rest.TestVersionResource
Tests run: 7, Failures: 0, Errors: 0, Skipped: 0, Time elapsed: 10.853 sec
Forking command line: /bin/sh -c cd /x1/jenkins/jenkins-slave/workspace/HBase-TRUNK/trunk
&& /x1/jenkins/tools/java/jdk1.6.0_27-32/jre/bin/java -enableassertions -Xmx1900m
-Djava.security.egd=file:/dev/./urandom -jar /x1/jenkins/jenkins-slave/workspace/HBase-TRUNK/trunk/target/surefire/surefirebooter1050872663602068605.jar
/x1/jenkins/jenkins-slave/workspace/HBase-TRUNK/trunk/target/surefire/surefire7973644661870618248tmp
/x1/jenkins/jenkins-slave/workspace/HBase-TRUNK/trunk/target/surefire/surefire_844551883894220169895tmp
Running org.apache.hadoop.hbase.rest.TestScannerResource
Tests run: 5, Failures: 0, Errors: 0, Skipped: 0, Time elapsed: 30.476 sec
Running org.apache.hadoop.hbase.rest.TestStatusResource
Tests run: 2, Failures: 0, Errors: 0, Skipped: 0, Time elapsed: 10.998 sec
Forking command line: /bin/sh -c cd /x1/jenkins/jenkins-slave/workspace/HBase-TRUNK/trunk
&& /x1/jenkins/tools/java/jdk1.6.0_27-32/jre/bin/java -enableassertions -Xmx1900m
-Djava.security.egd=file:/dev/./urandom -jar /x1/jenkins/jenkins-slave/workspace/HBase-TRUNK/trunk/target/surefire/surefirebooter3771675483987725454.jar
/x1/jenkins/jenkins-slave/workspace/HBase-TRUNK/trunk/target/surefire/surefire7379129054601168981tmp
/x1/jenkins/jenkins-slave/workspace/HBase-TRUNK/trunk/target/surefire/surefire_856118647581254539196tmp
Forking command line: /bin/sh -c cd /x1/jenkins/jenkins-slave/workspace/HBase-TRUNK/trunk
&& /x1/jenkins/tools/java/jdk1.6.0_27-32/jre/bin/java -enableassertions -Xmx1900m
-Djava.security.egd=file:/dev/./urandom -jar /x1/jenkins/jenkins-slave/workspace/HBase-TRUNK/trunk/target/surefire/surefirebooter443082514664507470.jar
/x1/jenkins/jenkins-slave/workspace/HBase-TRUNK/trunk/target/surefire/surefire8721201805899891452tmp
/x1/jenkins/jenkins-slave/workspace/HBase-TRUNK/trunk/target/surefire/surefire_863624910305544531952tmp
Running org.apache.hadoop.hbase.metrics.TestMetricsMBeanBase
Tests run: 2, Failures: 0, Errors: 0, Skipped: 0, Time elapsed: 1.087 sec
Forking command line: /bin/sh -c cd /x1/jenkins/jenkins-slave/workspace/HBase-TRUNK/trunk
&& /x1/jenkins/tools/java/jdk1.6.0_27-32/jre/bin/java -enableassertions -Xmx1900m
-Djava.security.egd=file:/dev/./urandom -jar /x1/jenkins/jenkins-slave/workspace/HBase-TRUNK/trunk/target/surefire/surefirebooter8989582848620823798.jar
/x1/jenkins/jenkins-slave/workspace/HBase-TRUNK/trunk/target/surefire/surefire6267138853690701544tmp
/x1/jenkins/jenkins-slave/workspace/HBase-TRUNK/trunk/target/surefire/surefire_873371130366638511222tmp
Running org.apache.hadoop.hbase.io.hfile.TestHFileBlockIndex
Tests run: 10, Failures: 0, Errors: 0, Skipped: 0, Time elapsed: 6.904 sec
Forking command line: /bin/sh -c cd /x1/jenkins/jenkins-slave/workspace/HBase-TRUNK/trunk
&& /x1/jenkins/tools/java/jdk1.6.0_27-32/jre/bin/java -enableassertions -Xmx1900m
-Djava.security.egd=file:/dev/./urandom -jar /x1/jenkins/jenkins-slave/workspace/HBase-TRUNK/trunk/target/surefire/surefirebooter883479180138992723.jar
/x1/jenkins/jenkins-slave/workspace/HBase-TRUNK/trunk/target/surefire/surefire1277726974801506422tmp
/x1/jenkins/jenkins-slave/workspace/HBase-TRUNK/trunk/target/surefire/surefire_888581236100060640612tmp
Running org.apache.hadoop.hbase.io.hfile.TestHFileSeek
Tests run: 1, Failures: 0, Errors: 0, Skipped: 0, Time elapsed: 6.539 sec
Forking command line: /bin/sh -c cd /x1/jenkins/jenkins-slave/workspace/HBase-TRUNK/trunk
&& /x1/jenkins/tools/java/jdk1.6.0_27-32/jre/bin/java -enableassertions -Xmx1900m
-Djava.security.egd=file:/dev/./urandom -jar /x1/jenkins/jenkins-slave/workspace/HBase-TRUNK/trunk/target/surefire/surefirebooter4695888924389200951.jar
/x1/jenkins/jenkins-slave/workspace/HBase-TRUNK/trunk/target/surefire/surefire2451079553933379994tmp
/x1/jenkins/jenkins-slave/workspace/HBase-TRUNK/trunk/target/surefire/surefire_899147908847135868369tmp
Running org.apache.hadoop.hbase.rest.TestScannersWithFilters
Tests run: 10, Failures: 0, Errors: 0, Skipped: 0, Time elapsed: 16.043 sec
Forking command line: /bin/sh -c cd /x1/jenkins/jenkins-slave/workspace/HBase-TRUNK/trunk
&& /x1/jenkins/tools/java/jdk1.6.0_27-32/jre/bin/java -enableassertions -Xmx1900m
-Djava.security.egd=file:/dev/./urandom -jar /x1/jenkins/jenkins-slave/workspace/HBase-TRUNK/trunk/target/surefire/surefirebooter7461888912840851897.jar
/x1/jenkins/jenkins-slave/workspace/HBase-TRUNK/trunk/target/surefire/surefire2150303343555088933tmp
/x1/jenkins/jenkins-slave/workspace/HBase-TRUNK/trunk/target/surefire/surefire_906808261307035716949tmp
Running org.apache.hadoop.hbase.io.hfile.TestLruBlockCache
Tests run: 16, Failures: 0, Errors: 0, Skipped: 0, Time elapsed: 0.665 sec
Forking command line: /bin/sh -c cd /x1/jenkins/jenkins-slave/workspace/HBase-TRUNK/trunk
&& /x1/jenkins/tools/java/jdk1.6.0_27-32/jre/bin/java -enableassertions -Xmx1900m
-Djava.security.egd=file:/dev/./urandom -jar /x1/jenkins/jenkins-slave/workspace/HBase-TRUNK/trunk/target/surefire/surefirebooter8937493985445566712.jar
/x1/jenkins/jenkins-slave/workspace/HBase-TRUNK/trunk/target/surefire/surefire3330487602190184910tmp
/x1/jenkins/jenkins-slave/workspace/HBase-TRUNK/trunk/target/surefire/surefire_917153628555609331960tmp
Running org.apache.hadoop.hbase.io.hfile.TestFixedFileTrailer
Tests run: 2, Failures: 0, Errors: 0, Skipped: 0, Time elapsed: 0.492 sec
Forking command line: /bin/sh -c cd /x1/jenkins/jenkins-slave/workspace/HBase-TRUNK/trunk
&& /x1/jenkins/tools/java/jdk1.6.0_27-32/jre/bin/java -enableassertions -Xmx1900m
-Djava.security.egd=file:/dev/./urandom -jar /x1/jenkins/jenkins-slave/workspace/HBase-TRUNK/trunk/target/surefire/surefirebooter6928614331734650710.jar
/x1/jenkins/jenkins-slave/workspace/HBase-TRUNK/trunk/target/surefire/surefire6150616609278585520tmp
/x1/jenkins/jenkins-slave/workspace/HBase-TRUNK/trunk/target/surefire/surefire_921373015761340118161tmp
Running org.apache.hadoop.hbase.io.hfile.TestHFilePerformance
Tests run: 1, Failures: 0, Errors: 0, Skipped: 0, Time elapsed: 4.784 sec
Forking command line: /bin/sh -c cd /x1/jenkins/jenkins-slave/workspace/HBase-TRUNK/trunk
&& /x1/jenkins/tools/java/jdk1.6.0_27-32/jre/bin/java -enableassertions -Xmx1900m
-Djava.security.egd=file:/dev/./urandom -jar /x1/jenkins/jenkins-slave/workspace/HBase-TRUNK/trunk/target/surefire/surefirebooter1435757462485458365.jar
/x1/jenkins/jenkins-slave/workspace/HBase-TRUNK/trunk/target/surefire/surefire3144722953024981381tmp
/x1/jenkins/jenkins-slave/workspace/HBase-TRUNK/trunk/target/surefire/surefire_938484884290115424471tmp
Running org.apache.hadoop.hbase.io.hfile.TestHFileBlockCompatibility
Tests run: 10, Failures: 0, Errors: 0, Skipped: 0, Time elapsed: 0.899 sec
Forking command line: /bin/sh -c cd /x1/jenkins/jenkins-slave/workspace/HBase-TRUNK/trunk
&& /x1/jenkins/tools/java/jdk1.6.0_27-32/jre/bin/java -enableassertions -Xmx1900m
-Djava.security.egd=file:/dev/./urandom -jar /x1/jenkins/jenkins-slave/workspace/HBase-TRUNK/trunk/target/surefire/surefirebooter7945538444897483320.jar
/x1/jenkins/jenkins-slave/workspace/HBase-TRUNK/trunk/target/surefire/surefire3803875845325806620tmp
/x1/jenkins/jenkins-slave/workspace/HBase-TRUNK/trunk/target/surefire/surefire_942324555797192435243tmp
Running org.apache.hadoop.hbase.io.hfile.TestCacheOnWrite
Tests run: 36, Failures: 0, Errors: 0, Skipped: 0, Time elapsed: 24.249 sec
Forking command line: /bin/sh -c cd /x1/jenkins/jenkins-slave/workspace/HBase-TRUNK/trunk
&& /x1/jenkins/tools/java/jdk1.6.0_27-32/jre/bin/java -enableassertions -Xmx1900m
-Djava.security.egd=file:/dev/./urandom -jar /x1/jenkins/jenkins-slave/workspace/HBase-TRUNK/trunk/target/surefire/surefirebooter3829570269795756201.jar
/x1/jenkins/jenkins-slave/workspace/HBase-TRUNK/trunk/target/surefire/surefire1480457547665427306tmp
/x1/jenkins/jenkins-slave/workspace/HBase-TRUNK/trunk/target/surefire/surefire_957081556502604034323tmp
Running org.apache.hadoop.hbase.io.hfile.TestChecksum
Tests run: 3, Failures: 0, Errors: 0, Skipped: 0, Time elapsed: 0.792 sec
Forking command line: /bin/sh -c cd /x1/jenkins/jenkins-slave/workspace/HBase-TRUNK/trunk
&& /x1/jenkins/tools/java/jdk1.6.0_27-32/jre/bin/java -enableassertions -Xmx1900m
-Djava.security.egd=file:/dev/./urandom -jar /x1/jenkins/jenkins-slave/workspace/HBase-TRUNK/trunk/target/surefire/surefirebooter2726715535095454857.jar
/x1/jenkins/jenkins-slave/workspace/HBase-TRUNK/trunk/target/surefire/surefire886642487816761476tmp
/x1/jenkins/jenkins-slave/workspace/HBase-TRUNK/trunk/target/surefire/surefire_9684787764480472221tmp
Running org.apache.hadoop.hbase.io.hfile.TestForceCacheImportantBlocks
Tests run: 4, Failures: 0, Errors: 0, Skipped: 0, Time elapsed: 35.38 sec
Forking command line: /bin/sh -c cd /x1/jenkins/jenkins-slave/workspace/HBase-TRUNK/trunk
&& /x1/jenkins/tools/java/jdk1.6.0_27-32/jre/bin/java -enableassertions -Xmx1900m
-Djava.security.egd=file:/dev/./urandom -jar /x1/jenkins/jenkins-slave/workspace/HBase-TRUNK/trunk/target/surefire/surefirebooter9202367439691422588.jar
/x1/jenkins/jenkins-slave/workspace/HBase-TRUNK/trunk/target/surefire/surefire1349623800074339966tmp
/x1/jenkins/jenkins-slave/workspace/HBase-TRUNK/trunk/target/surefire/surefire_977538274940352341138tmp
Running org.apache.hadoop.hbase.io.hfile.slab.TestSlabCache
Tests run: 7, Failures: 0, Errors: 0, Skipped: 0, Time elapsed: 8.813 sec
Forking command line: /bin/sh -c cd /x1/jenkins/jenkins-slave/workspace/HBase-TRUNK/trunk
&& /x1/jenkins/tools/java/jdk1.6.0_27-32/jre/bin/java -enableassertions -Xmx1900m
-Djava.security.egd=file:/dev/./urandom -jar /x1/jenkins/jenkins-slave/workspace/HBase-TRUNK/trunk/target/surefire/surefirebooter5931106919740324190.jar
/x1/jenkins/jenkins-slave/workspace/HBase-TRUNK/trunk/target/surefire/surefire9030871246331141997tmp
/x1/jenkins/jenkins-slave/workspace/HBase-TRUNK/trunk/target/surefire/surefire_984508409057397633232tmp
Running org.apache.hadoop.hbase.io.hfile.slab.TestSingleSizeCache
Tests run: 5, Failures: 0, Errors: 0, Skipped: 0, Time elapsed: 14.124 sec
Forking command line: /bin/sh -c cd /x1/jenkins/jenkins-slave/workspace/HBase-TRUNK/trunk
&& /x1/jenkins/tools/java/jdk1.6.0_27-32/jre/bin/java -enableassertions -Xmx1900m
-Djava.security.egd=file:/dev/./urandom -jar /x1/jenkins/jenkins-slave/workspace/HBase-TRUNK/trunk/target/surefire/surefirebooter1043562935111485812.jar
/x1/jenkins/jenkins-slave/workspace/HBase-TRUNK/trunk/target/surefire/surefire3737303836427013783tmp
/x1/jenkins/jenkins-slave/workspace/HBase-TRUNK/trunk/target/surefire/surefire_997131641847164363503tmp
Running org.apache.hadoop.hbase.io.hfile.TestHFileBlock
Tests run: 16, Failures: 0, Errors: 0, Skipped: 0, Time elapsed: 45.813 sec
Forking command line: /bin/sh -c cd /x1/jenkins/jenkins-slave/workspace/HBase-TRUNK/trunk
&& /x1/jenkins/tools/java/jdk1.6.0_27-32/jre/bin/java -enableassertions -Xmx1900m
-Djava.security.egd=file:/dev/./urandom -jar /x1/jenkins/jenkins-slave/workspace/HBase-TRUNK/trunk/target/surefire/surefirebooter6341974359021239878.jar
/x1/jenkins/jenkins-slave/workspace/HBase-TRUNK/trunk/target/surefire/surefire7303559182144698819tmp
/x1/jenkins/jenkins-slave/workspace/HBase-TRUNK/trunk/target/surefire/surefire_1008348690285847253874tmp
Running org.apache.hadoop.hbase.replication.TestReplicationZookeeper
Tests run: 1, Failures: 0, Errors: 0, Skipped: 0, Time elapsed: 0.539 sec
Forking command line: /bin/sh -c cd /x1/jenkins/jenkins-slave/workspace/HBase-TRUNK/trunk
&& /x1/jenkins/tools/java/jdk1.6.0_27-32/jre/bin/java -enableassertions -Xmx1900m
-Djava.security.egd=file:/dev/./urandom -jar /x1/jenkins/jenkins-slave/workspace/HBase-TRUNK/trunk/target/surefire/surefirebooter2476128769456997153.jar
/x1/jenkins/jenkins-slave/workspace/HBase-TRUNK/trunk/target/surefire/surefire8420818828421898976tmp
/x1/jenkins/jenkins-slave/workspace/HBase-TRUNK/trunk/target/surefire/surefire_1018529789849322154630tmp
Running org.apache.hadoop.hbase.io.encoding.TestLoadAndSwitchEncodeOnDisk
Tests run: 1, Failures: 0, Errors: 0, Skipped: 0, Time elapsed: 23.712 sec
Forking command line: /bin/sh -c cd /x1/jenkins/jenkins-slave/workspace/HBase-TRUNK/trunk
&& /x1/jenkins/tools/java/jdk1.6.0_27-32/jre/bin/java -enableassertions -Xmx1900m
-Djava.security.egd=file:/dev/./urandom -jar /x1/jenkins/jenkins-slave/workspace/HBase-TRUNK/trunk/target/surefire/surefirebooter4705893397566048898.jar
/x1/jenkins/jenkins-slave/workspace/HBase-TRUNK/trunk/target/surefire/surefire1186061954230651944tmp
/x1/jenkins/jenkins-slave/workspace/HBase-TRUNK/trunk/target/surefire/surefire_1028565847162998146919tmp
Running org.apache.hadoop.hbase.replication.regionserver.TestReplicationSourceManager
Tests run: 1, Failures: 0, Errors: 0, Skipped: 0, Time elapsed: 1.037 sec
Forking command line: /bin/sh -c cd /x1/jenkins/jenkins-slave/workspace/HBase-TRUNK/trunk
&& /x1/jenkins/tools/java/jdk1.6.0_27-32/jre/bin/java -enableassertions -Xmx1900m
-Djava.security.egd=file:/dev/./urandom -jar /x1/jenkins/jenkins-slave/workspace/HBase-TRUNK/trunk/target/surefire/surefirebooter8034931425728357046.jar
/x1/jenkins/jenkins-slave/workspace/HBase-TRUNK/trunk/target/surefire/surefire6733294518506328803tmp
/x1/jenkins/jenkins-slave/workspace/HBase-TRUNK/trunk/target/surefire/surefire_103251153604378552625tmp
Running org.apache.hadoop.hbase.replication.TestReplicationSource
Tests run: 1, Failures: 0, Errors: 0, Skipped: 0, Time elapsed: 1.84 sec
Forking command line: /bin/sh -c cd /x1/jenkins/jenkins-slave/workspace/HBase-TRUNK/trunk
&& /x1/jenkins/tools/java/jdk1.6.0_27-32/jre/bin/java -enableassertions -Xmx1900m
-Djava.security.egd=file:/dev/./urandom -jar /x1/jenkins/jenkins-slave/workspace/HBase-TRUNK/trunk/target/surefire/surefirebooter1125002058304203021.jar
/x1/jenkins/jenkins-slave/workspace/HBase-TRUNK/trunk/target/surefire/surefire5229242372122824115tmp
/x1/jenkins/jenkins-slave/workspace/HBase-TRUNK/trunk/target/surefire/surefire_1043949579555601091855tmp
Running org.apache.hadoop.hbase.replication.TestReplicationPeer
Tests run: 1, Failures: 0, Errors: 0, Skipped: 0, Time elapsed: 1.493 sec
Forking command line: /bin/sh -c cd /x1/jenkins/jenkins-slave/workspace/HBase-TRUNK/trunk
&& /x1/jenkins/tools/java/jdk1.6.0_27-32/jre/bin/java -enableassertions -Xmx1900m
-Djava.security.egd=file:/dev/./urandom -jar /x1/jenkins/jenkins-slave/workspace/HBase-TRUNK/trunk/target/surefire/surefirebooter8515473654157304457.jar
/x1/jenkins/jenkins-slave/workspace/HBase-TRUNK/trunk/target/surefire/surefire4344385847479128099tmp
/x1/jenkins/jenkins-slave/workspace/HBase-TRUNK/trunk/target/surefire/surefire_1053846755554858402042tmp
Running org.apache.hadoop.hbase.util.TestFSTableDescriptors
Tests run: 10, Failures: 0, Errors: 0, Skipped: 0, Time elapsed: 0.871 sec
Forking command line: /bin/sh -c cd /x1/jenkins/jenkins-slave/workspace/HBase-TRUNK/trunk
&& /x1/jenkins/tools/java/jdk1.6.0_27-32/jre/bin/java -enableassertions -Xmx1900m
-Djava.security.egd=file:/dev/./urandom -jar /x1/jenkins/jenkins-slave/workspace/HBase-TRUNK/trunk/target/surefire/surefirebooter7426475147179912120.jar
/x1/jenkins/jenkins-slave/workspace/HBase-TRUNK/trunk/target/surefire/surefire188847798549200880tmp
/x1/jenkins/jenkins-slave/workspace/HBase-TRUNK/trunk/target/surefire/surefire_1064147568573130523242tmp
Running org.apache.hadoop.hbase.util.TestIdLock
Tests run: 1, Failures: 0, Errors: 0, Skipped: 0, Time elapsed: 15.281 sec
Forking command line: /bin/sh -c cd /x1/jenkins/jenkins-slave/workspace/HBase-TRUNK/trunk
&& /x1/jenkins/tools/java/jdk1.6.0_27-32/jre/bin/java -enableassertions -Xmx1900m
-Djava.security.egd=file:/dev/./urandom -jar /x1/jenkins/jenkins-slave/workspace/HBase-TRUNK/trunk/target/surefire/surefirebooter654684317668448549.jar
/x1/jenkins/jenkins-slave/workspace/HBase-TRUNK/trunk/target/surefire/surefire2251542289532774814tmp
/x1/jenkins/jenkins-slave/workspace/HBase-TRUNK/trunk/target/surefire/surefire_1078266943289116439305tmp
Running org.apache.hadoop.hbase.util.TestEnvironmentEdgeManager
Tests run: 2, Failures: 0, Errors: 0, Skipped: 0, Time elapsed: 0.312 sec
Forking command line: /bin/sh -c cd /x1/jenkins/jenkins-slave/workspace/HBase-TRUNK/trunk
&& /x1/jenkins/tools/java/jdk1.6.0_27-32/jre/bin/java -enableassertions -Xmx1900m
-Djava.security.egd=file:/dev/./urandom -jar /x1/jenkins/jenkins-slave/workspace/HBase-TRUNK/trunk/target/surefire/surefirebooter2049530506083316098.jar
/x1/jenkins/jenkins-slave/workspace/HBase-TRUNK/trunk/target/surefire/surefire8954237619887095559tmp
/x1/jenkins/jenkins-slave/workspace/HBase-TRUNK/trunk/target/surefire/surefire_1084167623606713754583tmp
Running org.apache.hadoop.hbase.replication.regionserver.TestReplicationSink
Tests run: 5, Failures: 0, Errors: 0, Skipped: 0, Time elapsed: 28.533 sec
Forking command line: /bin/sh -c cd /x1/jenkins/jenkins-slave/workspace/HBase-TRUNK/trunk
&& /x1/jenkins/tools/java/jdk1.6.0_27-32/jre/bin/java -enableassertions -Xmx1900m
-Djava.security.egd=file:/dev/./urandom -jar /x1/jenkins/jenkins-slave/workspace/HBase-TRUNK/trunk/target/surefire/surefirebooter8753790108917665900.jar
/x1/jenkins/jenkins-slave/workspace/HBase-TRUNK/trunk/target/surefire/surefire2121265957286539503tmp
/x1/jenkins/jenkins-slave/workspace/HBase-TRUNK/trunk/target/surefire/surefire_1092896034028647792909tmp
Running org.apache.hadoop.hbase.util.TestMergeTable
Tests run: 1, Failures: 0, Errors: 0, Skipped: 0, Time elapsed: 24.918 sec
Forking command line: /bin/sh -c cd /x1/jenkins/jenkins-slave/workspace/HBase-TRUNK/trunk
&& /x1/jenkins/tools/java/jdk1.6.0_27-32/jre/bin/java -enableassertions -Xmx1900m
-Djava.security.egd=file:/dev/./urandom -jar /x1/jenkins/jenkins-slave/workspace/HBase-TRUNK/trunk/target/surefire/surefirebooter8103532351903144676.jar
/x1/jenkins/jenkins-slave/workspace/HBase-TRUNK/trunk/target/surefire/surefire6630713349694282450tmp
/x1/jenkins/jenkins-slave/workspace/HBase-TRUNK/trunk/target/surefire/surefire_1102168927430053845677tmp
Running org.apache.hadoop.hbase.util.TestFSUtils
Tests run: 3, Failures: 0, Errors: 0, Skipped: 0, Time elapsed: 20.299 sec
Forking command line: /bin/sh -c cd /x1/jenkins/jenkins-slave/workspace/HBase-TRUNK/trunk
&& /x1/jenkins/tools/java/jdk1.6.0_27-32/jre/bin/java -enableassertions -Xmx1900m
-Djava.security.egd=file:/dev/./urandom -jar /x1/jenkins/jenkins-slave/workspace/HBase-TRUNK/trunk/target/surefire/surefirebooter7185971272215089578.jar
/x1/jenkins/jenkins-slave/workspace/HBase-TRUNK/trunk/target/surefire/surefire3462881842572895751tmp
/x1/jenkins/jenkins-slave/workspace/HBase-TRUNK/trunk/target/surefire/surefire_1112403303016190835635tmp
Running org.apache.hadoop.hbase.util.TestPoolMap$TestRoundRobinPoolType
Tests run: 3, Failures: 0, Errors: 0, Skipped: 0, Time elapsed: 0.007 sec
Running org.apache.hadoop.hbase.util.TestPoolMap$TestThreadLocalPoolType
Tests run: 3, Failures: 0, Errors: 0, Skipped: 0, Time elapsed: 0.003 sec
Running org.apache.hadoop.hbase.util.TestPoolMap$TestReusablePoolType
Tests run: 3, Failures: 0, Errors: 0, Skipped: 0, Time elapsed: 0.024 sec
Forking command line: /bin/sh -c cd /x1/jenkins/jenkins-slave/workspace/HBase-TRUNK/trunk
&& /x1/jenkins/tools/java/jdk1.6.0_27-32/jre/bin/java -enableassertions -Xmx1900m
-Djava.security.egd=file:/dev/./urandom -jar /x1/jenkins/jenkins-slave/workspace/HBase-TRUNK/trunk/target/surefire/surefirebooter2372474352826596032.jar
/x1/jenkins/jenkins-slave/workspace/HBase-TRUNK/trunk/target/surefire/surefire1554530914446147991tmp
/x1/jenkins/jenkins-slave/workspace/HBase-TRUNK/trunk/target/surefire/surefire_1126773661036198439043tmp
Running org.apache.hadoop.hbase.util.TestRegionSplitter
Tests run: 5, Failures: 0, Errors: 0, Skipped: 0, Time elapsed: 18.994 sec
Forking command line: /bin/sh -c cd /x1/jenkins/jenkins-slave/workspace/HBase-TRUNK/trunk
&& /x1/jenkins/tools/java/jdk1.6.0_27-32/jre/bin/java -enableassertions -Xmx1900m
-Djava.security.egd=file:/dev/./urandom -jar /x1/jenkins/jenkins-slave/workspace/HBase-TRUNK/trunk/target/surefire/surefirebooter5809796522336585888.jar
/x1/jenkins/jenkins-slave/workspace/HBase-TRUNK/trunk/target/surefire/surefire7393405708163638082tmp
/x1/jenkins/jenkins-slave/workspace/HBase-TRUNK/trunk/target/surefire/surefire_1132781161963455531224tmp
Running org.apache.hadoop.hbase.util.hbck.TestOfflineMetaRebuildBase
Tests run: 1, Failures: 0, Errors: 0, Skipped: 0, Time elapsed: 20.425 sec
Forking command line: /bin/sh -c cd /x1/jenkins/jenkins-slave/workspace/HBase-TRUNK/trunk
&& /x1/jenkins/tools/java/jdk1.6.0_27-32/jre/bin/java -enableassertions -Xmx1900m
-Djava.security.egd=file:/dev/./urandom -jar /x1/jenkins/jenkins-slave/workspace/HBase-TRUNK/trunk/target/surefire/surefirebooter2450895106627037031.jar
/x1/jenkins/jenkins-slave/workspace/HBase-TRUNK/trunk/target/surefire/surefire1664903076735484263tmp
/x1/jenkins/jenkins-slave/workspace/HBase-TRUNK/trunk/target/surefire/surefire_114832134226443508183tmp
Running org.apache.hadoop.hbase.util.hbck.TestOfflineMetaRebuildOverlap
Tests run: 1, Failures: 0, Errors: 0, Skipped: 0, Time elapsed: 17.297 sec
Forking command line: /bin/sh -c cd /x1/jenkins/jenkins-slave/workspace/HBase-TRUNK/trunk
&& /x1/jenkins/tools/java/jdk1.6.0_27-32/jre/bin/java -enableassertions -Xmx1900m
-Djava.security.egd=file:/dev/./urandom -jar /x1/jenkins/jenkins-slave/workspace/HBase-TRUNK/trunk/target/surefire/surefirebooter8413591778462289146.jar
/x1/jenkins/jenkins-slave/workspace/HBase-TRUNK/trunk/target/surefire/surefire319504312553165951tmp
/x1/jenkins/jenkins-slave/workspace/HBase-TRUNK/trunk/target/surefire/surefire_1153686905859499020322tmp
Running org.apache.hadoop.hbase.util.hbck.TestOfflineMetaRebuildHole
Tests run: 1, Failures: 0, Errors: 0, Skipped: 0, Time elapsed: 18.622 sec
Forking command line: /bin/sh -c cd /x1/jenkins/jenkins-slave/workspace/HBase-TRUNK/trunk
&& /x1/jenkins/tools/java/jdk1.6.0_27-32/jre/bin/java -enableassertions -Xmx1900m
-Djava.security.egd=file:/dev/./urandom -jar /x1/jenkins/jenkins-slave/workspace/HBase-TRUNK/trunk/target/surefire/surefirebooter499515589595492348.jar
/x1/jenkins/jenkins-slave/workspace/HBase-TRUNK/trunk/target/surefire/surefire5047219238904316330tmp
/x1/jenkins/jenkins-slave/workspace/HBase-TRUNK/trunk/target/surefire/surefire_1165750753112543695175tmp
Running org.apache.hadoop.hbase.util.TestDefaultEnvironmentEdge
Tests run: 1, Failures: 0, Errors: 0, Skipped: 0, Time elapsed: 0.296 sec
Forking command line: /bin/sh -c cd /x1/jenkins/jenkins-slave/workspace/HBase-TRUNK/trunk
&& /x1/jenkins/tools/java/jdk1.6.0_27-32/jre/bin/java -enableassertions -Xmx1900m
-Djava.security.egd=file:/dev/./urandom -jar /x1/jenkins/jenkins-slave/workspace/HBase-TRUNK/trunk/target/surefire/surefirebooter5315439168367899275.jar
/x1/jenkins/jenkins-slave/workspace/HBase-TRUNK/trunk/target/surefire/surefire6485345203797930327tmp
/x1/jenkins/jenkins-slave/workspace/HBase-TRUNK/trunk/target/surefire/surefire_1175720312789761660505tmp
Running org.apache.hadoop.hbase.TestInfoServers
Tests run: 2, Failures: 0, Errors: 0, Skipped: 0, Time elapsed: 10.234 sec

Results :

Tests run: 605, Failures: 0, Errors: 0, Skipped: 2

[INFO] ------------------------------------------------------------------------
[INFO] BUILD FAILURE
[INFO] ------------------------------------------------------------------------
[INFO] Total time: 38:23.757s
[INFO] Finished at: Sat Apr 14 03:29:12 UTC 2012
[INFO] Final Memory: 81M/992M
[INFO] ------------------------------------------------------------------------
[ERROR] Failed to execute goal org.apache.maven.plugins:maven-surefire-plugin:2.12-TRUNK-HBASE-2:test
(secondPartTestsExecution) on project hbase: Failure or timeout -> [Help 1]
org.apache.maven.lifecycle.LifecycleExecutionException: Failed to execute goal org.apache.maven.plugins:maven-surefire-plugin:2.12-TRUNK-HBASE-2:test
(secondPartTestsExecution) on project hbase: Failure or timeout
	at org.apache.maven.lifecycle.internal.MojoExecutor.execute(MojoExecutor.java:217)
	at org.apache.maven.lifecycle.internal.MojoExecutor.execute(MojoExecutor.java:153)
	at org.apache.maven.lifecycle.internal.MojoExecutor.execute(MojoExecutor.java:145)
	at org.apache.maven.lifecycle.internal.LifecycleModuleBuilder.buildProject(LifecycleModuleBuilder.java:84)
	at org.apache.maven.lifecycle.internal.LifecycleModuleBuilder.buildProject(LifecycleModuleBuilder.java:59)
	at org.apache.maven.lifecycle.internal.LifecycleStarter.singleThreadedBuild(LifecycleStarter.java:183)
	at org.apache.maven.lifecycle.internal.LifecycleStarter.execute(LifecycleStarter.java:161)
	at org.apache.maven.DefaultMaven.doExecute(DefaultMaven.java:319)
	at org.apache.maven.DefaultMaven.execute(DefaultMaven.java:156)
	at org.apache.maven.cli.MavenCli.execute(MavenCli.java:537)
	at org.apache.maven.cli.MavenCli.doMain(MavenCli.java:196)
	at org.apache.maven.cli.MavenCli.main(MavenCli.java:141)
	at sun.reflect.NativeMethodAccessorImpl.invoke0(Native Method)
	at sun.reflect.NativeMethodAccessorImpl.invoke(NativeMethodAccessorImpl.java:39)
	at sun.reflect.DelegatingMethodAccessorImpl.invoke(DelegatingMethodAccessorImpl.java:25)
	at java.lang.reflect.Method.invoke(Method.java:597)
	at org.codehaus.plexus.classworlds.launcher.Launcher.launchEnhanced(Launcher.java:290)
	at org.codehaus.plexus.classworlds.launcher.Launcher.launch(Launcher.java:230)
	at org.codehaus.plexus.classworlds.launcher.Launcher.mainWithExitCode(Launcher.java:409)
	at org.codehaus.plexus.classworlds.launcher.Launcher.main(Launcher.java:352)
Caused by: org.apache.maven.plugin.MojoExecutionException: Failure or timeout
	at org.apache.maven.plugin.surefire.SurefirePlugin.assertNoFailureOrTimeout(SurefirePlugin.java:643)
	at org.apache.maven.plugin.surefire.SurefirePlugin.handleSummary(SurefirePlugin.java:624)
	at org.apache.maven.plugin.surefire.AbstractSurefireMojo.executeAfterPreconditionsChecked(AbstractSurefireMojo.java:137)
	at org.apache.maven.plugin.surefire.AbstractSurefireMojo.execute(AbstractSurefireMojo.java:98)
	at org.apache.maven.plugin.DefaultBuildPluginManager.executeMojo(DefaultBuildPluginManager.java:101)
	at org.apache.maven.lifecycle.internal.MojoExecutor.execute(MojoExecutor.java:209)
	... 19 more
[ERROR] 
[ERROR] 
[ERROR] For more information about the errors and possible solutions, please read the following
articles:
[ERROR] [Help 1] http://cwiki.apache.org/confluence/display/MAVEN/MojoExecutionException
Build step 'Invoke top-level Maven targets' marked build as failure
Archiving artifacts
Recording test results

Mime
View raw message