hbase-dev mailing list archives

Site index · List index
Message view « Date » · « Thread »
Top « Date » · « Thread »
From Apache Jenkins Server <jenk...@builds.apache.org>
Subject Build failed in Jenkins: HBase-TRUNK #2741
Date Wed, 11 Apr 2012 05:35:17 GMT
See <https://builds.apache.org/job/HBase-TRUNK/2741/changes>

Changes:

[jmhsieh] HBASE-5653 [findbugs] Fix perf warnings (Uma Maheswara Rao G)

------------------------------------------
[...truncated 7389 lines...]
Tests run: 1, Failures: 0, Errors: 0, Skipped: 0, Time elapsed: 16.583 sec
Forking command line: /bin/sh -c cd <https://builds.apache.org/job/HBase-TRUNK/ws/trunk>
&& /home/jenkins/tools/java/jdk1.6.0_27-32/jre/bin/java -enableassertions -Xmx1900m
-Djava.security.egd=file:/dev/./urandom -jar <https://builds.apache.org/job/HBase-TRUNK/ws/trunk/target/surefire/surefirebooter5794917660923283697.jar>
<https://builds.apache.org/job/HBase-TRUNK/ws/trunk/target/surefire/surefire671067327410554213tmp>
<https://builds.apache.org/job/HBase-TRUNK/ws/trunk/target/surefire/surefire_566716181171720944342tmp>
Running org.apache.hadoop.hbase.coprocessor.TestClassLoading
Tests run: 6, Failures: 0, Errors: 0, Skipped: 0, Time elapsed: 32.174 sec
Forking command line: /bin/sh -c cd <https://builds.apache.org/job/HBase-TRUNK/ws/trunk>
&& /home/jenkins/tools/java/jdk1.6.0_27-32/jre/bin/java -enableassertions -Xmx1900m
-Djava.security.egd=file:/dev/./urandom -jar <https://builds.apache.org/job/HBase-TRUNK/ws/trunk/target/surefire/surefirebooter5463397634722024803.jar>
<https://builds.apache.org/job/HBase-TRUNK/ws/trunk/target/surefire/surefire2104360269517202130tmp>
<https://builds.apache.org/job/HBase-TRUNK/ws/trunk/target/surefire/surefire_579154280518742133521tmp>
Running org.apache.hadoop.hbase.coprocessor.TestAggregateProtocol
Tests run: 45, Failures: 0, Errors: 0, Skipped: 0, Time elapsed: 13.709 sec
Forking command line: /bin/sh -c cd <https://builds.apache.org/job/HBase-TRUNK/ws/trunk>
&& /home/jenkins/tools/java/jdk1.6.0_27-32/jre/bin/java -enableassertions -Xmx1900m
-Djava.security.egd=file:/dev/./urandom -jar <https://builds.apache.org/job/HBase-TRUNK/ws/trunk/target/surefire/surefirebooter8511951333431387903.jar>
<https://builds.apache.org/job/HBase-TRUNK/ws/trunk/target/surefire/surefire7442613496645584112tmp>
<https://builds.apache.org/job/HBase-TRUNK/ws/trunk/target/surefire/surefire_58969699971688795575tmp>
Running org.apache.hadoop.hbase.coprocessor.TestRegionServerCoprocessorExceptionWithRemove
Tests run: 1, Failures: 0, Errors: 0, Skipped: 0, Time elapsed: 17.818 sec
Forking command line: /bin/sh -c cd <https://builds.apache.org/job/HBase-TRUNK/ws/trunk>
&& /home/jenkins/tools/java/jdk1.6.0_27-32/jre/bin/java -enableassertions -Xmx1900m
-Djava.security.egd=file:/dev/./urandom -jar <https://builds.apache.org/job/HBase-TRUNK/ws/trunk/target/surefire/surefirebooter3085062682707862483.jar>
<https://builds.apache.org/job/HBase-TRUNK/ws/trunk/target/surefire/surefire5734777130135075429tmp>
<https://builds.apache.org/job/HBase-TRUNK/ws/trunk/target/surefire/surefire_591123773706388628934tmp>
Running org.apache.hadoop.hbase.coprocessor.TestRegionServerCoprocessorExceptionWithAbort
Tests run: 1, Failures: 0, Errors: 0, Skipped: 0, Time elapsed: 13.725 sec
Forking command line: /bin/sh -c cd <https://builds.apache.org/job/HBase-TRUNK/ws/trunk>
&& /home/jenkins/tools/java/jdk1.6.0_27-32/jre/bin/java -enableassertions -Xmx1900m
-Djava.security.egd=file:/dev/./urandom -jar <https://builds.apache.org/job/HBase-TRUNK/ws/trunk/target/surefire/surefirebooter7100250430354930560.jar>
<https://builds.apache.org/job/HBase-TRUNK/ws/trunk/target/surefire/surefire1238133412104205204tmp>
<https://builds.apache.org/job/HBase-TRUNK/ws/trunk/target/surefire/surefire_60870112540654487619tmp>
Running org.apache.hadoop.hbase.coprocessor.TestMasterObserver
Tests run: 3, Failures: 0, Errors: 0, Skipped: 0, Time elapsed: 27.724 sec
Forking command line: /bin/sh -c cd <https://builds.apache.org/job/HBase-TRUNK/ws/trunk>
&& /home/jenkins/tools/java/jdk1.6.0_27-32/jre/bin/java -enableassertions -Xmx1900m
-Djava.security.egd=file:/dev/./urandom -jar <https://builds.apache.org/job/HBase-TRUNK/ws/trunk/target/surefire/surefirebooter997276880245218900.jar>
<https://builds.apache.org/job/HBase-TRUNK/ws/trunk/target/surefire/surefire1201747478894040921tmp>
<https://builds.apache.org/job/HBase-TRUNK/ws/trunk/target/surefire/surefire_617640110638745167615tmp>
Running org.apache.hadoop.hbase.coprocessor.TestCoprocessorEndpoint
Tests run: 3, Failures: 0, Errors: 0, Skipped: 1, Time elapsed: 28.629 sec
Forking command line: /bin/sh -c cd <https://builds.apache.org/job/HBase-TRUNK/ws/trunk>
&& /home/jenkins/tools/java/jdk1.6.0_27-32/jre/bin/java -enableassertions -Xmx1900m
-Djava.security.egd=file:/dev/./urandom -jar <https://builds.apache.org/job/HBase-TRUNK/ws/trunk/target/surefire/surefirebooter7908637135190228823.jar>
<https://builds.apache.org/job/HBase-TRUNK/ws/trunk/target/surefire/surefire2779700145414149849tmp>
<https://builds.apache.org/job/HBase-TRUNK/ws/trunk/target/surefire/surefire_62457900376910829108tmp>
Forking command line: /bin/sh -c cd <https://builds.apache.org/job/HBase-TRUNK/ws/trunk>
&& /home/jenkins/tools/java/jdk1.6.0_27-32/jre/bin/java -enableassertions -Xmx1900m
-Djava.security.egd=file:/dev/./urandom -jar <https://builds.apache.org/job/HBase-TRUNK/ws/trunk/target/surefire/surefirebooter4204204494813662492.jar>
<https://builds.apache.org/job/HBase-TRUNK/ws/trunk/target/surefire/surefire6200342895397375476tmp>
<https://builds.apache.org/job/HBase-TRUNK/ws/trunk/target/surefire/surefire_639036756587357159430tmp>
Running org.apache.hadoop.hbase.coprocessor.TestWALObserver
Tests run: 3, Failures: 0, Errors: 0, Skipped: 0, Time elapsed: 16.67 sec
Forking command line: /bin/sh -c cd <https://builds.apache.org/job/HBase-TRUNK/ws/trunk>
&& /home/jenkins/tools/java/jdk1.6.0_27-32/jre/bin/java -enableassertions -Xmx1900m
-Djava.security.egd=file:/dev/./urandom -jar <https://builds.apache.org/job/HBase-TRUNK/ws/trunk/target/surefire/surefirebooter2378743172702488996.jar>
<https://builds.apache.org/job/HBase-TRUNK/ws/trunk/target/surefire/surefire1386976450289505138tmp>
<https://builds.apache.org/job/HBase-TRUNK/ws/trunk/target/surefire/surefire_644155778087622875412tmp>
Running org.apache.hadoop.hbase.coprocessor.TestMasterCoprocessorExceptionWithAbort
Tests run: 1, Failures: 0, Errors: 0, Skipped: 0, Time elapsed: 25.57 sec
Forking command line: /bin/sh -c cd <https://builds.apache.org/job/HBase-TRUNK/ws/trunk>
&& /home/jenkins/tools/java/jdk1.6.0_27-32/jre/bin/java -enableassertions -Xmx1900m
-Djava.security.egd=file:/dev/./urandom -jar <https://builds.apache.org/job/HBase-TRUNK/ws/trunk/target/surefire/surefirebooter8341490765627019586.jar>
<https://builds.apache.org/job/HBase-TRUNK/ws/trunk/target/surefire/surefire5173029260159679501tmp>
<https://builds.apache.org/job/HBase-TRUNK/ws/trunk/target/surefire/surefire_656065876912378139143tmp>
Running org.apache.hadoop.hbase.coprocessor.TestMasterCoprocessorExceptionWithRemove
Tests run: 1, Failures: 0, Errors: 0, Skipped: 0, Time elapsed: 16.11 sec
Forking command line: /bin/sh -c cd <https://builds.apache.org/job/HBase-TRUNK/ws/trunk>
&& /home/jenkins/tools/java/jdk1.6.0_27-32/jre/bin/java -enableassertions -Xmx1900m
-Djava.security.egd=file:/dev/./urandom -jar <https://builds.apache.org/job/HBase-TRUNK/ws/trunk/target/surefire/surefirebooter4418310329503747912.jar>
<https://builds.apache.org/job/HBase-TRUNK/ws/trunk/target/surefire/surefire7863078186351060123tmp>
<https://builds.apache.org/job/HBase-TRUNK/ws/trunk/target/surefire/surefire_667164086600096415193tmp>
Running org.apache.hadoop.hbase.coprocessor.TestRegionObserverInterface
Tests run: 6, Failures: 0, Errors: 0, Skipped: 0, Time elapsed: 33.638 sec
Running org.apache.hadoop.hbase.coprocessor.TestRegionObserverBypass
Forking command line: /bin/sh -c cd <https://builds.apache.org/job/HBase-TRUNK/ws/trunk>
&& /home/jenkins/tools/java/jdk1.6.0_27-32/jre/bin/java -enableassertions -Xmx1900m
-Djava.security.egd=file:/dev/./urandom -jar <https://builds.apache.org/job/HBase-TRUNK/ws/trunk/target/surefire/surefirebooter1661622279332203910.jar>
<https://builds.apache.org/job/HBase-TRUNK/ws/trunk/target/surefire/surefire6179850002705897066tmp>
<https://builds.apache.org/job/HBase-TRUNK/ws/trunk/target/surefire/surefire_671037088491863975972tmp>
Tests run: 2, Failures: 0, Errors: 0, Skipped: 0, Time elapsed: 14.192 sec
Forking command line: /bin/sh -c cd <https://builds.apache.org/job/HBase-TRUNK/ws/trunk>
&& /home/jenkins/tools/java/jdk1.6.0_27-32/jre/bin/java -enableassertions -Xmx1900m
-Djava.security.egd=file:/dev/./urandom -jar <https://builds.apache.org/job/HBase-TRUNK/ws/trunk/target/surefire/surefirebooter8442685241614262716.jar>
<https://builds.apache.org/job/HBase-TRUNK/ws/trunk/target/surefire/surefire1360648521527436155tmp>
<https://builds.apache.org/job/HBase-TRUNK/ws/trunk/target/surefire/surefire_685836527445604509405tmp>
Running org.apache.hadoop.hbase.TestGlobalMemStoreSize
Tests run: 1, Failures: 0, Errors: 0, Skipped: 0, Time elapsed: 16.137 sec
Forking command line: /bin/sh -c cd <https://builds.apache.org/job/HBase-TRUNK/ws/trunk>
&& /home/jenkins/tools/java/jdk1.6.0_27-32/jre/bin/java -enableassertions -Xmx1900m
-Djava.security.egd=file:/dev/./urandom -jar <https://builds.apache.org/job/HBase-TRUNK/ws/trunk/target/surefire/surefirebooter8888167653858489311.jar>
<https://builds.apache.org/job/HBase-TRUNK/ws/trunk/target/surefire/surefire6247734970489552072tmp>
<https://builds.apache.org/job/HBase-TRUNK/ws/trunk/target/surefire/surefire_69833207293919732633tmp>
Running org.apache.hadoop.hbase.mapreduce.TestImportExport
Tests run: 2, Failures: 0, Errors: 0, Skipped: 0, Time elapsed: 48.039 sec
Forking command line: /bin/sh -c cd <https://builds.apache.org/job/HBase-TRUNK/ws/trunk>
&& /home/jenkins/tools/java/jdk1.6.0_27-32/jre/bin/java -enableassertions -Xmx1900m
-Djava.security.egd=file:/dev/./urandom -jar <https://builds.apache.org/job/HBase-TRUNK/ws/trunk/target/surefire/surefirebooter8403610288529832152.jar>
<https://builds.apache.org/job/HBase-TRUNK/ws/trunk/target/surefire/surefire724851890163736904tmp>
<https://builds.apache.org/job/HBase-TRUNK/ws/trunk/target/surefire/surefire_706330725127177617037tmp>
Running org.apache.hadoop.hbase.mapreduce.TestImportTsv
Tests run: 8, Failures: 0, Errors: 0, Skipped: 0, Time elapsed: 85.867 sec
Forking command line: /bin/sh -c cd <https://builds.apache.org/job/HBase-TRUNK/ws/trunk>
&& /home/jenkins/tools/java/jdk1.6.0_27-32/jre/bin/java -enableassertions -Xmx1900m
-Djava.security.egd=file:/dev/./urandom -jar <https://builds.apache.org/job/HBase-TRUNK/ws/trunk/target/surefire/surefirebooter6044373339563073506.jar>
<https://builds.apache.org/job/HBase-TRUNK/ws/trunk/target/surefire/surefire6880445788583265893tmp>
<https://builds.apache.org/job/HBase-TRUNK/ws/trunk/target/surefire/surefire_71741341221221452425tmp>
Running org.apache.hadoop.hbase.thrift2.TestThriftHBaseServiceHandler
Tests run: 12, Failures: 0, Errors: 0, Skipped: 0, Time elapsed: 13.288 sec
Forking command line: /bin/sh -c cd <https://builds.apache.org/job/HBase-TRUNK/ws/trunk>
&& /home/jenkins/tools/java/jdk1.6.0_27-32/jre/bin/java -enableassertions -Xmx1900m
-Djava.security.egd=file:/dev/./urandom -jar <https://builds.apache.org/job/HBase-TRUNK/ws/trunk/target/surefire/surefirebooter7702543672249135155.jar>
<https://builds.apache.org/job/HBase-TRUNK/ws/trunk/target/surefire/surefire4503382529741156646tmp>
<https://builds.apache.org/job/HBase-TRUNK/ws/trunk/target/surefire/surefire_726807105924774580552tmp>
Running org.apache.hadoop.hbase.catalog.TestMetaReaderEditorNoCluster
Tests run: 1, Failures: 0, Errors: 0, Skipped: 0, Time elapsed: 4.146 sec
Forking command line: /bin/sh -c cd <https://builds.apache.org/job/HBase-TRUNK/ws/trunk>
&& /home/jenkins/tools/java/jdk1.6.0_27-32/jre/bin/java -enableassertions -Xmx1900m
-Djava.security.egd=file:/dev/./urandom -jar <https://builds.apache.org/job/HBase-TRUNK/ws/trunk/target/surefire/surefirebooter2442243581463025534.jar>
<https://builds.apache.org/job/HBase-TRUNK/ws/trunk/target/surefire/surefire4717683539501624524tmp>
<https://builds.apache.org/job/HBase-TRUNK/ws/trunk/target/surefire/surefire_737014416646509676239tmp>
Running org.apache.hadoop.hbase.catalog.TestMetaReaderEditor
Tests run: 5, Failures: 0, Errors: 0, Skipped: 0, Time elapsed: 22.287 sec
Forking command line: /bin/sh -c cd <https://builds.apache.org/job/HBase-TRUNK/ws/trunk>
&& /home/jenkins/tools/java/jdk1.6.0_27-32/jre/bin/java -enableassertions -Xmx1900m
-Djava.security.egd=file:/dev/./urandom -jar <https://builds.apache.org/job/HBase-TRUNK/ws/trunk/target/surefire/surefirebooter6014954720541363288.jar>
<https://builds.apache.org/job/HBase-TRUNK/ws/trunk/target/surefire/surefire2073996474142180092tmp>
<https://builds.apache.org/job/HBase-TRUNK/ws/trunk/target/surefire/surefire_743923469758707818597tmp>
Running org.apache.hadoop.hbase.catalog.TestCatalogTracker
Tests run: 9, Failures: 0, Errors: 0, Skipped: 1, Time elapsed: 5.371 sec
Forking command line: /bin/sh -c cd <https://builds.apache.org/job/HBase-TRUNK/ws/trunk>
&& /home/jenkins/tools/java/jdk1.6.0_27-32/jre/bin/java -enableassertions -Xmx1900m
-Djava.security.egd=file:/dev/./urandom -jar <https://builds.apache.org/job/HBase-TRUNK/ws/trunk/target/surefire/surefirebooter8893996999546790542.jar>
<https://builds.apache.org/job/HBase-TRUNK/ws/trunk/target/surefire/surefire2191904255714894676tmp>
<https://builds.apache.org/job/HBase-TRUNK/ws/trunk/target/surefire/surefire_754519120034199087100tmp>
Running org.apache.hadoop.hbase.client.TestTimestampsFilter
Tests run: 3, Failures: 0, Errors: 0, Skipped: 0, Time elapsed: 21.913 sec
Forking command line: /bin/sh -c cd <https://builds.apache.org/job/HBase-TRUNK/ws/trunk>
&& /home/jenkins/tools/java/jdk1.6.0_27-32/jre/bin/java -enableassertions -Xmx1900m
-Djava.security.egd=file:/dev/./urandom -jar <https://builds.apache.org/job/HBase-TRUNK/ws/trunk/target/surefire/surefirebooter8787801753039286365.jar>
<https://builds.apache.org/job/HBase-TRUNK/ws/trunk/target/surefire/surefire7201509292282720328tmp>
<https://builds.apache.org/job/HBase-TRUNK/ws/trunk/target/surefire/surefire_769169769509075462908tmp>
Running org.apache.hadoop.hbase.TestAcidGuarantees
Tests run: 3, Failures: 0, Errors: 0, Skipped: 0, Time elapsed: 95.382 sec
Forking command line: /bin/sh -c cd <https://builds.apache.org/job/HBase-TRUNK/ws/trunk>
&& /home/jenkins/tools/java/jdk1.6.0_27-32/jre/bin/java -enableassertions -Xmx1900m
-Djava.security.egd=file:/dev/./urandom -jar <https://builds.apache.org/job/HBase-TRUNK/ws/trunk/target/surefire/surefirebooter4219389264365274312.jar>
<https://builds.apache.org/job/HBase-TRUNK/ws/trunk/target/surefire/surefire1311137392440570080tmp>
<https://builds.apache.org/job/HBase-TRUNK/ws/trunk/target/surefire/surefire_773580580537627328257tmp>
Running org.apache.hadoop.hbase.client.TestHCM
Tests run: 7, Failures: 0, Errors: 0, Skipped: 0, Time elapsed: 17.421 sec
Running org.apache.hadoop.hbase.client.TestMetaScanner
Tests run: 1, Failures: 0, Errors: 0, Skipped: 0, Time elapsed: 12.139 sec
Forking command line: /bin/sh -c cd <https://builds.apache.org/job/HBase-TRUNK/ws/trunk>
&& /home/jenkins/tools/java/jdk1.6.0_27-32/jre/bin/java -enableassertions -Xmx1900m
-Djava.security.egd=file:/dev/./urandom -jar <https://builds.apache.org/job/HBase-TRUNK/ws/trunk/target/surefire/surefirebooter8595067006169668967.jar>
<https://builds.apache.org/job/HBase-TRUNK/ws/trunk/target/surefire/surefire1841740670231706736tmp>
<https://builds.apache.org/job/HBase-TRUNK/ws/trunk/target/surefire/surefire_786294303921928349479tmp>
Forking command line: /bin/sh -c cd <https://builds.apache.org/job/HBase-TRUNK/ws/trunk>
&& /home/jenkins/tools/java/jdk1.6.0_27-32/jre/bin/java -enableassertions -Xmx1900m
-Djava.security.egd=file:/dev/./urandom -jar <https://builds.apache.org/job/HBase-TRUNK/ws/trunk/target/surefire/surefirebooter6592356654493647829.jar>
<https://builds.apache.org/job/HBase-TRUNK/ws/trunk/target/surefire/surefire4172322956092494632tmp>
<https://builds.apache.org/job/HBase-TRUNK/ws/trunk/target/surefire/surefire_793754561646994514955tmp>
Running org.apache.hadoop.hbase.client.TestHTableUtil
Tests run: 2, Failures: 0, Errors: 0, Skipped: 0, Time elapsed: 13.978 sec
Forking command line: /bin/sh -c cd <https://builds.apache.org/job/HBase-TRUNK/ws/trunk>
&& /home/jenkins/tools/java/jdk1.6.0_27-32/jre/bin/java -enableassertions -Xmx1900m
-Djava.security.egd=file:/dev/./urandom -jar <https://builds.apache.org/job/HBase-TRUNK/ws/trunk/target/surefire/surefirebooter1239388625490703022.jar>
<https://builds.apache.org/job/HBase-TRUNK/ws/trunk/target/surefire/surefire2634228074558454868tmp>
<https://builds.apache.org/job/HBase-TRUNK/ws/trunk/target/surefire/surefire_804143957384953421575tmp>
Running org.apache.hadoop.hbase.client.TestMetaMigrationRemovingHTD
Tests run: 3, Failures: 0, Errors: 0, Skipped: 0, Time elapsed: 21.67 sec
Forking command line: /bin/sh -c cd <https://builds.apache.org/job/HBase-TRUNK/ws/trunk>
&& /home/jenkins/tools/java/jdk1.6.0_27-32/jre/bin/java -enableassertions -Xmx1900m
-Djava.security.egd=file:/dev/./urandom -jar <https://builds.apache.org/job/HBase-TRUNK/ws/trunk/target/surefire/surefirebooter829499441996862286.jar>
<https://builds.apache.org/job/HBase-TRUNK/ws/trunk/target/surefire/surefire7065482655098117495tmp>
<https://builds.apache.org/job/HBase-TRUNK/ws/trunk/target/surefire/surefire_814527136416037413350tmp>
Running org.apache.hadoop.hbase.client.replication.TestReplicationAdmin
Tests run: 1, Failures: 0, Errors: 0, Skipped: 0, Time elapsed: 0.869 sec
Forking command line: /bin/sh -c cd <https://builds.apache.org/job/HBase-TRUNK/ws/trunk>
&& /home/jenkins/tools/java/jdk1.6.0_27-32/jre/bin/java -enableassertions -Xmx1900m
-Djava.security.egd=file:/dev/./urandom -jar <https://builds.apache.org/job/HBase-TRUNK/ws/trunk/target/surefire/surefirebooter2897436518330863740.jar>
<https://builds.apache.org/job/HBase-TRUNK/ws/trunk/target/surefire/surefire8834297089287582038tmp>
<https://builds.apache.org/job/HBase-TRUNK/ws/trunk/target/surefire/surefire_828450287020888673940tmp>
Running org.apache.hadoop.hbase.client.TestHTablePool$TestHTableReusablePool
Tests run: 9, Failures: 0, Errors: 0, Skipped: 0, Time elapsed: 4.121 sec
Running org.apache.hadoop.hbase.client.TestHTablePool$TestHTableThreadLocalPool
Tests run: 9, Failures: 0, Errors: 0, Skipped: 0, Time elapsed: 20.632 sec
Forking command line: /bin/sh -c cd <https://builds.apache.org/job/HBase-TRUNK/ws/trunk>
&& /home/jenkins/tools/java/jdk1.6.0_27-32/jre/bin/java -enableassertions -Xmx1900m
-Djava.security.egd=file:/dev/./urandom -jar <https://builds.apache.org/job/HBase-TRUNK/ws/trunk/target/surefire/surefirebooter1136142426027505224.jar>
<https://builds.apache.org/job/HBase-TRUNK/ws/trunk/target/surefire/surefire1273432695278632374tmp>
<https://builds.apache.org/job/HBase-TRUNK/ws/trunk/target/surefire/surefire_834296031780150426268tmp>
Running org.apache.hadoop.hbase.metrics.TestMetricsMBeanBase
Tests run: 2, Failures: 0, Errors: 0, Skipped: 0, Time elapsed: 1.138 sec
Forking command line: /bin/sh -c cd <https://builds.apache.org/job/HBase-TRUNK/ws/trunk>
&& /home/jenkins/tools/java/jdk1.6.0_27-32/jre/bin/java -enableassertions -Xmx1900m
-Djava.security.egd=file:/dev/./urandom -jar <https://builds.apache.org/job/HBase-TRUNK/ws/trunk/target/surefire/surefirebooter2106003554609958423.jar>
<https://builds.apache.org/job/HBase-TRUNK/ws/trunk/target/surefire/surefire1025829386548200994tmp>
<https://builds.apache.org/job/HBase-TRUNK/ws/trunk/target/surefire/surefire_847544414530491848810tmp>
Running org.apache.hadoop.hbase.client.TestMultiParallel
Tests run: 11, Failures: 0, Errors: 0, Skipped: 0, Time elapsed: 34.979 sec
Forking command line: /bin/sh -c cd <https://builds.apache.org/job/HBase-TRUNK/ws/trunk>
&& /home/jenkins/tools/java/jdk1.6.0_27-32/jre/bin/java -enableassertions -Xmx1900m
-Djava.security.egd=file:/dev/./urandom -jar <https://builds.apache.org/job/HBase-TRUNK/ws/trunk/target/surefire/surefirebooter3234038683583758879.jar>
<https://builds.apache.org/job/HBase-TRUNK/ws/trunk/target/surefire/surefire3913048343079851989tmp>
<https://builds.apache.org/job/HBase-TRUNK/ws/trunk/target/surefire/surefire_857591427134717965134tmp>
Running org.apache.hadoop.hbase.constraint.TestConstraint
Tests run: 5, Failures: 0, Errors: 0, Skipped: 0, Time elapsed: 28.722 sec
Forking command line: /bin/sh -c cd <https://builds.apache.org/job/HBase-TRUNK/ws/trunk>
&& /home/jenkins/tools/java/jdk1.6.0_27-32/jre/bin/java -enableassertions -Xmx1900m
-Djava.security.egd=file:/dev/./urandom -jar <https://builds.apache.org/job/HBase-TRUNK/ws/trunk/target/surefire/surefirebooter476488007072287757.jar>
<https://builds.apache.org/job/HBase-TRUNK/ws/trunk/target/surefire/surefire7445237819699463547tmp>
<https://builds.apache.org/job/HBase-TRUNK/ws/trunk/target/surefire/surefire_861611601818075941974tmp>
Running org.apache.hadoop.hbase.rest.TestGzipFilter
Tests run: 3, Failures: 0, Errors: 0, Skipped: 0, Time elapsed: 15.202 sec
Forking command line: /bin/sh -c cd <https://builds.apache.org/job/HBase-TRUNK/ws/trunk>
&& /home/jenkins/tools/java/jdk1.6.0_27-32/jre/bin/java -enableassertions -Xmx1900m
-Djava.security.egd=file:/dev/./urandom -jar <https://builds.apache.org/job/HBase-TRUNK/ws/trunk/target/surefire/surefirebooter3058489390968875089.jar>
<https://builds.apache.org/job/HBase-TRUNK/ws/trunk/target/surefire/surefire3550179262404695629tmp>
<https://builds.apache.org/job/HBase-TRUNK/ws/trunk/target/surefire/surefire_87146813586866405181tmp>
Running org.apache.hadoop.hbase.rest.TestMultiRowResource
Tests run: 3, Failures: 0, Errors: 0, Skipped: 0, Time elapsed: 14.877 sec
Forking command line: /bin/sh -c cd <https://builds.apache.org/job/HBase-TRUNK/ws/trunk>
&& /home/jenkins/tools/java/jdk1.6.0_27-32/jre/bin/java -enableassertions -Xmx1900m
-Djava.security.egd=file:/dev/./urandom -jar <https://builds.apache.org/job/HBase-TRUNK/ws/trunk/target/surefire/surefirebooter8093886360898192880.jar>
<https://builds.apache.org/job/HBase-TRUNK/ws/trunk/target/surefire/surefire7441022003392170555tmp>
<https://builds.apache.org/job/HBase-TRUNK/ws/trunk/target/surefire/surefire_883657289708088035478tmp>
Running org.apache.hadoop.hbase.rest.TestScannersWithFilters
Tests run: 10, Failures: 0, Errors: 0, Skipped: 0, Time elapsed: 16.944 sec
Forking command line: /bin/sh -c cd <https://builds.apache.org/job/HBase-TRUNK/ws/trunk>
&& /home/jenkins/tools/java/jdk1.6.0_27-32/jre/bin/java -enableassertions -Xmx1900m
-Djava.security.egd=file:/dev/./urandom -jar <https://builds.apache.org/job/HBase-TRUNK/ws/trunk/target/surefire/surefirebooter4613425666957912305.jar>
<https://builds.apache.org/job/HBase-TRUNK/ws/trunk/target/surefire/surefire1848933760313202696tmp>
<https://builds.apache.org/job/HBase-TRUNK/ws/trunk/target/surefire/surefire_897558125435998801956tmp>
Running org.apache.hadoop.hbase.rest.TestRowResource
Tests run: 11, Failures: 0, Errors: 0, Skipped: 0, Time elapsed: 15.586 sec
Forking command line: /bin/sh -c cd <https://builds.apache.org/job/HBase-TRUNK/ws/trunk>
&& /home/jenkins/tools/java/jdk1.6.0_27-32/jre/bin/java -enableassertions -Xmx1900m
-Djava.security.egd=file:/dev/./urandom -jar <https://builds.apache.org/job/HBase-TRUNK/ws/trunk/target/surefire/surefirebooter7326864176352958197.jar>
<https://builds.apache.org/job/HBase-TRUNK/ws/trunk/target/surefire/surefire7318919425538662562tmp>
<https://builds.apache.org/job/HBase-TRUNK/ws/trunk/target/surefire/surefire_901831318953653993168tmp>
Running org.apache.hadoop.hbase.rest.client.TestRemoteAdmin
Tests run: 1, Failures: 0, Errors: 0, Skipped: 0, Time elapsed: 15.853 sec
Forking command line: /bin/sh -c cd <https://builds.apache.org/job/HBase-TRUNK/ws/trunk>
&& /home/jenkins/tools/java/jdk1.6.0_27-32/jre/bin/java -enableassertions -Xmx1900m
-Djava.security.egd=file:/dev/./urandom -jar <https://builds.apache.org/job/HBase-TRUNK/ws/trunk/target/surefire/surefirebooter8559062249478128886.jar>
<https://builds.apache.org/job/HBase-TRUNK/ws/trunk/target/surefire/surefire9033013235321402480tmp>
<https://builds.apache.org/job/HBase-TRUNK/ws/trunk/target/surefire/surefire_91343632404851176115tmp>
Running org.apache.hadoop.hbase.rest.client.TestRemoteTable
Tests run: 3, Failures: 0, Errors: 0, Skipped: 0, Time elapsed: 14.331 sec
Forking command line: /bin/sh -c cd <https://builds.apache.org/job/HBase-TRUNK/ws/trunk>
&& /home/jenkins/tools/java/jdk1.6.0_27-32/jre/bin/java -enableassertions -Xmx1900m
-Djava.security.egd=file:/dev/./urandom -jar <https://builds.apache.org/job/HBase-TRUNK/ws/trunk/target/surefire/surefirebooter7034991964851335725.jar>
<https://builds.apache.org/job/HBase-TRUNK/ws/trunk/target/surefire/surefire3342100194631606908tmp>
<https://builds.apache.org/job/HBase-TRUNK/ws/trunk/target/surefire/surefire_924301336481883193011tmp>
Running org.apache.hadoop.hbase.rest.TestVersionResource
Tests run: 7, Failures: 0, Errors: 0, Skipped: 0, Time elapsed: 11.478 sec
Forking command line: /bin/sh -c cd <https://builds.apache.org/job/HBase-TRUNK/ws/trunk>
&& /home/jenkins/tools/java/jdk1.6.0_27-32/jre/bin/java -enableassertions -Xmx1900m
-Djava.security.egd=file:/dev/./urandom -jar <https://builds.apache.org/job/HBase-TRUNK/ws/trunk/target/surefire/surefirebooter4968169893936626962.jar>
<https://builds.apache.org/job/HBase-TRUNK/ws/trunk/target/surefire/surefire7739822585108387678tmp>
<https://builds.apache.org/job/HBase-TRUNK/ws/trunk/target/surefire/surefire_938771545123430960400tmp>
Running org.apache.hadoop.hbase.rest.TestScannerResource
Tests run: 5, Failures: 0, Errors: 0, Skipped: 0, Time elapsed: 27.706 sec
Forking command line: /bin/sh -c cd <https://builds.apache.org/job/HBase-TRUNK/ws/trunk>
&& /home/jenkins/tools/java/jdk1.6.0_27-32/jre/bin/java -enableassertions -Xmx1900m
-Djava.security.egd=file:/dev/./urandom -jar <https://builds.apache.org/job/HBase-TRUNK/ws/trunk/target/surefire/surefirebooter555195203001894486.jar>
<https://builds.apache.org/job/HBase-TRUNK/ws/trunk/target/surefire/surefire8994532237625811152tmp>
<https://builds.apache.org/job/HBase-TRUNK/ws/trunk/target/surefire/surefire_94919752416460123158tmp>
Running org.apache.hadoop.hbase.rest.TestTableResource
Tests run: 8, Failures: 0, Errors: 0, Skipped: 0, Time elapsed: 22.335 sec
Forking command line: /bin/sh -c cd <https://builds.apache.org/job/HBase-TRUNK/ws/trunk>
&& /home/jenkins/tools/java/jdk1.6.0_27-32/jre/bin/java -enableassertions -Xmx1900m
-Djava.security.egd=file:/dev/./urandom -jar <https://builds.apache.org/job/HBase-TRUNK/ws/trunk/target/surefire/surefirebooter8537470780576566577.jar>
<https://builds.apache.org/job/HBase-TRUNK/ws/trunk/target/surefire/surefire8818262038886226142tmp>
<https://builds.apache.org/job/HBase-TRUNK/ws/trunk/target/surefire/surefire_954967346075629436639tmp>
Running org.apache.hadoop.hbase.rest.TestStatusResource
Tests run: 2, Failures: 0, Errors: 0, Skipped: 0, Time elapsed: 11.036 sec
Forking command line: /bin/sh -c cd <https://builds.apache.org/job/HBase-TRUNK/ws/trunk>
&& /home/jenkins/tools/java/jdk1.6.0_27-32/jre/bin/java -enableassertions -Xmx1900m
-Djava.security.egd=file:/dev/./urandom -jar <https://builds.apache.org/job/HBase-TRUNK/ws/trunk/target/surefire/surefirebooter7856672890625930883.jar>
<https://builds.apache.org/job/HBase-TRUNK/ws/trunk/target/surefire/surefire3454250216316351710tmp>
<https://builds.apache.org/job/HBase-TRUNK/ws/trunk/target/surefire/surefire_962522101502413127615tmp>
Running org.apache.hadoop.hbase.rest.TestSchemaResource
Tests run: 2, Failures: 0, Errors: 0, Skipped: 0, Time elapsed: 17.763 sec
Forking command line: /bin/sh -c cd <https://builds.apache.org/job/HBase-TRUNK/ws/trunk>
&& /home/jenkins/tools/java/jdk1.6.0_27-32/jre/bin/java -enableassertions -Xmx1900m
-Djava.security.egd=file:/dev/./urandom -jar <https://builds.apache.org/job/HBase-TRUNK/ws/trunk/target/surefire/surefirebooter6419446078761643222.jar>
<https://builds.apache.org/job/HBase-TRUNK/ws/trunk/target/surefire/surefire3671569673370042283tmp>
<https://builds.apache.org/job/HBase-TRUNK/ws/trunk/target/surefire/surefire_971060083276491685749tmp>
Running org.apache.hadoop.hbase.io.encoding.TestLoadAndSwitchEncodeOnDisk
Tests run: 1, Failures: 0, Errors: 0, Skipped: 0, Time elapsed: 24.844 sec
Forking command line: /bin/sh -c cd <https://builds.apache.org/job/HBase-TRUNK/ws/trunk>
&& /home/jenkins/tools/java/jdk1.6.0_27-32/jre/bin/java -enableassertions -Xmx1900m
-Djava.security.egd=file:/dev/./urandom -jar <https://builds.apache.org/job/HBase-TRUNK/ws/trunk/target/surefire/surefirebooter2642763307789501965.jar>
<https://builds.apache.org/job/HBase-TRUNK/ws/trunk/target/surefire/surefire26729549596770802tmp>
<https://builds.apache.org/job/HBase-TRUNK/ws/trunk/target/surefire/surefire_985831829876047751740tmp>
Running org.apache.hadoop.hbase.io.hfile.TestHFileSeek
Tests run: 1, Failures: 0, Errors: 0, Skipped: 0, Time elapsed: 8.11 sec
Forking command line: /bin/sh -c cd <https://builds.apache.org/job/HBase-TRUNK/ws/trunk>
&& /home/jenkins/tools/java/jdk1.6.0_27-32/jre/bin/java -enableassertions -Xmx1900m
-Djava.security.egd=file:/dev/./urandom -jar <https://builds.apache.org/job/HBase-TRUNK/ws/trunk/target/surefire/surefirebooter3599087550820391820.jar>
<https://builds.apache.org/job/HBase-TRUNK/ws/trunk/target/surefire/surefire7003824014904707155tmp>
<https://builds.apache.org/job/HBase-TRUNK/ws/trunk/target/surefire/surefire_999144323567954442799tmp>
Running org.apache.hadoop.hbase.thrift.TestThriftServer
Tests run: 1, Failures: 0, Errors: 0, Skipped: 0, Time elapsed: 62.859 sec
Forking command line: /bin/sh -c cd <https://builds.apache.org/job/HBase-TRUNK/ws/trunk>
&& /home/jenkins/tools/java/jdk1.6.0_27-32/jre/bin/java -enableassertions -Xmx1900m
-Djava.security.egd=file:/dev/./urandom -jar <https://builds.apache.org/job/HBase-TRUNK/ws/trunk/target/surefire/surefirebooter4155715792220802186.jar>
<https://builds.apache.org/job/HBase-TRUNK/ws/trunk/target/surefire/surefire8843220028161299130tmp>
<https://builds.apache.org/job/HBase-TRUNK/ws/trunk/target/surefire/surefire_100424477692797959666tmp>
Running org.apache.hadoop.hbase.io.hfile.slab.TestSlabCache
Tests run: 7, Failures: 0, Errors: 0, Skipped: 0, Time elapsed: 20.211 sec
Forking command line: /bin/sh -c cd <https://builds.apache.org/job/HBase-TRUNK/ws/trunk>
&& /home/jenkins/tools/java/jdk1.6.0_27-32/jre/bin/java -enableassertions -Xmx1900m
-Djava.security.egd=file:/dev/./urandom -jar <https://builds.apache.org/job/HBase-TRUNK/ws/trunk/target/surefire/surefirebooter5688875126273861878.jar>
<https://builds.apache.org/job/HBase-TRUNK/ws/trunk/target/surefire/surefire1346163758561559907tmp>
<https://builds.apache.org/job/HBase-TRUNK/ws/trunk/target/surefire/surefire_1014466761437138398219tmp>
Running org.apache.hadoop.hbase.io.hfile.TestChecksum
Tests run: 3, Failures: 0, Errors: 0, Skipped: 0, Time elapsed: 0.88 sec
Forking command line: /bin/sh -c cd <https://builds.apache.org/job/HBase-TRUNK/ws/trunk>
&& /home/jenkins/tools/java/jdk1.6.0_27-32/jre/bin/java -enableassertions -Xmx1900m
-Djava.security.egd=file:/dev/./urandom -jar <https://builds.apache.org/job/HBase-TRUNK/ws/trunk/target/surefire/surefirebooter3257370432538415482.jar>
<https://builds.apache.org/job/HBase-TRUNK/ws/trunk/target/surefire/surefire1146131611739184009tmp>
<https://builds.apache.org/job/HBase-TRUNK/ws/trunk/target/surefire/surefire_102428658165481348574tmp>
Running org.apache.hadoop.hbase.io.hfile.TestHFileBlockIndex
Tests run: 10, Failures: 0, Errors: 0, Skipped: 0, Time elapsed: 12.151 sec
Forking command line: /bin/sh -c cd <https://builds.apache.org/job/HBase-TRUNK/ws/trunk>
&& /home/jenkins/tools/java/jdk1.6.0_27-32/jre/bin/java -enableassertions -Xmx1900m
-Djava.security.egd=file:/dev/./urandom -jar <https://builds.apache.org/job/HBase-TRUNK/ws/trunk/target/surefire/surefirebooter432655999829837589.jar>
<https://builds.apache.org/job/HBase-TRUNK/ws/trunk/target/surefire/surefire8145703595818482375tmp>
<https://builds.apache.org/job/HBase-TRUNK/ws/trunk/target/surefire/surefire_103965581272602303433tmp>
Running org.apache.hadoop.hbase.io.hfile.TestLruBlockCache
Tests run: 16, Failures: 0, Errors: 0, Skipped: 0, Time elapsed: 0.776 sec
Forking command line: /bin/sh -c cd <https://builds.apache.org/job/HBase-TRUNK/ws/trunk>
&& /home/jenkins/tools/java/jdk1.6.0_27-32/jre/bin/java -enableassertions -Xmx1900m
-Djava.security.egd=file:/dev/./urandom -jar <https://builds.apache.org/job/HBase-TRUNK/ws/trunk/target/surefire/surefirebooter93601881127328895.jar>
<https://builds.apache.org/job/HBase-TRUNK/ws/trunk/target/surefire/surefire7367739844395610315tmp>
<https://builds.apache.org/job/HBase-TRUNK/ws/trunk/target/surefire/surefire_1043517616389052291209tmp>
Running org.apache.hadoop.hbase.io.hfile.TestHFilePerformance
Tests run: 1, Failures: 0, Errors: 0, Skipped: 0, Time elapsed: 6.537 sec
Forking command line: /bin/sh -c cd <https://builds.apache.org/job/HBase-TRUNK/ws/trunk>
&& /home/jenkins/tools/java/jdk1.6.0_27-32/jre/bin/java -enableassertions -Xmx1900m
-Djava.security.egd=file:/dev/./urandom -jar <https://builds.apache.org/job/HBase-TRUNK/ws/trunk/target/surefire/surefirebooter2487285962215426126.jar>
<https://builds.apache.org/job/HBase-TRUNK/ws/trunk/target/surefire/surefire6791910380699031275tmp>
<https://builds.apache.org/job/HBase-TRUNK/ws/trunk/target/surefire/surefire_105855344270243708969tmp>
Running org.apache.hadoop.hbase.io.hfile.TestFixedFileTrailer
Tests run: 2, Failures: 0, Errors: 0, Skipped: 0, Time elapsed: 0.621 sec
Forking command line: /bin/sh -c cd <https://builds.apache.org/job/HBase-TRUNK/ws/trunk>
&& /home/jenkins/tools/java/jdk1.6.0_27-32/jre/bin/java -enableassertions -Xmx1900m
-Djava.security.egd=file:/dev/./urandom -jar <https://builds.apache.org/job/HBase-TRUNK/ws/trunk/target/surefire/surefirebooter6659969812209453743.jar>
<https://builds.apache.org/job/HBase-TRUNK/ws/trunk/target/surefire/surefire8483576610651794837tmp>
<https://builds.apache.org/job/HBase-TRUNK/ws/trunk/target/surefire/surefire_10687009134120750218tmp>
Running org.apache.hadoop.hbase.io.hfile.slab.TestSingleSizeCache
Tests run: 5, Failures: 0, Errors: 0, Skipped: 0, Time elapsed: 25.406 sec
Forking command line: /bin/sh -c cd <https://builds.apache.org/job/HBase-TRUNK/ws/trunk>
&& /home/jenkins/tools/java/jdk1.6.0_27-32/jre/bin/java -enableassertions -Xmx1900m
-Djava.security.egd=file:/dev/./urandom -jar <https://builds.apache.org/job/HBase-TRUNK/ws/trunk/target/surefire/surefirebooter2338140653997843980.jar>
<https://builds.apache.org/job/HBase-TRUNK/ws/trunk/target/surefire/surefire7239992094243656590tmp>
<https://builds.apache.org/job/HBase-TRUNK/ws/trunk/target/surefire/surefire_1072208290116892687657tmp>
Running org.apache.hadoop.hbase.io.hfile.TestHFileBlockCompatibility
Tests run: 10, Failures: 0, Errors: 0, Skipped: 0, Time elapsed: 1.163 sec
Forking command line: /bin/sh -c cd <https://builds.apache.org/job/HBase-TRUNK/ws/trunk>
&& /home/jenkins/tools/java/jdk1.6.0_27-32/jre/bin/java -enableassertions -Xmx1900m
-Djava.security.egd=file:/dev/./urandom -jar <https://builds.apache.org/job/HBase-TRUNK/ws/trunk/target/surefire/surefirebooter1575491362813585432.jar>
<https://builds.apache.org/job/HBase-TRUNK/ws/trunk/target/surefire/surefire7525377283499983889tmp>
<https://builds.apache.org/job/HBase-TRUNK/ws/trunk/target/surefire/surefire_1087289699889585326092tmp>
Running org.apache.hadoop.hbase.io.hfile.TestForceCacheImportantBlocks
Tests run: 4, Failures: 0, Errors: 3, Skipped: 0, Time elapsed: 32.663 sec <<< FAILURE!
Forking command line: /bin/sh -c cd <https://builds.apache.org/job/HBase-TRUNK/ws/trunk>
&& /home/jenkins/tools/java/jdk1.6.0_27-32/jre/bin/java -enableassertions -Xmx1900m
-Djava.security.egd=file:/dev/./urandom -jar <https://builds.apache.org/job/HBase-TRUNK/ws/trunk/target/surefire/surefirebooter3882538333540310063.jar>
<https://builds.apache.org/job/HBase-TRUNK/ws/trunk/target/surefire/surefire1869902129894782418tmp>
<https://builds.apache.org/job/HBase-TRUNK/ws/trunk/target/surefire/surefire_109964405395556577945tmp>
Running org.apache.hadoop.hbase.io.hfile.TestHFileBlock
Tests run: 16, Failures: 0, Errors: 0, Skipped: 0, Time elapsed: 48.061 sec
Forking command line: /bin/sh -c cd <https://builds.apache.org/job/HBase-TRUNK/ws/trunk>
&& /home/jenkins/tools/java/jdk1.6.0_27-32/jre/bin/java -enableassertions -Xmx1900m
-Djava.security.egd=file:/dev/./urandom -jar <https://builds.apache.org/job/HBase-TRUNK/ws/trunk/target/surefire/surefirebooter6081583415427268025.jar>
<https://builds.apache.org/job/HBase-TRUNK/ws/trunk/target/surefire/surefire697868141970200430tmp>
<https://builds.apache.org/job/HBase-TRUNK/ws/trunk/target/surefire/surefire_1106788755703735637820tmp>
Running org.apache.hadoop.hbase.io.hfile.TestCacheOnWrite
Tests run: 36, Failures: 0, Errors: 0, Skipped: 0, Time elapsed: 37.845 sec
Forking command line: /bin/sh -c cd <https://builds.apache.org/job/HBase-TRUNK/ws/trunk>
&& /home/jenkins/tools/java/jdk1.6.0_27-32/jre/bin/java -enableassertions -Xmx1900m
-Djava.security.egd=file:/dev/./urandom -jar <https://builds.apache.org/job/HBase-TRUNK/ws/trunk/target/surefire/surefirebooter2939517585941620856.jar>
<https://builds.apache.org/job/HBase-TRUNK/ws/trunk/target/surefire/surefire5411834420418885885tmp>
<https://builds.apache.org/job/HBase-TRUNK/ws/trunk/target/surefire/surefire_1112706455574161660914tmp>
Running org.apache.hadoop.hbase.replication.regionserver.TestReplicationSourceManager
Tests run: 1, Failures: 0, Errors: 0, Skipped: 0, Time elapsed: 1.023 sec
Forking command line: /bin/sh -c cd <https://builds.apache.org/job/HBase-TRUNK/ws/trunk>
&& /home/jenkins/tools/java/jdk1.6.0_27-32/jre/bin/java -enableassertions -Xmx1900m
-Djava.security.egd=file:/dev/./urandom -jar <https://builds.apache.org/job/HBase-TRUNK/ws/trunk/target/surefire/surefirebooter7673435198802451050.jar>
<https://builds.apache.org/job/HBase-TRUNK/ws/trunk/target/surefire/surefire6229102486507890205tmp>
<https://builds.apache.org/job/HBase-TRUNK/ws/trunk/target/surefire/surefire_1126224854383162977926tmp>
Running org.apache.hadoop.hbase.avro.TestAvroServer
Tests run: 3, Failures: 0, Errors: 0, Skipped: 0, Time elapsed: 26.141 sec
Forking command line: /bin/sh -c cd <https://builds.apache.org/job/HBase-TRUNK/ws/trunk>
&& /home/jenkins/tools/java/jdk1.6.0_27-32/jre/bin/java -enableassertions -Xmx1900m
-Djava.security.egd=file:/dev/./urandom -jar <https://builds.apache.org/job/HBase-TRUNK/ws/trunk/target/surefire/surefirebooter8732482150477054003.jar>
<https://builds.apache.org/job/HBase-TRUNK/ws/trunk/target/surefire/surefire605005128762317298tmp>
<https://builds.apache.org/job/HBase-TRUNK/ws/trunk/target/surefire/surefire_1132376580158069411808tmp>
Running org.apache.hadoop.hbase.replication.TestReplicationSource
Tests run: 1, Failures: 0, Errors: 0, Skipped: 0, Time elapsed: 2.846 sec
Forking command line: /bin/sh -c cd <https://builds.apache.org/job/HBase-TRUNK/ws/trunk>
&& /home/jenkins/tools/java/jdk1.6.0_27-32/jre/bin/java -enableassertions -Xmx1900m
-Djava.security.egd=file:/dev/./urandom -jar <https://builds.apache.org/job/HBase-TRUNK/ws/trunk/target/surefire/surefirebooter4729148439926014852.jar>
<https://builds.apache.org/job/HBase-TRUNK/ws/trunk/target/surefire/surefire3814240782501681840tmp>
<https://builds.apache.org/job/HBase-TRUNK/ws/trunk/target/surefire/surefire_1147874402356912170285tmp>
Running org.apache.hadoop.hbase.replication.TestReplicationPeer
Tests run: 1, Failures: 0, Errors: 0, Skipped: 0, Time elapsed: 1.329 sec
Forking command line: /bin/sh -c cd <https://builds.apache.org/job/HBase-TRUNK/ws/trunk>
&& /home/jenkins/tools/java/jdk1.6.0_27-32/jre/bin/java -enableassertions -Xmx1900m
-Djava.security.egd=file:/dev/./urandom -jar <https://builds.apache.org/job/HBase-TRUNK/ws/trunk/target/surefire/surefirebooter2975394593453848028.jar>
<https://builds.apache.org/job/HBase-TRUNK/ws/trunk/target/surefire/surefire3896841300383860405tmp>
<https://builds.apache.org/job/HBase-TRUNK/ws/trunk/target/surefire/surefire_1157434767259837706296tmp>
Running org.apache.hadoop.hbase.replication.TestReplicationZookeeper
Tests run: 1, Failures: 0, Errors: 0, Skipped: 0, Time elapsed: 0.649 sec
Forking command line: /bin/sh -c cd <https://builds.apache.org/job/HBase-TRUNK/ws/trunk>
&& /home/jenkins/tools/java/jdk1.6.0_27-32/jre/bin/java -enableassertions -Xmx1900m
-Djava.security.egd=file:/dev/./urandom -jar <https://builds.apache.org/job/HBase-TRUNK/ws/trunk/target/surefire/surefirebooter2049511186781511176.jar>
<https://builds.apache.org/job/HBase-TRUNK/ws/trunk/target/surefire/surefire3774627834176818704tmp>
<https://builds.apache.org/job/HBase-TRUNK/ws/trunk/target/surefire/surefire_1164978047470145897720tmp>
Running org.apache.hadoop.hbase.ipc.TestDelayedRpc
Tests run: 4, Failures: 0, Errors: 0, Skipped: 0, Time elapsed: 2.653 sec
Running org.apache.hadoop.hbase.replication.regionserver.TestReplicationSink
Tests run: 5, Failures: 0, Errors: 0, Skipped: 0, Time elapsed: 28.348 sec

Results :

Tests in error: 
  testCacheBlocks[1](org.apache.hadoop.hbase.io.hfile.TestForceCacheImportantBlocks)
  testCacheBlocks[2](org.apache.hadoop.hbase.io.hfile.TestForceCacheImportantBlocks): unable
to create new native thread
  testCacheBlocks[3](org.apache.hadoop.hbase.io.hfile.TestForceCacheImportantBlocks): unable
to create new native thread

Tests run: 617, Failures: 0, Errors: 3, Skipped: 2

[INFO] ------------------------------------------------------------------------
[INFO] BUILD FAILURE
[INFO] ------------------------------------------------------------------------
[INFO] Total time: 27:53.545s
[INFO] Finished at: Wed Apr 11 05:34:30 UTC 2012
[INFO] Final Memory: 45M/775M
[INFO] ------------------------------------------------------------------------
[ERROR] Failed to execute goal org.apache.maven.plugins:maven-surefire-plugin:2.12-TRUNK-HBASE-2:test
(secondPartTestsExecution) on project hbase: There are test failures.
[ERROR] 
[ERROR] Please refer to <https://builds.apache.org/job/HBase-TRUNK/ws/trunk/target/surefire-reports>
for the individual test results.
[ERROR] -> [Help 1]
org.apache.maven.lifecycle.LifecycleExecutionException: Failed to execute goal org.apache.maven.plugins:maven-surefire-plugin:2.12-TRUNK-HBASE-2:test
(secondPartTestsExecution) on project hbase: There are test failures.

Please refer to <https://builds.apache.org/job/HBase-TRUNK/ws/trunk/target/surefire-reports>
for the individual test results.
	at org.apache.maven.lifecycle.internal.MojoExecutor.execute(MojoExecutor.java:213)
	at org.apache.maven.lifecycle.internal.MojoExecutor.execute(MojoExecutor.java:153)
	at org.apache.maven.lifecycle.internal.MojoExecutor.execute(MojoExecutor.java:145)
	at org.apache.maven.lifecycle.internal.LifecycleModuleBuilder.buildProject(LifecycleModuleBuilder.java:84)
	at org.apache.maven.lifecycle.internal.LifecycleModuleBuilder.buildProject(LifecycleModuleBuilder.java:59)
	at org.apache.maven.lifecycle.internal.LifecycleStarter.singleThreadedBuild(LifecycleStarter.java:183)
	at org.apache.maven.lifecycle.internal.LifecycleStarter.execute(LifecycleStarter.java:161)
	at org.apache.maven.DefaultMaven.doExecute(DefaultMaven.java:319)
	at org.apache.maven.DefaultMaven.execute(DefaultMaven.java:156)
	at org.apache.maven.cli.MavenCli.execute(MavenCli.java:537)
	at org.apache.maven.cli.MavenCli.doMain(MavenCli.java:196)
	at org.apache.maven.cli.MavenCli.main(MavenCli.java:141)
	at sun.reflect.NativeMethodAccessorImpl.invoke0(Native Method)
	at sun.reflect.NativeMethodAccessorImpl.invoke(NativeMethodAccessorImpl.java:39)
	at sun.reflect.DelegatingMethodAccessorImpl.invoke(DelegatingMethodAccessorImpl.java:25)
	at java.lang.reflect.Method.invoke(Method.java:597)
	at org.codehaus.plexus.classworlds.launcher.Launcher.launchEnhanced(Launcher.java:290)
	at org.codehaus.plexus.classworlds.launcher.Launcher.launch(Launcher.java:230)
	at org.codehaus.plexus.classworlds.launcher.Launcher.mainWithExitCode(Launcher.java:409)
	at org.codehaus.plexus.classworlds.launcher.Launcher.main(Launcher.java:352)
Caused by: org.apache.maven.plugin.MojoFailureException: There are test failures.

Please refer to <https://builds.apache.org/job/HBase-TRUNK/ws/trunk/target/surefire-reports>
for the individual test results.
	at org.apache.maven.plugin.surefire.SurefireHelper.reportExecution(SurefireHelper.java:87)
	at org.apache.maven.plugin.surefire.SurefirePlugin.writeSummary(SurefirePlugin.java:651)
	at org.apache.maven.plugin.surefire.SurefirePlugin.handleSummary(SurefirePlugin.java:625)
	at org.apache.maven.plugin.surefire.AbstractSurefireMojo.executeAfterPreconditionsChecked(AbstractSurefireMojo.java:137)
	at org.apache.maven.plugin.surefire.AbstractSurefireMojo.execute(AbstractSurefireMojo.java:98)
	at org.apache.maven.plugin.DefaultBuildPluginManager.executeMojo(DefaultBuildPluginManager.java:101)
	at org.apache.maven.lifecycle.internal.MojoExecutor.execute(MojoExecutor.java:209)
	... 19 more
[ERROR] 
[ERROR] 
[ERROR] For more information about the errors and possible solutions, please read the following
articles:
[ERROR] [Help 1] http://cwiki.apache.org/confluence/display/MAVEN/MojoFailureException
Build step 'Invoke top-level Maven targets' marked build as failure
Archiving artifacts
Recording test results
Updating HBASE-5653

Mime
View raw message