hbase-dev mailing list archives

Site index · List index
Message view « Date » · « Thread »
Top « Date » · « Thread »
From Apache Jenkins Server <jenk...@builds.apache.org>
Subject Build failed in Jenkins: HBase-0.92 #371
Date Sun, 15 Apr 2012 11:37:01 GMT
See <https://builds.apache.org/job/HBase-0.92/371/changes>

Changes:

[jmhsieh] HBASE-5781 Zookeeper session got closed while trying to assign the region to RS
using hbck -fix

------------------------------------------
[...truncated 7029 lines...]
Forking command line: /bin/sh -c cd /x1/jenkins/jenkins-slave/workspace/HBase-0.92/trunk &&
/x1/jenkins/tools/java/jdk1.6.0_27-32/jre/bin/java -enableassertions -Xmx1400m -Djava.security.egd=file:/dev/./urandom
-jar /x1/jenkins/jenkins-slave/workspace/HBase-0.92/trunk/target/surefire/surefirebooter2365321041176969275.jar
/x1/jenkins/jenkins-slave/workspace/HBase-0.92/trunk/target/surefire/surefire8020574944381553087tmp
/x1/jenkins/jenkins-slave/workspace/HBase-0.92/trunk/target/surefire/surefire6167200574298513467tmp
Running org.apache.hadoop.hbase.rest.TestScannersWithFilters
Tests run: 10, Failures: 0, Errors: 0, Skipped: 0, Time elapsed: 22.508 sec
Forking command line: /bin/sh -c cd /x1/jenkins/jenkins-slave/workspace/HBase-0.92/trunk &&
/x1/jenkins/tools/java/jdk1.6.0_27-32/jre/bin/java -enableassertions -Xmx1400m -Djava.security.egd=file:/dev/./urandom
-jar /x1/jenkins/jenkins-slave/workspace/HBase-0.92/trunk/target/surefire/surefirebooter198165444227178084.jar
/x1/jenkins/jenkins-slave/workspace/HBase-0.92/trunk/target/surefire/surefire7016495556517056863tmp
/x1/jenkins/jenkins-slave/workspace/HBase-0.92/trunk/target/surefire/surefire3987340536710323479tmp
Running org.apache.hadoop.hbase.metrics.TestMetricsMBeanBase
Tests run: 2, Failures: 0, Errors: 0, Skipped: 0, Time elapsed: 1.139 sec
Forking command line: /bin/sh -c cd /x1/jenkins/jenkins-slave/workspace/HBase-0.92/trunk &&
/x1/jenkins/tools/java/jdk1.6.0_27-32/jre/bin/java -enableassertions -Xmx1400m -Djava.security.egd=file:/dev/./urandom
-jar /x1/jenkins/jenkins-slave/workspace/HBase-0.92/trunk/target/surefire/surefirebooter477097429298459182.jar
/x1/jenkins/jenkins-slave/workspace/HBase-0.92/trunk/target/surefire/surefire3163915576622480640tmp
/x1/jenkins/jenkins-slave/workspace/HBase-0.92/trunk/target/surefire/surefire2338157286714251930tmp
Running org.apache.hadoop.hbase.metrics.TestExponentiallyDecayingSample
Tests run: 2, Failures: 0, Errors: 0, Skipped: 0, Time elapsed: 0.113 sec
Forking command line: /bin/sh -c cd /x1/jenkins/jenkins-slave/workspace/HBase-0.92/trunk &&
/x1/jenkins/tools/java/jdk1.6.0_27-32/jre/bin/java -enableassertions -Xmx1400m -Djava.security.egd=file:/dev/./urandom
-jar /x1/jenkins/jenkins-slave/workspace/HBase-0.92/trunk/target/surefire/surefirebooter1014201674894684735.jar
/x1/jenkins/jenkins-slave/workspace/HBase-0.92/trunk/target/surefire/surefire5886389460771967235tmp
/x1/jenkins/jenkins-slave/workspace/HBase-0.92/trunk/target/surefire/surefire843730527475662897tmp
Running org.apache.hadoop.hbase.metrics.TestExactCounterMetric
Tests run: 1, Failures: 0, Errors: 0, Skipped: 0, Time elapsed: 0.102 sec
Forking command line: /bin/sh -c cd /x1/jenkins/jenkins-slave/workspace/HBase-0.92/trunk &&
/x1/jenkins/tools/java/jdk1.6.0_27-32/jre/bin/java -enableassertions -Xmx1400m -Djava.security.egd=file:/dev/./urandom
-jar /x1/jenkins/jenkins-slave/workspace/HBase-0.92/trunk/target/surefire/surefirebooter3726148776972045072.jar
/x1/jenkins/jenkins-slave/workspace/HBase-0.92/trunk/target/surefire/surefire2747464871235480307tmp
/x1/jenkins/jenkins-slave/workspace/HBase-0.92/trunk/target/surefire/surefire4801943767442587424tmp
Running org.apache.hadoop.hbase.metrics.TestMetricsHistogram
Tests run: 2, Failures: 0, Errors: 0, Skipped: 0, Time elapsed: 0.145 sec
Forking command line: /bin/sh -c cd /x1/jenkins/jenkins-slave/workspace/HBase-0.92/trunk &&
/x1/jenkins/tools/java/jdk1.6.0_27-32/jre/bin/java -enableassertions -Xmx1400m -Djava.security.egd=file:/dev/./urandom
-jar /x1/jenkins/jenkins-slave/workspace/HBase-0.92/trunk/target/surefire/surefirebooter3579648775016323975.jar
/x1/jenkins/jenkins-slave/workspace/HBase-0.92/trunk/target/surefire/surefire6321544672429901493tmp
/x1/jenkins/jenkins-slave/workspace/HBase-0.92/trunk/target/surefire/surefire2624965186292497849tmp
Running org.apache.hadoop.hbase.io.hfile.TestHFileWriterV2
Tests run: 1, Failures: 0, Errors: 0, Skipped: 0, Time elapsed: 0.802 sec
Forking command line: /bin/sh -c cd /x1/jenkins/jenkins-slave/workspace/HBase-0.92/trunk &&
/x1/jenkins/tools/java/jdk1.6.0_27-32/jre/bin/java -enableassertions -Xmx1400m -Djava.security.egd=file:/dev/./urandom
-jar /x1/jenkins/jenkins-slave/workspace/HBase-0.92/trunk/target/surefire/surefirebooter3005222216715328123.jar
/x1/jenkins/jenkins-slave/workspace/HBase-0.92/trunk/target/surefire/surefire5013491800106364155tmp
/x1/jenkins/jenkins-slave/workspace/HBase-0.92/trunk/target/surefire/surefire2030303294948480256tmp
Running org.apache.hadoop.hbase.io.hfile.TestHFile
Tests run: 6, Failures: 0, Errors: 0, Skipped: 0, Time elapsed: 0.703 sec
Forking command line: /bin/sh -c cd /x1/jenkins/jenkins-slave/workspace/HBase-0.92/trunk &&
/x1/jenkins/tools/java/jdk1.6.0_27-32/jre/bin/java -enableassertions -Xmx1400m -Djava.security.egd=file:/dev/./urandom
-jar /x1/jenkins/jenkins-slave/workspace/HBase-0.92/trunk/target/surefire/surefirebooter297428989000115943.jar
/x1/jenkins/jenkins-slave/workspace/HBase-0.92/trunk/target/surefire/surefire900657757881512923tmp
/x1/jenkins/jenkins-slave/workspace/HBase-0.92/trunk/target/surefire/surefire2644563519714121656tmp
Running org.apache.hadoop.hbase.io.hfile.TestHFileBlockIndex
Tests run: 10, Failures: 0, Errors: 0, Skipped: 0, Time elapsed: 7.263 sec
Forking command line: /bin/sh -c cd /x1/jenkins/jenkins-slave/workspace/HBase-0.92/trunk &&
/x1/jenkins/tools/java/jdk1.6.0_27-32/jre/bin/java -enableassertions -Xmx1400m -Djava.security.egd=file:/dev/./urandom
-jar /x1/jenkins/jenkins-slave/workspace/HBase-0.92/trunk/target/surefire/surefirebooter141000280417536011.jar
/x1/jenkins/jenkins-slave/workspace/HBase-0.92/trunk/target/surefire/surefire2612189377813028104tmp
/x1/jenkins/jenkins-slave/workspace/HBase-0.92/trunk/target/surefire/surefire248781258396288429tmp
Running org.apache.hadoop.hbase.io.hfile.TestHFileSeek
Tests run: 1, Failures: 0, Errors: 0, Skipped: 0, Time elapsed: 4.374 sec
Forking command line: /bin/sh -c cd /x1/jenkins/jenkins-slave/workspace/HBase-0.92/trunk &&
/x1/jenkins/tools/java/jdk1.6.0_27-32/jre/bin/java -enableassertions -Xmx1400m -Djava.security.egd=file:/dev/./urandom
-jar /x1/jenkins/jenkins-slave/workspace/HBase-0.92/trunk/target/surefire/surefirebooter6349844941591576817.jar
/x1/jenkins/jenkins-slave/workspace/HBase-0.92/trunk/target/surefire/surefire5010114954249434537tmp
/x1/jenkins/jenkins-slave/workspace/HBase-0.92/trunk/target/surefire/surefire6943629811028014619tmp
Running org.apache.hadoop.hbase.io.hfile.TestLruBlockCache
Tests run: 7, Failures: 0, Errors: 0, Skipped: 0, Time elapsed: 0.35 sec
Forking command line: /bin/sh -c cd /x1/jenkins/jenkins-slave/workspace/HBase-0.92/trunk &&
/x1/jenkins/tools/java/jdk1.6.0_27-32/jre/bin/java -enableassertions -Xmx1400m -Djava.security.egd=file:/dev/./urandom
-jar /x1/jenkins/jenkins-slave/workspace/HBase-0.92/trunk/target/surefire/surefirebooter1986728121211458616.jar
/x1/jenkins/jenkins-slave/workspace/HBase-0.92/trunk/target/surefire/surefire6854331867289605071tmp
/x1/jenkins/jenkins-slave/workspace/HBase-0.92/trunk/target/surefire/surefire8476115581575343156tmp
Running org.apache.hadoop.hbase.io.hfile.TestFixedFileTrailer
Tests run: 2, Failures: 0, Errors: 0, Skipped: 0, Time elapsed: 0.599 sec
Forking command line: /bin/sh -c cd /x1/jenkins/jenkins-slave/workspace/HBase-0.92/trunk &&
/x1/jenkins/tools/java/jdk1.6.0_27-32/jre/bin/java -enableassertions -Xmx1400m -Djava.security.egd=file:/dev/./urandom
-jar /x1/jenkins/jenkins-slave/workspace/HBase-0.92/trunk/target/surefire/surefirebooter4090166519986316248.jar
/x1/jenkins/jenkins-slave/workspace/HBase-0.92/trunk/target/surefire/surefire4970613950653716700tmp
/x1/jenkins/jenkins-slave/workspace/HBase-0.92/trunk/target/surefire/surefire911429449006375960tmp
Running org.apache.hadoop.hbase.io.hfile.TestCachedBlockQueue
Tests run: 2, Failures: 0, Errors: 0, Skipped: 0, Time elapsed: 0.108 sec
Forking command line: /bin/sh -c cd /x1/jenkins/jenkins-slave/workspace/HBase-0.92/trunk &&
/x1/jenkins/tools/java/jdk1.6.0_27-32/jre/bin/java -enableassertions -Xmx1400m -Djava.security.egd=file:/dev/./urandom
-jar /x1/jenkins/jenkins-slave/workspace/HBase-0.92/trunk/target/surefire/surefirebooter5883492614740415221.jar
/x1/jenkins/jenkins-slave/workspace/HBase-0.92/trunk/target/surefire/surefire9210819676198997000tmp
/x1/jenkins/jenkins-slave/workspace/HBase-0.92/trunk/target/surefire/surefire805697057957276188tmp
Running org.apache.hadoop.hbase.io.hfile.TestHFilePerformance
Tests run: 1, Failures: 0, Errors: 0, Skipped: 0, Time elapsed: 4.317 sec
Forking command line: /bin/sh -c cd /x1/jenkins/jenkins-slave/workspace/HBase-0.92/trunk &&
/x1/jenkins/tools/java/jdk1.6.0_27-32/jre/bin/java -enableassertions -Xmx1400m -Djava.security.egd=file:/dev/./urandom
-jar /x1/jenkins/jenkins-slave/workspace/HBase-0.92/trunk/target/surefire/surefirebooter5785285507971248476.jar
/x1/jenkins/jenkins-slave/workspace/HBase-0.92/trunk/target/surefire/surefire1083184422893925794tmp
/x1/jenkins/jenkins-slave/workspace/HBase-0.92/trunk/target/surefire/surefire7775544910739913959tmp
Running org.apache.hadoop.hbase.io.hfile.TestCacheOnWrite
Tests run: 6, Failures: 0, Errors: 0, Skipped: 0, Time elapsed: 5.463 sec
Forking command line: /bin/sh -c cd /x1/jenkins/jenkins-slave/workspace/HBase-0.92/trunk &&
/x1/jenkins/tools/java/jdk1.6.0_27-32/jre/bin/java -enableassertions -Xmx1400m -Djava.security.egd=file:/dev/./urandom
-jar /x1/jenkins/jenkins-slave/workspace/HBase-0.92/trunk/target/surefire/surefirebooter3078293885495197137.jar
/x1/jenkins/jenkins-slave/workspace/HBase-0.92/trunk/target/surefire/surefire3762797855334822926tmp
/x1/jenkins/jenkins-slave/workspace/HBase-0.92/trunk/target/surefire/surefire8316585967302429344tmp
Running org.apache.hadoop.hbase.io.hfile.TestReseekTo
Tests run: 1, Failures: 0, Errors: 0, Skipped: 0, Time elapsed: 0.631 sec
Forking command line: /bin/sh -c cd /x1/jenkins/jenkins-slave/workspace/HBase-0.92/trunk &&
/x1/jenkins/tools/java/jdk1.6.0_27-32/jre/bin/java -enableassertions -Xmx1400m -Djava.security.egd=file:/dev/./urandom
-jar /x1/jenkins/jenkins-slave/workspace/HBase-0.92/trunk/target/surefire/surefirebooter4020152283428335178.jar
/x1/jenkins/jenkins-slave/workspace/HBase-0.92/trunk/target/surefire/surefire3321786491108699938tmp
/x1/jenkins/jenkins-slave/workspace/HBase-0.92/trunk/target/surefire/surefire5992176345720013153tmp
Running org.apache.hadoop.hbase.io.hfile.TestSeekTo
Tests run: 3, Failures: 0, Errors: 0, Skipped: 0, Time elapsed: 0.525 sec
Forking command line: /bin/sh -c cd /x1/jenkins/jenkins-slave/workspace/HBase-0.92/trunk &&
/x1/jenkins/tools/java/jdk1.6.0_27-32/jre/bin/java -enableassertions -Xmx1400m -Djava.security.egd=file:/dev/./urandom
-jar /x1/jenkins/jenkins-slave/workspace/HBase-0.92/trunk/target/surefire/surefirebooter1405720336347216442.jar
/x1/jenkins/jenkins-slave/workspace/HBase-0.92/trunk/target/surefire/surefire5560267949261223456tmp
/x1/jenkins/jenkins-slave/workspace/HBase-0.92/trunk/target/surefire/surefire5710472534609302901tmp
Running org.apache.hadoop.hbase.io.hfile.TestBlockCacheColumnFamilySummary
Tests run: 4, Failures: 0, Errors: 0, Skipped: 0, Time elapsed: 0.086 sec
Forking command line: /bin/sh -c cd /x1/jenkins/jenkins-slave/workspace/HBase-0.92/trunk &&
/x1/jenkins/tools/java/jdk1.6.0_27-32/jre/bin/java -enableassertions -Xmx1400m -Djava.security.egd=file:/dev/./urandom
-jar /x1/jenkins/jenkins-slave/workspace/HBase-0.92/trunk/target/surefire/surefirebooter2134254642808594837.jar
/x1/jenkins/jenkins-slave/workspace/HBase-0.92/trunk/target/surefire/surefire7228710026093428274tmp
/x1/jenkins/jenkins-slave/workspace/HBase-0.92/trunk/target/surefire/surefire5299634539960708454tmp
Running org.apache.hadoop.hbase.io.hfile.TestHFileBlock
Tests run: 7, Failures: 0, Errors: 0, Skipped: 0, Time elapsed: 23.911 sec
Forking command line: /bin/sh -c cd /x1/jenkins/jenkins-slave/workspace/HBase-0.92/trunk &&
/x1/jenkins/tools/java/jdk1.6.0_27-32/jre/bin/java -enableassertions -Xmx1400m -Djava.security.egd=file:/dev/./urandom
-jar /x1/jenkins/jenkins-slave/workspace/HBase-0.92/trunk/target/surefire/surefirebooter6356143186149148393.jar
/x1/jenkins/jenkins-slave/workspace/HBase-0.92/trunk/target/surefire/surefire3774114769919886035tmp
/x1/jenkins/jenkins-slave/workspace/HBase-0.92/trunk/target/surefire/surefire3075558157525065787tmp
Running org.apache.hadoop.hbase.io.hfile.slab.TestSlabCache
Tests run: 7, Failures: 0, Errors: 0, Skipped: 0, Time elapsed: 15.175 sec
Forking command line: /bin/sh -c cd /x1/jenkins/jenkins-slave/workspace/HBase-0.92/trunk &&
/x1/jenkins/tools/java/jdk1.6.0_27-32/jre/bin/java -enableassertions -Xmx1400m -Djava.security.egd=file:/dev/./urandom
-jar /x1/jenkins/jenkins-slave/workspace/HBase-0.92/trunk/target/surefire/surefirebooter4187365681752637113.jar
/x1/jenkins/jenkins-slave/workspace/HBase-0.92/trunk/target/surefire/surefire8990063558963407724tmp
/x1/jenkins/jenkins-slave/workspace/HBase-0.92/trunk/target/surefire/surefire4500247957284366458tmp
Running org.apache.hadoop.hbase.io.hfile.slab.TestSingleSizeCache
Tests run: 5, Failures: 0, Errors: 0, Skipped: 0, Time elapsed: 19.274 sec
Forking command line: /bin/sh -c cd /x1/jenkins/jenkins-slave/workspace/HBase-0.92/trunk &&
/x1/jenkins/tools/java/jdk1.6.0_27-32/jre/bin/java -enableassertions -Xmx1400m -Djava.security.egd=file:/dev/./urandom
-jar /x1/jenkins/jenkins-slave/workspace/HBase-0.92/trunk/target/surefire/surefirebooter3189719717825318167.jar
/x1/jenkins/jenkins-slave/workspace/HBase-0.92/trunk/target/surefire/surefire3469343553433072226tmp
/x1/jenkins/jenkins-slave/workspace/HBase-0.92/trunk/target/surefire/surefire801886910310785782tmp
Running org.apache.hadoop.hbase.io.hfile.slab.TestSlab
Tests run: 1, Failures: 0, Errors: 0, Skipped: 0, Time elapsed: 0.111 sec
Forking command line: /bin/sh -c cd /x1/jenkins/jenkins-slave/workspace/HBase-0.92/trunk &&
/x1/jenkins/tools/java/jdk1.6.0_27-32/jre/bin/java -enableassertions -Xmx1400m -Djava.security.egd=file:/dev/./urandom
-jar /x1/jenkins/jenkins-slave/workspace/HBase-0.92/trunk/target/surefire/surefirebooter6330106976296167167.jar
/x1/jenkins/jenkins-slave/workspace/HBase-0.92/trunk/target/surefire/surefire7154486167025307248tmp
/x1/jenkins/jenkins-slave/workspace/HBase-0.92/trunk/target/surefire/surefire980455374149853722tmp
Running org.apache.hadoop.hbase.io.hfile.TestHFileReaderV1
Tests run: 1, Failures: 0, Errors: 0, Skipped: 0, Time elapsed: 0.492 sec
Forking command line: /bin/sh -c cd /x1/jenkins/jenkins-slave/workspace/HBase-0.92/trunk &&
/x1/jenkins/tools/java/jdk1.6.0_27-32/jre/bin/java -enableassertions -Xmx1400m -Djava.security.egd=file:/dev/./urandom
-jar /x1/jenkins/jenkins-slave/workspace/HBase-0.92/trunk/target/surefire/surefirebooter9218867223300203575.jar
/x1/jenkins/jenkins-slave/workspace/HBase-0.92/trunk/target/surefire/surefire8731749802688237013tmp
/x1/jenkins/jenkins-slave/workspace/HBase-0.92/trunk/target/surefire/surefire6843059128327011860tmp
Running org.apache.hadoop.hbase.io.TestHalfStoreFileReader
Tests run: 1, Failures: 0, Errors: 0, Skipped: 0, Time elapsed: 0.699 sec
Forking command line: /bin/sh -c cd /x1/jenkins/jenkins-slave/workspace/HBase-0.92/trunk &&
/x1/jenkins/tools/java/jdk1.6.0_27-32/jre/bin/java -enableassertions -Xmx1400m -Djava.security.egd=file:/dev/./urandom
-jar /x1/jenkins/jenkins-slave/workspace/HBase-0.92/trunk/target/surefire/surefirebooter132372457693277022.jar
/x1/jenkins/jenkins-slave/workspace/HBase-0.92/trunk/target/surefire/surefire281043274800720094tmp
/x1/jenkins/jenkins-slave/workspace/HBase-0.92/trunk/target/surefire/surefire1476382045759363326tmp
Running org.apache.hadoop.hbase.io.TestHbaseObjectWritable
Tests run: 5, Failures: 0, Errors: 0, Skipped: 0, Time elapsed: 0.466 sec
Forking command line: /bin/sh -c cd /x1/jenkins/jenkins-slave/workspace/HBase-0.92/trunk &&
/x1/jenkins/tools/java/jdk1.6.0_27-32/jre/bin/java -enableassertions -Xmx1400m -Djava.security.egd=file:/dev/./urandom
-jar /x1/jenkins/jenkins-slave/workspace/HBase-0.92/trunk/target/surefire/surefirebooter4253842533983964159.jar
/x1/jenkins/jenkins-slave/workspace/HBase-0.92/trunk/target/surefire/surefire3830655908732294708tmp
/x1/jenkins/jenkins-slave/workspace/HBase-0.92/trunk/target/surefire/surefire6715044852010956931tmp
Running org.apache.hadoop.hbase.io.TestImmutableBytesWritable
Tests run: 3, Failures: 0, Errors: 0, Skipped: 0, Time elapsed: 0.085 sec
Forking command line: /bin/sh -c cd /x1/jenkins/jenkins-slave/workspace/HBase-0.92/trunk &&
/x1/jenkins/tools/java/jdk1.6.0_27-32/jre/bin/java -enableassertions -Xmx1400m -Djava.security.egd=file:/dev/./urandom
-jar /x1/jenkins/jenkins-slave/workspace/HBase-0.92/trunk/target/surefire/surefirebooter3798139349437964374.jar
/x1/jenkins/jenkins-slave/workspace/HBase-0.92/trunk/target/surefire/surefire6362209647915932620tmp
/x1/jenkins/jenkins-slave/workspace/HBase-0.92/trunk/target/surefire/surefire468971551405598634tmp
Running org.apache.hadoop.hbase.io.TestHeapSize
Tests run: 2, Failures: 0, Errors: 0, Skipped: 0, Time elapsed: 0.174 sec
Forking command line: /bin/sh -c cd /x1/jenkins/jenkins-slave/workspace/HBase-0.92/trunk &&
/x1/jenkins/tools/java/jdk1.6.0_27-32/jre/bin/java -enableassertions -Xmx1400m -Djava.security.egd=file:/dev/./urandom
-jar /x1/jenkins/jenkins-slave/workspace/HBase-0.92/trunk/target/surefire/surefirebooter8965519190576602104.jar
/x1/jenkins/jenkins-slave/workspace/HBase-0.92/trunk/target/surefire/surefire364966466863479062tmp
/x1/jenkins/jenkins-slave/workspace/HBase-0.92/trunk/target/surefire/surefire6205691845698421163tmp
Running org.apache.hadoop.hbase.TestRegionRebalancing
Tests run: 1, Failures: 0, Errors: 0, Skipped: 0, Time elapsed: 47.685 sec
Forking command line: /bin/sh -c cd /x1/jenkins/jenkins-slave/workspace/HBase-0.92/trunk &&
/x1/jenkins/tools/java/jdk1.6.0_27-32/jre/bin/java -enableassertions -Xmx1400m -Djava.security.egd=file:/dev/./urandom
-jar /x1/jenkins/jenkins-slave/workspace/HBase-0.92/trunk/target/surefire/surefirebooter4117096152998929755.jar
/x1/jenkins/jenkins-slave/workspace/HBase-0.92/trunk/target/surefire/surefire6171918036057817937tmp
/x1/jenkins/jenkins-slave/workspace/HBase-0.92/trunk/target/surefire/surefire7104724988002258419tmp
Running org.apache.hadoop.hbase.mapred.TestTableInputFormat
Tests run: 6, Failures: 0, Errors: 0, Skipped: 0, Time elapsed: 27.241 sec
Forking command line: /bin/sh -c cd /x1/jenkins/jenkins-slave/workspace/HBase-0.92/trunk &&
/x1/jenkins/tools/java/jdk1.6.0_27-32/jre/bin/java -enableassertions -Xmx1400m -Djava.security.egd=file:/dev/./urandom
-jar /x1/jenkins/jenkins-slave/workspace/HBase-0.92/trunk/target/surefire/surefirebooter7310354561319554455.jar
/x1/jenkins/jenkins-slave/workspace/HBase-0.92/trunk/target/surefire/surefire6801602163822489896tmp
/x1/jenkins/jenkins-slave/workspace/HBase-0.92/trunk/target/surefire/surefire6901249816329421716tmp
Running org.apache.hadoop.hbase.mapred.TestTableMapReduce
Tests run: 1, Failures: 0, Errors: 0, Skipped: 0, Time elapsed: 72.685 sec
Forking command line: /bin/sh -c cd /x1/jenkins/jenkins-slave/workspace/HBase-0.92/trunk &&
/x1/jenkins/tools/java/jdk1.6.0_27-32/jre/bin/java -enableassertions -Xmx1400m -Djava.security.egd=file:/dev/./urandom
-jar /x1/jenkins/jenkins-slave/workspace/HBase-0.92/trunk/target/surefire/surefirebooter5375145100403243258.jar
/x1/jenkins/jenkins-slave/workspace/HBase-0.92/trunk/target/surefire/surefire6920665136076590920tmp
/x1/jenkins/jenkins-slave/workspace/HBase-0.92/trunk/target/surefire/surefire4175111983255861712tmp
Running org.apache.hadoop.hbase.replication.TestReplicationZookeeper
Tests run: 1, Failures: 0, Errors: 0, Skipped: 0, Time elapsed: 0.576 sec
Forking command line: /bin/sh -c cd /x1/jenkins/jenkins-slave/workspace/HBase-0.92/trunk &&
/x1/jenkins/tools/java/jdk1.6.0_27-32/jre/bin/java -enableassertions -Xmx1400m -Djava.security.egd=file:/dev/./urandom
-jar /x1/jenkins/jenkins-slave/workspace/HBase-0.92/trunk/target/surefire/surefirebooter5746341876182427987.jar
/x1/jenkins/jenkins-slave/workspace/HBase-0.92/trunk/target/surefire/surefire2236939266514948795tmp
/x1/jenkins/jenkins-slave/workspace/HBase-0.92/trunk/target/surefire/surefire4199892138898825753tmp
Running org.apache.hadoop.hbase.replication.regionserver.TestReplicationSink
Tests run: 5, Failures: 0, Errors: 0, Skipped: 0, Time elapsed: 20.879 sec
Forking command line: /bin/sh -c cd /x1/jenkins/jenkins-slave/workspace/HBase-0.92/trunk &&
/x1/jenkins/tools/java/jdk1.6.0_27-32/jre/bin/java -enableassertions -Xmx1400m -Djava.security.egd=file:/dev/./urandom
-jar /x1/jenkins/jenkins-slave/workspace/HBase-0.92/trunk/target/surefire/surefirebooter498163113292636660.jar
/x1/jenkins/jenkins-slave/workspace/HBase-0.92/trunk/target/surefire/surefire5630338987038386100tmp
/x1/jenkins/jenkins-slave/workspace/HBase-0.92/trunk/target/surefire/surefire5116768312339494870tmp
Running org.apache.hadoop.hbase.replication.regionserver.TestReplicationSourceManager
Tests run: 1, Failures: 0, Errors: 0, Skipped: 0, Time elapsed: 1.069 sec
Forking command line: /bin/sh -c cd /x1/jenkins/jenkins-slave/workspace/HBase-0.92/trunk &&
/x1/jenkins/tools/java/jdk1.6.0_27-32/jre/bin/java -enableassertions -Xmx1400m -Djava.security.egd=file:/dev/./urandom
-jar /x1/jenkins/jenkins-slave/workspace/HBase-0.92/trunk/target/surefire/surefirebooter5336743216533281350.jar
/x1/jenkins/jenkins-slave/workspace/HBase-0.92/trunk/target/surefire/surefire3099710950095960247tmp
/x1/jenkins/jenkins-slave/workspace/HBase-0.92/trunk/target/surefire/surefire406463451109533975tmp
Running org.apache.hadoop.hbase.replication.TestReplicationSource
Tests run: 1, Failures: 0, Errors: 0, Skipped: 0, Time elapsed: 2.325 sec
Forking command line: /bin/sh -c cd /x1/jenkins/jenkins-slave/workspace/HBase-0.92/trunk &&
/x1/jenkins/tools/java/jdk1.6.0_27-32/jre/bin/java -enableassertions -Xmx1400m -Djava.security.egd=file:/dev/./urandom
-jar /x1/jenkins/jenkins-slave/workspace/HBase-0.92/trunk/target/surefire/surefirebooter1987041790348009525.jar
/x1/jenkins/jenkins-slave/workspace/HBase-0.92/trunk/target/surefire/surefire670159187468408214tmp
/x1/jenkins/jenkins-slave/workspace/HBase-0.92/trunk/target/surefire/surefire2498010659809619748tmp
Running org.apache.hadoop.hbase.replication.TestReplication
Tests run: 8, Failures: 0, Errors: 0, Skipped: 0, Time elapsed: 113.026 sec
Forking command line: /bin/sh -c cd /x1/jenkins/jenkins-slave/workspace/HBase-0.92/trunk &&
/x1/jenkins/tools/java/jdk1.6.0_27-32/jre/bin/java -enableassertions -Xmx1400m -Djava.security.egd=file:/dev/./urandom
-jar /x1/jenkins/jenkins-slave/workspace/HBase-0.92/trunk/target/surefire/surefirebooter7820737995935501366.jar
/x1/jenkins/jenkins-slave/workspace/HBase-0.92/trunk/target/surefire/surefire7161153821502672142tmp
/x1/jenkins/jenkins-slave/workspace/HBase-0.92/trunk/target/surefire/surefire7367886158002816060tmp
Running org.apache.hadoop.hbase.replication.TestReplicationPeer
Tests run: 1, Failures: 0, Errors: 0, Skipped: 0, Time elapsed: 25.644 sec
Forking command line: /bin/sh -c cd /x1/jenkins/jenkins-slave/workspace/HBase-0.92/trunk &&
/x1/jenkins/tools/java/jdk1.6.0_27-32/jre/bin/java -enableassertions -Xmx1400m -Djava.security.egd=file:/dev/./urandom
-jar /x1/jenkins/jenkins-slave/workspace/HBase-0.92/trunk/target/surefire/surefirebooter6314552293892432109.jar
/x1/jenkins/jenkins-slave/workspace/HBase-0.92/trunk/target/surefire/surefire232695304004332085tmp
/x1/jenkins/jenkins-slave/workspace/HBase-0.92/trunk/target/surefire/surefire4980973543726114150tmp
Running org.apache.hadoop.hbase.replication.TestMultiSlaveReplication
Tests run: 1, Failures: 0, Errors: 0, Skipped: 0, Time elapsed: 53.734 sec
Forking command line: /bin/sh -c cd /x1/jenkins/jenkins-slave/workspace/HBase-0.92/trunk &&
/x1/jenkins/tools/java/jdk1.6.0_27-32/jre/bin/java -enableassertions -Xmx1400m -Djava.security.egd=file:/dev/./urandom
-jar /x1/jenkins/jenkins-slave/workspace/HBase-0.92/trunk/target/surefire/surefirebooter4619903555153570649.jar
/x1/jenkins/jenkins-slave/workspace/HBase-0.92/trunk/target/surefire/surefire2375084198838744952tmp
/x1/jenkins/jenkins-slave/workspace/HBase-0.92/trunk/target/surefire/surefire5969539086039809755tmp
Running org.apache.hadoop.hbase.replication.TestMasterReplication
Tests run: 2, Failures: 0, Errors: 0, Skipped: 0, Time elapsed: 89.913 sec
Forking command line: /bin/sh -c cd /x1/jenkins/jenkins-slave/workspace/HBase-0.92/trunk &&
/x1/jenkins/tools/java/jdk1.6.0_27-32/jre/bin/java -enableassertions -Xmx1400m -Djava.security.egd=file:/dev/./urandom
-jar /x1/jenkins/jenkins-slave/workspace/HBase-0.92/trunk/target/surefire/surefirebooter3950771154478753028.jar
/x1/jenkins/jenkins-slave/workspace/HBase-0.92/trunk/target/surefire/surefire4493790892410559797tmp
/x1/jenkins/jenkins-slave/workspace/HBase-0.92/trunk/target/surefire/surefire3294074707844828651tmp
Running org.apache.hadoop.hbase.util.TestHBaseFsckComparator
Tests run: 6, Failures: 0, Errors: 0, Skipped: 0, Time elapsed: 0.217 sec
Forking command line: /bin/sh -c cd /x1/jenkins/jenkins-slave/workspace/HBase-0.92/trunk &&
/x1/jenkins/tools/java/jdk1.6.0_27-32/jre/bin/java -enableassertions -Xmx1400m -Djava.security.egd=file:/dev/./urandom
-jar /x1/jenkins/jenkins-slave/workspace/HBase-0.92/trunk/target/surefire/surefirebooter3908526596826861041.jar
/x1/jenkins/jenkins-slave/workspace/HBase-0.92/trunk/target/surefire/surefire6717308508570087461tmp
/x1/jenkins/jenkins-slave/workspace/HBase-0.92/trunk/target/surefire/surefire7304506971000984798tmp
Running org.apache.hadoop.hbase.util.TestMergeTool
Tests run: 1, Failures: 0, Errors: 0, Skipped: 0, Time elapsed: 335.713 sec
Forking command line: /bin/sh -c cd /x1/jenkins/jenkins-slave/workspace/HBase-0.92/trunk &&
/x1/jenkins/tools/java/jdk1.6.0_27-32/jre/bin/java -enableassertions -Xmx1400m -Djava.security.egd=file:/dev/./urandom
-jar /x1/jenkins/jenkins-slave/workspace/HBase-0.92/trunk/target/surefire/surefirebooter2973926731438637076.jar
/x1/jenkins/jenkins-slave/workspace/HBase-0.92/trunk/target/surefire/surefire7245273536486507942tmp
/x1/jenkins/jenkins-slave/workspace/HBase-0.92/trunk/target/surefire/surefire8762544444922542884tmp
Running org.apache.hadoop.hbase.util.TestFSTableDescriptors
Tests run: 10, Failures: 0, Errors: 0, Skipped: 0, Time elapsed: 0.895 sec
Forking command line: /bin/sh -c cd /x1/jenkins/jenkins-slave/workspace/HBase-0.92/trunk &&
/x1/jenkins/tools/java/jdk1.6.0_27-32/jre/bin/java -enableassertions -Xmx1400m -Djava.security.egd=file:/dev/./urandom
-jar /x1/jenkins/jenkins-slave/workspace/HBase-0.92/trunk/target/surefire/surefirebooter3127381285732887323.jar
/x1/jenkins/jenkins-slave/workspace/HBase-0.92/trunk/target/surefire/surefire5607671233522726551tmp
/x1/jenkins/jenkins-slave/workspace/HBase-0.92/trunk/target/surefire/surefire4475547054940549685tmp
Running org.apache.hadoop.hbase.util.TestIdLock
Tests run: 1, Failures: 0, Errors: 0, Skipped: 0, Time elapsed: 15.229 sec
Forking command line: /bin/sh -c cd /x1/jenkins/jenkins-slave/workspace/HBase-0.92/trunk &&
/x1/jenkins/tools/java/jdk1.6.0_27-32/jre/bin/java -enableassertions -Xmx1400m -Djava.security.egd=file:/dev/./urandom
-jar /x1/jenkins/jenkins-slave/workspace/HBase-0.92/trunk/target/surefire/surefirebooter3661117854593291445.jar
/x1/jenkins/jenkins-slave/workspace/HBase-0.92/trunk/target/surefire/surefire7490774451229179457tmp
/x1/jenkins/jenkins-slave/workspace/HBase-0.92/trunk/target/surefire/surefire2223561525266658133tmp
Running org.apache.hadoop.hbase.util.TestCompressionTest
Tests run: 1, Failures: 0, Errors: 0, Skipped: 0, Time elapsed: 0.345 sec
Forking command line: /bin/sh -c cd /x1/jenkins/jenkins-slave/workspace/HBase-0.92/trunk &&
/x1/jenkins/tools/java/jdk1.6.0_27-32/jre/bin/java -enableassertions -Xmx1400m -Djava.security.egd=file:/dev/./urandom
-jar /x1/jenkins/jenkins-slave/workspace/HBase-0.92/trunk/target/surefire/surefirebooter1749204626238044644.jar
/x1/jenkins/jenkins-slave/workspace/HBase-0.92/trunk/target/surefire/surefire7748399140239058911tmp
/x1/jenkins/jenkins-slave/workspace/HBase-0.92/trunk/target/surefire/surefire372022618416568073tmp
Running org.apache.hadoop.hbase.util.TestBytes
Tests run: 13, Failures: 0, Errors: 0, Skipped: 0, Time elapsed: 0.136 sec
Forking command line: /bin/sh -c cd /x1/jenkins/jenkins-slave/workspace/HBase-0.92/trunk &&
/x1/jenkins/tools/java/jdk1.6.0_27-32/jre/bin/java -enableassertions -Xmx1400m -Djava.security.egd=file:/dev/./urandom
-jar /x1/jenkins/jenkins-slave/workspace/HBase-0.92/trunk/target/surefire/surefirebooter8462063200403615765.jar
/x1/jenkins/jenkins-slave/workspace/HBase-0.92/trunk/target/surefire/surefire7944677567938420879tmp
/x1/jenkins/jenkins-slave/workspace/HBase-0.92/trunk/target/surefire/surefire8854671603156025032tmp
Running org.apache.hadoop.hbase.util.TestSortedCopyOnWriteSet
Tests run: 2, Failures: 0, Errors: 0, Skipped: 0, Time elapsed: 0.1 sec
Forking command line: /bin/sh -c cd /x1/jenkins/jenkins-slave/workspace/HBase-0.92/trunk &&
/x1/jenkins/tools/java/jdk1.6.0_27-32/jre/bin/java -enableassertions -Xmx1400m -Djava.security.egd=file:/dev/./urandom
-jar /x1/jenkins/jenkins-slave/workspace/HBase-0.92/trunk/target/surefire/surefirebooter5248736841119252698.jar
/x1/jenkins/jenkins-slave/workspace/HBase-0.92/trunk/target/surefire/surefire988880525982933644tmp
/x1/jenkins/jenkins-slave/workspace/HBase-0.92/trunk/target/surefire/surefire1376743436619412782tmp
Running org.apache.hadoop.hbase.util.TestEnvironmentEdgeManager
Tests run: 2, Failures: 0, Errors: 0, Skipped: 0, Time elapsed: 0.217 sec
Forking command line: /bin/sh -c cd /x1/jenkins/jenkins-slave/workspace/HBase-0.92/trunk &&
/x1/jenkins/tools/java/jdk1.6.0_27-32/jre/bin/java -enableassertions -Xmx1400m -Djava.security.egd=file:/dev/./urandom
-jar /x1/jenkins/jenkins-slave/workspace/HBase-0.92/trunk/target/surefire/surefirebooter8882596615335248171.jar
/x1/jenkins/jenkins-slave/workspace/HBase-0.92/trunk/target/surefire/surefire6695490292244712577tmp
/x1/jenkins/jenkins-slave/workspace/HBase-0.92/trunk/target/surefire/surefire2833380746659102873tmp
Running org.apache.hadoop.hbase.util.TestKeying
Tests run: 1, Failures: 0, Errors: 0, Skipped: 0, Time elapsed: 0.043 sec
Forking command line: /bin/sh -c cd /x1/jenkins/jenkins-slave/workspace/HBase-0.92/trunk &&
/x1/jenkins/tools/java/jdk1.6.0_27-32/jre/bin/java -enableassertions -Xmx1400m -Djava.security.egd=file:/dev/./urandom
-jar /x1/jenkins/jenkins-slave/workspace/HBase-0.92/trunk/target/surefire/surefirebooter8519314902770870639.jar
/x1/jenkins/jenkins-slave/workspace/HBase-0.92/trunk/target/surefire/surefire3829142064514202974tmp
/x1/jenkins/jenkins-slave/workspace/HBase-0.92/trunk/target/surefire/surefire2976129798263671673tmp
Running org.apache.hadoop.hbase.util.TestByteBloomFilter
Tests run: 5, Failures: 0, Errors: 0, Skipped: 0, Time elapsed: 0.93 sec
Forking command line: /bin/sh -c cd /x1/jenkins/jenkins-slave/workspace/HBase-0.92/trunk &&
/x1/jenkins/tools/java/jdk1.6.0_27-32/jre/bin/java -enableassertions -Xmx1400m -Djava.security.egd=file:/dev/./urandom
-jar /x1/jenkins/jenkins-slave/workspace/HBase-0.92/trunk/target/surefire/surefirebooter5932176272759842357.jar
/x1/jenkins/jenkins-slave/workspace/HBase-0.92/trunk/target/surefire/surefire7960842510401803658tmp
/x1/jenkins/jenkins-slave/workspace/HBase-0.92/trunk/target/surefire/surefire1801467293365881024tmp
Running org.apache.hadoop.hbase.util.TestRootPath
Tests run: 1, Failures: 0, Errors: 0, Skipped: 0, Time elapsed: 0.116 sec
Forking command line: /bin/sh -c cd /x1/jenkins/jenkins-slave/workspace/HBase-0.92/trunk &&
/x1/jenkins/tools/java/jdk1.6.0_27-32/jre/bin/java -enableassertions -Xmx1400m -Djava.security.egd=file:/dev/./urandom
-jar /x1/jenkins/jenkins-slave/workspace/HBase-0.92/trunk/target/surefire/surefirebooter7166875387531281490.jar
/x1/jenkins/jenkins-slave/workspace/HBase-0.92/trunk/target/surefire/surefire7940579197543217136tmp
/x1/jenkins/jenkins-slave/workspace/HBase-0.92/trunk/target/surefire/surefire6429110835740778987tmp
Running org.apache.hadoop.hbase.util.TestMergeTable
Tests run: 1, Failures: 0, Errors: 0, Skipped: 0, Time elapsed: 31.829 sec
Forking command line: /bin/sh -c cd /x1/jenkins/jenkins-slave/workspace/HBase-0.92/trunk &&
/x1/jenkins/tools/java/jdk1.6.0_27-32/jre/bin/java -enableassertions -Xmx1400m -Djava.security.egd=file:/dev/./urandom
-jar /x1/jenkins/jenkins-slave/workspace/HBase-0.92/trunk/target/surefire/surefirebooter1847277382596410877.jar
/x1/jenkins/jenkins-slave/workspace/HBase-0.92/trunk/target/surefire/surefire2022469260100821147tmp
/x1/jenkins/jenkins-slave/workspace/HBase-0.92/trunk/target/surefire/surefire4479381218216595604tmp
Running org.apache.hadoop.hbase.util.TestHBaseFsck
Tests run: 16, Failures: 0, Errors: 0, Skipped: 0, Time elapsed: 184.564 sec
Forking command line: /bin/sh -c cd /x1/jenkins/jenkins-slave/workspace/HBase-0.92/trunk &&
/x1/jenkins/tools/java/jdk1.6.0_27-32/jre/bin/java -enableassertions -Xmx1400m -Djava.security.egd=file:/dev/./urandom
-jar /x1/jenkins/jenkins-slave/workspace/HBase-0.92/trunk/target/surefire/surefirebooter3570025741259302384.jar
/x1/jenkins/jenkins-slave/workspace/HBase-0.92/trunk/target/surefire/surefire5585316367556052761tmp
/x1/jenkins/jenkins-slave/workspace/HBase-0.92/trunk/target/surefire/surefire5634761631300918702tmp
Running org.apache.hadoop.hbase.util.TestFSUtils
Tests run: 2, Failures: 0, Errors: 0, Skipped: 0, Time elapsed: 18.642 sec
Forking command line: /bin/sh -c cd /x1/jenkins/jenkins-slave/workspace/HBase-0.92/trunk &&
/x1/jenkins/tools/java/jdk1.6.0_27-32/jre/bin/java -enableassertions -Xmx1400m -Djava.security.egd=file:/dev/./urandom
-jar /x1/jenkins/jenkins-slave/workspace/HBase-0.92/trunk/target/surefire/surefirebooter4926925661004980907.jar
/x1/jenkins/jenkins-slave/workspace/HBase-0.92/trunk/target/surefire/surefire1590255562765799149tmp
/x1/jenkins/jenkins-slave/workspace/HBase-0.92/trunk/target/surefire/surefire8935580183537831340tmp
Running org.apache.hadoop.hbase.util.TestPoolMap
Tests run: 9, Failures: 0, Errors: 0, Skipped: 0, Time elapsed: 0.082 sec
Forking command line: /bin/sh -c cd /x1/jenkins/jenkins-slave/workspace/HBase-0.92/trunk &&
/x1/jenkins/tools/java/jdk1.6.0_27-32/jre/bin/java -enableassertions -Xmx1400m -Djava.security.egd=file:/dev/./urandom
-jar /x1/jenkins/jenkins-slave/workspace/HBase-0.92/trunk/target/surefire/surefirebooter8027937455731009298.jar
/x1/jenkins/jenkins-slave/workspace/HBase-0.92/trunk/target/surefire/surefire2618067762147928711tmp
/x1/jenkins/jenkins-slave/workspace/HBase-0.92/trunk/target/surefire/surefire4853282946856402148tmp
Running org.apache.hadoop.hbase.util.TestBase64
Tests run: 1, Failures: 0, Errors: 0, Skipped: 0, Time elapsed: 0.128 sec
Forking command line: /bin/sh -c cd /x1/jenkins/jenkins-slave/workspace/HBase-0.92/trunk &&
/x1/jenkins/tools/java/jdk1.6.0_27-32/jre/bin/java -enableassertions -Xmx1400m -Djava.security.egd=file:/dev/./urandom
-jar /x1/jenkins/jenkins-slave/workspace/HBase-0.92/trunk/target/surefire/surefirebooter2072809238873746205.jar
/x1/jenkins/jenkins-slave/workspace/HBase-0.92/trunk/target/surefire/surefire5539456837616331487tmp
/x1/jenkins/jenkins-slave/workspace/HBase-0.92/trunk/target/surefire/surefire8158724840511408328tmp
Running org.apache.hadoop.hbase.util.hbck.TestOfflineMetaRebuildBase
Tests run: 1, Failures: 0, Errors: 0, Skipped: 0, Time elapsed: 33.485 sec
Forking command line: /bin/sh -c cd /x1/jenkins/jenkins-slave/workspace/HBase-0.92/trunk &&
/x1/jenkins/tools/java/jdk1.6.0_27-32/jre/bin/java -enableassertions -Xmx1400m -Djava.security.egd=file:/dev/./urandom
-jar /x1/jenkins/jenkins-slave/workspace/HBase-0.92/trunk/target/surefire/surefirebooter3675284583652220596.jar
/x1/jenkins/jenkins-slave/workspace/HBase-0.92/trunk/target/surefire/surefire5384330626728839668tmp
/x1/jenkins/jenkins-slave/workspace/HBase-0.92/trunk/target/surefire/surefire482491439357319208tmp
Running org.apache.hadoop.hbase.util.hbck.TestOfflineMetaRebuildOverlap
Tests run: 1, Failures: 0, Errors: 0, Skipped: 0, Time elapsed: 34.713 sec
Forking command line: /bin/sh -c cd /x1/jenkins/jenkins-slave/workspace/HBase-0.92/trunk &&
/x1/jenkins/tools/java/jdk1.6.0_27-32/jre/bin/java -enableassertions -Xmx1400m -Djava.security.egd=file:/dev/./urandom
-jar /x1/jenkins/jenkins-slave/workspace/HBase-0.92/trunk/target/surefire/surefirebooter8825960903962437085.jar
/x1/jenkins/jenkins-slave/workspace/HBase-0.92/trunk/target/surefire/surefire1340124242749440480tmp
/x1/jenkins/jenkins-slave/workspace/HBase-0.92/trunk/target/surefire/surefire8904885361986823202tmp
Running org.apache.hadoop.hbase.util.hbck.TestOfflineMetaRebuildHole
Tests run: 1, Failures: 0, Errors: 0, Skipped: 0, Time elapsed: 32.43 sec
Forking command line: /bin/sh -c cd /x1/jenkins/jenkins-slave/workspace/HBase-0.92/trunk &&
/x1/jenkins/tools/java/jdk1.6.0_27-32/jre/bin/java -enableassertions -Xmx1400m -Djava.security.egd=file:/dev/./urandom
-jar /x1/jenkins/jenkins-slave/workspace/HBase-0.92/trunk/target/surefire/surefirebooter5698207139120989074.jar
/x1/jenkins/jenkins-slave/workspace/HBase-0.92/trunk/target/surefire/surefire309403094143884358tmp
/x1/jenkins/jenkins-slave/workspace/HBase-0.92/trunk/target/surefire/surefire9138012039927311780tmp
Running org.apache.hadoop.hbase.util.TestDefaultEnvironmentEdge
Tests run: 1, Failures: 0, Errors: 0, Skipped: 0, Time elapsed: 0.084 sec
Forking command line: /bin/sh -c cd /x1/jenkins/jenkins-slave/workspace/HBase-0.92/trunk &&
/x1/jenkins/tools/java/jdk1.6.0_27-32/jre/bin/java -enableassertions -Xmx1400m -Djava.security.egd=file:/dev/./urandom
-jar /x1/jenkins/jenkins-slave/workspace/HBase-0.92/trunk/target/surefire/surefirebooter5264009088696047931.jar
/x1/jenkins/jenkins-slave/workspace/HBase-0.92/trunk/target/surefire/surefire803976377756022911tmp
/x1/jenkins/jenkins-slave/workspace/HBase-0.92/trunk/target/surefire/surefire1553363757844787435tmp
Running org.apache.hadoop.hbase.util.TestIncrementingEnvironmentEdge
Tests run: 1, Failures: 0, Errors: 0, Skipped: 0, Time elapsed: 0.084 sec
Forking command line: /bin/sh -c cd /x1/jenkins/jenkins-slave/workspace/HBase-0.92/trunk &&
/x1/jenkins/tools/java/jdk1.6.0_27-32/jre/bin/java -enableassertions -Xmx1400m -Djava.security.egd=file:/dev/./urandom
-jar /x1/jenkins/jenkins-slave/workspace/HBase-0.92/trunk/target/surefire/surefirebooter3397237751719349590.jar
/x1/jenkins/jenkins-slave/workspace/HBase-0.92/trunk/target/surefire/surefire6311159072786988236tmp
/x1/jenkins/jenkins-slave/workspace/HBase-0.92/trunk/target/surefire/surefire7072524691945837855tmp
Running org.apache.hadoop.hbase.util.TestRegionSplitCalculator
Tests run: 15, Failures: 0, Errors: 0, Skipped: 0, Time elapsed: 0.159 sec
Forking command line: /bin/sh -c cd /x1/jenkins/jenkins-slave/workspace/HBase-0.92/trunk &&
/x1/jenkins/tools/java/jdk1.6.0_27-32/jre/bin/java -enableassertions -Xmx1400m -Djava.security.egd=file:/dev/./urandom
-jar /x1/jenkins/jenkins-slave/workspace/HBase-0.92/trunk/target/surefire/surefirebooter5376564749994538963.jar
/x1/jenkins/jenkins-slave/workspace/HBase-0.92/trunk/target/surefire/surefire3117237866657305226tmp
/x1/jenkins/jenkins-slave/workspace/HBase-0.92/trunk/target/surefire/surefire7608013910419427267tmp
Running org.apache.hadoop.hbase.TestHRegionLocation
Tests run: 3, Failures: 0, Errors: 0, Skipped: 0, Time elapsed: 0.146 sec
Forking command line: /bin/sh -c cd /x1/jenkins/jenkins-slave/workspace/HBase-0.92/trunk &&
/x1/jenkins/tools/java/jdk1.6.0_27-32/jre/bin/java -enableassertions -Xmx1400m -Djava.security.egd=file:/dev/./urandom
-jar /x1/jenkins/jenkins-slave/workspace/HBase-0.92/trunk/target/surefire/surefirebooter27705469781728922.jar
/x1/jenkins/jenkins-slave/workspace/HBase-0.92/trunk/target/surefire/surefire7220789795653623855tmp
/x1/jenkins/jenkins-slave/workspace/HBase-0.92/trunk/target/surefire/surefire1886073897698462263tmp
Running org.apache.hadoop.hbase.migration.TestMigrationFrom090To092
Tests run: 1, Failures: 0, Errors: 0, Skipped: 0, Time elapsed: 0.241 sec
Forking command line: /bin/sh -c cd /x1/jenkins/jenkins-slave/workspace/HBase-0.92/trunk &&
/x1/jenkins/tools/java/jdk1.6.0_27-32/jre/bin/java -enableassertions -Xmx1400m -Djava.security.egd=file:/dev/./urandom
-jar /x1/jenkins/jenkins-slave/workspace/HBase-0.92/trunk/target/surefire/surefirebooter5429127625712916543.jar
/x1/jenkins/jenkins-slave/workspace/HBase-0.92/trunk/target/surefire/surefire3609219219257044631tmp
/x1/jenkins/jenkins-slave/workspace/HBase-0.92/trunk/target/surefire/surefire2480981495712564383tmp
Running org.apache.hadoop.hbase.TestCompare
Tests run: 1, Failures: 0, Errors: 0, Skipped: 0, Time elapsed: 0.221 sec
Forking command line: /bin/sh -c cd /x1/jenkins/jenkins-slave/workspace/HBase-0.92/trunk &&
/x1/jenkins/tools/java/jdk1.6.0_27-32/jre/bin/java -enableassertions -Xmx1400m -Djava.security.egd=file:/dev/./urandom
-jar /x1/jenkins/jenkins-slave/workspace/HBase-0.92/trunk/target/surefire/surefirebooter446326401787210630.jar
/x1/jenkins/jenkins-slave/workspace/HBase-0.92/trunk/target/surefire/surefire8751570156375636044tmp
/x1/jenkins/jenkins-slave/workspace/HBase-0.92/trunk/target/surefire/surefire2232104652513656981tmp
Running org.apache.hadoop.hbase.TestInfoServers
Tests run: 2, Failures: 0, Errors: 0, Skipped: 0, Time elapsed: 17.699 sec
Forking command line: /bin/sh -c cd /x1/jenkins/jenkins-slave/workspace/HBase-0.92/trunk &&
/x1/jenkins/tools/java/jdk1.6.0_27-32/jre/bin/java -enableassertions -Xmx1400m -Djava.security.egd=file:/dev/./urandom
-jar /x1/jenkins/jenkins-slave/workspace/HBase-0.92/trunk/target/surefire/surefirebooter935406993205504777.jar
/x1/jenkins/jenkins-slave/workspace/HBase-0.92/trunk/target/surefire/surefire9112193137233544962tmp
/x1/jenkins/jenkins-slave/workspace/HBase-0.92/trunk/target/surefire/surefire5532159455593161589tmp
Running org.apache.hadoop.hbase.TestHServerAddress
Tests run: 6, Failures: 0, Errors: 0, Skipped: 0, Time elapsed: 0.099 sec
Forking command line: /bin/sh -c cd /x1/jenkins/jenkins-slave/workspace/HBase-0.92/trunk &&
/x1/jenkins/tools/java/jdk1.6.0_27-32/jre/bin/java -enableassertions -Xmx1400m -Djava.security.egd=file:/dev/./urandom
-jar /x1/jenkins/jenkins-slave/workspace/HBase-0.92/trunk/target/surefire/surefirebooter6656329136023041228.jar
/x1/jenkins/jenkins-slave/workspace/HBase-0.92/trunk/target/surefire/surefire7399407332968101270tmp
/x1/jenkins/jenkins-slave/workspace/HBase-0.92/trunk/target/surefire/surefire4386560090782606321tmp
Running org.apache.hadoop.hbase.TestServerName
Tests run: 4, Failures: 0, Errors: 0, Skipped: 0, Time elapsed: 0.164 sec

Results :

Tests in error: 
  testTableOperations(org.apache.hadoop.hbase.coprocessor.TestMasterObserver): org.apache.hadoop.hbase.InvalidFamilyOperationException:
Column family 'fam2' does not exist
  testRegionTransitionOperations(org.apache.hadoop.hbase.coprocessor.TestMasterObserver):
org.apache.hadoop.hbase.TableExistsException: observed_table

Tests run: 1104, Failures: 0, Errors: 2, Skipped: 8

[INFO] ------------------------------------------------------------------------
[INFO] BUILD FAILURE
[INFO] ------------------------------------------------------------------------
[INFO] Total time: 2:20:19.509s
[INFO] Finished at: Sun Apr 15 11:36:54 UTC 2012
[INFO] Final Memory: 52M/726M
[INFO] ------------------------------------------------------------------------
[ERROR] Failed to execute goal org.apache.maven.plugins:maven-surefire-plugin:2.10:test (default-test)
on project hbase: Failure or timeout -> [Help 1]
org.apache.maven.lifecycle.LifecycleExecutionException: Failed to execute goal org.apache.maven.plugins:maven-surefire-plugin:2.10:test
(default-test) on project hbase: Failure or timeout
	at org.apache.maven.lifecycle.internal.MojoExecutor.execute(MojoExecutor.java:217)
	at org.apache.maven.lifecycle.internal.MojoExecutor.execute(MojoExecutor.java:153)
	at org.apache.maven.lifecycle.internal.MojoExecutor.execute(MojoExecutor.java:145)
	at org.apache.maven.lifecycle.internal.LifecycleModuleBuilder.buildProject(LifecycleModuleBuilder.java:84)
	at org.apache.maven.lifecycle.internal.LifecycleModuleBuilder.buildProject(LifecycleModuleBuilder.java:59)
	at org.apache.maven.lifecycle.internal.LifecycleStarter.singleThreadedBuild(LifecycleStarter.java:183)
	at org.apache.maven.lifecycle.internal.LifecycleStarter.execute(LifecycleStarter.java:161)
	at org.apache.maven.DefaultMaven.doExecute(DefaultMaven.java:319)
	at org.apache.maven.DefaultMaven.execute(DefaultMaven.java:156)
	at org.apache.maven.cli.MavenCli.execute(MavenCli.java:537)
	at org.apache.maven.cli.MavenCli.doMain(MavenCli.java:196)
	at org.apache.maven.cli.MavenCli.main(MavenCli.java:141)
	at sun.reflect.NativeMethodAccessorImpl.invoke0(Native Method)
	at sun.reflect.NativeMethodAccessorImpl.invoke(NativeMethodAccessorImpl.java:39)
	at sun.reflect.DelegatingMethodAccessorImpl.invoke(DelegatingMethodAccessorImpl.java:25)
	at java.lang.reflect.Method.invoke(Method.java:597)
	at org.codehaus.plexus.classworlds.launcher.Launcher.launchEnhanced(Launcher.java:290)
	at org.codehaus.plexus.classworlds.launcher.Launcher.launch(Launcher.java:230)
	at org.codehaus.plexus.classworlds.launcher.Launcher.mainWithExitCode(Launcher.java:409)
	at org.codehaus.plexus.classworlds.launcher.Launcher.main(Launcher.java:352)
Caused by: org.apache.maven.plugin.MojoExecutionException: Failure or timeout
	at org.apache.maven.plugin.surefire.SurefirePlugin.assertNoFailureOrTimeout(SurefirePlugin.java:633)
	at org.apache.maven.plugin.surefire.SurefirePlugin.handleSummary(SurefirePlugin.java:614)
	at org.apache.maven.plugin.surefire.AbstractSurefireMojo.executeAfterPreconditionsChecked(AbstractSurefireMojo.java:137)
	at org.apache.maven.plugin.surefire.AbstractSurefireMojo.execute(AbstractSurefireMojo.java:98)
	at org.apache.maven.plugin.DefaultBuildPluginManager.executeMojo(DefaultBuildPluginManager.java:101)
	at org.apache.maven.lifecycle.internal.MojoExecutor.execute(MojoExecutor.java:209)
	... 19 more
[ERROR] 
[ERROR] 
[ERROR] For more information about the errors and possible solutions, please read the following
articles:
[ERROR] [Help 1] http://cwiki.apache.org/confluence/display/MAVEN/MojoExecutionException
Build step 'Invoke top-level Maven targets' marked build as failure
Archiving artifacts
Updating HBASE-5781
Recording test results

Mime
View raw message