hbase-dev mailing list archives

Site index · List index
Message view « Date » · « Thread »
Top « Date » · « Thread »
From Apache Jenkins Server <jenk...@builds.apache.org>
Subject Build failed in Jenkins: HBase-0.92 #356
Date Thu, 05 Apr 2012 21:43:20 GMT
See <https://builds.apache.org/job/HBase-0.92/356/changes>

Changes:

[stack] HBASE-5724 Row cache of KeyValue should be cleared in readFields()

[stack] HBASE-5711 Tests are failing with incorrect data directory permissions.

------------------------------------------
[...truncated 6083 lines...]
, env.JENKINS_URL=https://builds.apache.org/, java.vm.name=Java HotSpot(TM) Server VM, stax-api.version=1.0.1,
env.SVN_URL=https://svn.apache.org/repos/asf/hbase/branches/0.92, hadoop-snappy.version=0.0.1-SNAPSHOT,
jackson.version=1.5.5, file.encoding=ANSI_X3.4-1968, env.MAIL=/var/mail/jenkins, env.WORKSPACE=<https://builds.apache.org/job/HBase-0.92/ws/,>
avro.version=1.5.3, final.name=hbase-0.92.2-SNAPSHOT, zookeeper.version=3.4.3, java.specification.version=1.6,
junit.version=4.10, env.NODE_LABELS=Ubuntu ubuntu ubuntu1}
[INFO] Using 'UTF-8' encoding to copy filtered resources.
[DEBUG] resource with targetPath null
directory <https://builds.apache.org/job/HBase-0.92/ws/trunk/src/test/resources>
excludes [hbase-site.xml]
includes []
[INFO] Copying 4 resources
[DEBUG] file log4j.properties has a filtered file extension
[DEBUG] copy <https://builds.apache.org/job/HBase-0.92/ws/trunk/src/test/resources/log4j.properties>
to <https://builds.apache.org/job/HBase-0.92/ws/trunk/target/test-classes/log4j.properties>
[DEBUG] file mapred-queues.xml has a filtered file extension
[DEBUG] copy <https://builds.apache.org/job/HBase-0.92/ws/trunk/src/test/resources/mapred-queues.xml>
to <https://builds.apache.org/job/HBase-0.92/ws/trunk/target/test-classes/mapred-queues.xml>
[DEBUG] file PerformanceEvaluation_Counter.properties has a filtered file extension
[DEBUG] copy <https://builds.apache.org/job/HBase-0.92/ws/trunk/src/test/resources/org/apache/hadoop/hbase/PerformanceEvaluation_Counter.properties>
to <https://builds.apache.org/job/HBase-0.92/ws/trunk/target/test-classes/org/apache/hadoop/hbase/PerformanceEvaluation_Counter.properties>
[DEBUG] file 8e8ab58dcf39412da19833fcd8f687ac has a filtered file extension
[DEBUG] copy <https://builds.apache.org/job/HBase-0.92/ws/trunk/src/test/resources/org/apache/hadoop/hbase/io/hfile/8e8ab58dcf39412da19833fcd8f687ac>
to <https://builds.apache.org/job/HBase-0.92/ws/trunk/target/test-classes/org/apache/hadoop/hbase/io/hfile/8e8ab58dcf39412da19833fcd8f687ac>
[DEBUG] resource with targetPath null
directory <https://builds.apache.org/job/HBase-0.92/ws/trunk/target/maven-shared-archive-resources>
excludes []
includes []
[INFO] Copying 3 resources
[DEBUG] file LICENSE has a filtered file extension
[DEBUG] copy <https://builds.apache.org/job/HBase-0.92/ws/trunk/target/maven-shared-archive-resources/META-INF/LICENSE>
to <https://builds.apache.org/job/HBase-0.92/ws/trunk/target/test-classes/META-INF/LICENSE>
[DEBUG] file NOTICE has a filtered file extension
[DEBUG] copy <https://builds.apache.org/job/HBase-0.92/ws/trunk/target/maven-shared-archive-resources/META-INF/NOTICE>
to <https://builds.apache.org/job/HBase-0.92/ws/trunk/target/test-classes/META-INF/NOTICE>
[DEBUG] file DEPENDENCIES has a filtered file extension
[DEBUG] copy <https://builds.apache.org/job/HBase-0.92/ws/trunk/target/maven-shared-archive-resources/META-INF/DEPENDENCIES>
to <https://builds.apache.org/job/HBase-0.92/ws/trunk/target/test-classes/META-INF/DEPENDENCIES>
[DEBUG] resource with targetPath null
directory <https://builds.apache.org/job/HBase-0.92/ws/trunk/src/test/resources>
excludes []
includes [hbase-site.xml]
[INFO] Copying 1 resource
[DEBUG] file hbase-site.xml has a filtered file extension
[DEBUG] copy <https://builds.apache.org/job/HBase-0.92/ws/trunk/src/test/resources/hbase-site.xml>
to <https://builds.apache.org/job/HBase-0.92/ws/trunk/target/test-classes/hbase-site.xml>
[INFO] 
[INFO] --- maven-compiler-plugin:2.0.2:testCompile (default-testCompile) @ hbase ---
[DEBUG] Configuring mojo org.apache.maven.plugins:maven-compiler-plugin:2.0.2:testCompile
from plugin realm ClassRealm[plugin>org.apache.maven.plugins:maven-compiler-plugin:2.0.2,
parent: sun.misc.Launcher$AppClassLoader@192d342]
[DEBUG] Configuring mojo 'org.apache.maven.plugins:maven-compiler-plugin:2.0.2:testCompile'
with basic configurator -->
[DEBUG]   (f) basedir = <https://builds.apache.org/job/HBase-0.92/ws/trunk>
[DEBUG]   (f) buildDirectory = <https://builds.apache.org/job/HBase-0.92/ws/trunk/target>
[DEBUG]   (f) classpathElements = [<https://builds.apache.org/job/HBase-0.92/ws/trunk/target/test-classes,>
<https://builds.apache.org/job/HBase-0.92/ws/trunk/target/classes,> /home/jenkins/.m2/repository/com/google/guava/guava/r09/guava-r09.jar,
/home/jenkins/.m2/repository/commons-cli/commons-cli/1.2/commons-cli-1.2.jar, /home/jenkins/.m2/repository/commons-configuration/commons-configuration/1.6/commons-configuration-1.6.jar,
/home/jenkins/.m2/repository/commons-collections/commons-collections/3.2.1/commons-collections-3.2.1.jar,
/home/jenkins/.m2/repository/commons-digester/commons-digester/1.8/commons-digester-1.8.jar,
/home/jenkins/.m2/repository/commons-beanutils/commons-beanutils/1.7.0/commons-beanutils-1.7.0.jar,
/home/jenkins/.m2/repository/commons-beanutils/commons-beanutils-core/1.8.0/commons-beanutils-core-1.8.0.jar,
/home/jenkins/.m2/repository/com/github/stephenc/high-scale-lib/high-scale-lib/1.1.1/high-scale-lib-1.1.1.jar,
/home/jenkins/.m2/repository/commons-codec/commons-codec/1.4/commons-codec-1.4.jar, /home/jenkins/.m2/repository/commons-httpclient/commons-httpclient/3.1/commons-httpclient-3.1.jar,
/home/jenkins/.m2/repository/commons-lang/commons-lang/2.5/commons-lang-2.5.jar, /home/jenkins/.m2/repository/commons-logging/commons-logging/1.1.1/commons-logging-1.1.1.jar,
/home/jenkins/.m2/repository/log4j/log4j/1.2.16/log4j-1.2.16.jar, /home/jenkins/.m2/repository/org/apache/avro/avro/1.5.3/avro-1.5.3.jar,
/home/jenkins/.m2/repository/org/xerial/snappy/snappy-java/1.0.3.2/snappy-java-1.0.3.2.jar,
/home/jenkins/.m2/repository/org/apache/avro/avro-ipc/1.5.3/avro-ipc-1.5.3.jar, /home/jenkins/.m2/repository/org/jboss/netty/netty/3.2.4.Final/netty-3.2.4.Final.jar,
/home/jenkins/.m2/repository/org/apache/velocity/velocity/1.7/velocity-1.7.jar, /home/jenkins/.m2/repository/org/apache/zookeeper/zookeeper/3.4.3/zookeeper-3.4.3.jar,
/home/jenkins/.m2/repository/org/apache/thrift/libthrift/0.7.0/libthrift-0.7.0.jar, /home/jenkins/.m2/repository/javax/servlet/servlet-api/2.5/servlet-api-2.5.jar,
/home/jenkins/.m2/repository/org/apache/httpcomponents/httpclient/4.0.1/httpclient-4.0.1.jar,
/home/jenkins/.m2/repository/org/apache/httpcomponents/httpcore/4.0.1/httpcore-4.0.1.jar,
/home/jenkins/.m2/repository/org/jruby/jruby-complete/1.6.5/jruby-complete-1.6.5.jar, /home/jenkins/.m2/repository/org/mortbay/jetty/jetty/6.1.26/jetty-6.1.26.jar,
/home/jenkins/.m2/repository/org/mortbay/jetty/jetty-util/6.1.26/jetty-util-6.1.26.jar, /home/jenkins/.m2/repository/org/mortbay/jetty/jsp-2.1/6.1.14/jsp-2.1-6.1.14.jar,
/home/jenkins/.m2/repository/org/eclipse/jdt/core/3.1.1/core-3.1.1.jar, /home/jenkins/.m2/repository/org/mortbay/jetty/jsp-api-2.1/6.1.14/jsp-api-2.1-6.1.14.jar,
/home/jenkins/.m2/repository/org/mortbay/jetty/servlet-api-2.5/6.1.14/servlet-api-2.5-6.1.14.jar,
/home/jenkins/.m2/repository/org/codehaus/jackson/jackson-core-asl/1.5.5/jackson-core-asl-1.5.5.jar,
/home/jenkins/.m2/repository/org/codehaus/jackson/jackson-mapper-asl/1.5.5/jackson-mapper-asl-1.5.5.jar,
/home/jenkins/.m2/repository/org/codehaus/jackson/jackson-jaxrs/1.5.5/jackson-jaxrs-1.5.5.jar,
/home/jenkins/.m2/repository/org/codehaus/jackson/jackson-xc/1.5.5/jackson-xc-1.5.5.jar, /home/jenkins/.m2/repository/org/slf4j/slf4j-api/1.5.8/slf4j-api-1.5.8.jar,
/home/jenkins/.m2/repository/org/slf4j/slf4j-log4j12/1.5.8/slf4j-log4j12-1.5.8.jar, /home/jenkins/.m2/repository/tomcat/jasper-compiler/5.5.23/jasper-compiler-5.5.23.jar,
/home/jenkins/.m2/repository/tomcat/jasper-runtime/5.5.23/jasper-runtime-5.5.23.jar, /home/jenkins/.m2/repository/commons-el/commons-el/1.0/commons-el-1.0.jar,
/home/jenkins/.m2/repository/org/jamon/jamon-runtime/2.3.1/jamon-runtime-2.3.1.jar, /home/jenkins/.m2/repository/com/google/protobuf/protobuf-java/2.4.0a/protobuf-java-2.4.0a.jar,
/home/jenkins/.m2/repository/com/sun/jersey/jersey-core/1.4/jersey-core-1.4.jar, /home/jenkins/.m2/repository/com/sun/jersey/jersey-json/1.4/jersey-json-1.4.jar,
/home/jenkins/.m2/repository/org/codehaus/jettison/jettison/1.1/jettison-1.1.jar, /home/jenkins/.m2/repository/com/sun/xml/bind/jaxb-impl/2.1.12/jaxb-impl-2.1.12.jar,
/home/jenkins/.m2/repository/com/sun/jersey/jersey-server/1.4/jersey-server-1.4.jar, /home/jenkins/.m2/repository/asm/asm/3.1/asm-3.1.jar,
/home/jenkins/.m2/repository/javax/xml/bind/jaxb-api/2.1/jaxb-api-2.1.jar, /home/jenkins/.m2/repository/javax/activation/activation/1.1/activation-1.1.jar,
/home/jenkins/.m2/repository/stax/stax-api/1.0.1/stax-api-1.0.1.jar, /home/jenkins/.m2/repository/junit/junit/4.10/junit-4.10.jar,
/home/jenkins/.m2/repository/org/hamcrest/hamcrest-core/1.1/hamcrest-core-1.1.jar, /home/jenkins/.m2/repository/org/mockito/mockito-all/1.8.5/mockito-all-1.8.5.jar,
/home/jenkins/.m2/repository/org/apache/commons/commons-math/2.1/commons-math-2.1.jar, /home/jenkins/.m2/repository/org/apache/hadoop/hadoop-core/1.0.0/hadoop-core-1.0.0.jar,
/home/jenkins/.m2/repository/xmlenc/xmlenc/0.52/xmlenc-0.52.jar, /home/jenkins/.m2/repository/commons-net/commons-net/1.4.1/commons-net-1.4.1.jar,
/home/jenkins/.m2/repository/org/apache/hadoop/hadoop-test/1.0.0/hadoop-test-1.0.0.jar, /home/jenkins/.m2/repository/org/apache/ftpserver/ftplet-api/1.0.0/ftplet-api-1.0.0.jar,
/home/jenkins/.m2/repository/org/apache/mina/mina-core/2.0.0-M5/mina-core-2.0.0-M5.jar, /home/jenkins/.m2/repository/org/apache/ftpserver/ftpserver-core/1.0.0/ftpserver-core-1.0.0.jar,
/home/jenkins/.m2/repository/org/apache/ftpserver/ftpserver-deprecated/1.0.0-M2/ftpserver-deprecated-1.0.0-M2.jar]
[DEBUG]   (f) compileSourceRoots = [<https://builds.apache.org/job/HBase-0.92/ws/trunk/src/test/java]>
[DEBUG]   (f) compilerId = javac
[DEBUG]   (f) debug = true
[DEBUG]   (f) encoding = UTF-8
[DEBUG]   (f) failOnError = true
[DEBUG]   (f) fork = false
[DEBUG]   (f) optimize = false
[DEBUG]   (f) outputDirectory = <https://builds.apache.org/job/HBase-0.92/ws/trunk/target/test-classes>
[DEBUG]   (f) outputFileName = hbase-0.92.2-SNAPSHOT
[DEBUG]   (f) showDeprecation = false
[DEBUG]   (f) showWarnings = true
[DEBUG]   (f) source = 1.6
[DEBUG]   (f) staleMillis = 0
[DEBUG]   (f) target = 1.6
[DEBUG]   (f) verbose = false
[DEBUG] -- end configuration --
[DEBUG] Using compiler 'javac'.
[DEBUG] Source directories: [<https://builds.apache.org/job/HBase-0.92/ws/trunk/src/test/java]>
[DEBUG] Classpath: [<https://builds.apache.org/job/HBase-0.92/ws/trunk/target/test-classes>
 <https://builds.apache.org/job/HBase-0.92/ws/trunk/target/classes>
 /home/jenkins/.m2/repository/com/google/guava/guava/r09/guava-r09.jar
 /home/jenkins/.m2/repository/commons-cli/commons-cli/1.2/commons-cli-1.2.jar
 /home/jenkins/.m2/repository/commons-configuration/commons-configuration/1.6/commons-configuration-1.6.jar
 /home/jenkins/.m2/repository/commons-collections/commons-collections/3.2.1/commons-collections-3.2.1.jar
 /home/jenkins/.m2/repository/commons-digester/commons-digester/1.8/commons-digester-1.8.jar
 /home/jenkins/.m2/repository/commons-beanutils/commons-beanutils/1.7.0/commons-beanutils-1.7.0.jar
 /home/jenkins/.m2/repository/commons-beanutils/commons-beanutils-core/1.8.0/commons-beanutils-core-1.8.0.jar
 /home/jenkins/.m2/repository/com/github/stephenc/high-scale-lib/high-scale-lib/1.1.1/high-scale-lib-1.1.1.jar
 /home/jenkins/.m2/repository/commons-codec/commons-codec/1.4/commons-codec-1.4.jar
 /home/jenkins/.m2/repository/commons-httpclient/commons-httpclient/3.1/commons-httpclient-3.1.jar
 /home/jenkins/.m2/repository/commons-lang/commons-lang/2.5/commons-lang-2.5.jar
 /home/jenkins/.m2/repository/commons-logging/commons-logging/1.1.1/commons-logging-1.1.1.jar
 /home/jenkins/.m2/repository/log4j/log4j/1.2.16/log4j-1.2.16.jar
 /home/jenkins/.m2/repository/org/apache/avro/avro/1.5.3/avro-1.5.3.jar
 /home/jenkins/.m2/repository/org/xerial/snappy/snappy-java/1.0.3.2/snappy-java-1.0.3.2.jar
 /home/jenkins/.m2/repository/org/apache/avro/avro-ipc/1.5.3/avro-ipc-1.5.3.jar
 /home/jenkins/.m2/repository/org/jboss/netty/netty/3.2.4.Final/netty-3.2.4.Final.jar
 /home/jenkins/.m2/repository/org/apache/velocity/velocity/1.7/velocity-1.7.jar
 /home/jenkins/.m2/repository/org/apache/zookeeper/zookeeper/3.4.3/zookeeper-3.4.3.jar
 /home/jenkins/.m2/repository/org/apache/thrift/libthrift/0.7.0/libthrift-0.7.0.jar
 /home/jenkins/.m2/repository/javax/servlet/servlet-api/2.5/servlet-api-2.5.jar
 /home/jenkins/.m2/repository/org/apache/httpcomponents/httpclient/4.0.1/httpclient-4.0.1.jar
 /home/jenkins/.m2/repository/org/apache/httpcomponents/httpcore/4.0.1/httpcore-4.0.1.jar
 /home/jenkins/.m2/repository/org/jruby/jruby-complete/1.6.5/jruby-complete-1.6.5.jar
 /home/jenkins/.m2/repository/org/mortbay/jetty/jetty/6.1.26/jetty-6.1.26.jar
 /home/jenkins/.m2/repository/org/mortbay/jetty/jetty-util/6.1.26/jetty-util-6.1.26.jar
 /home/jenkins/.m2/repository/org/mortbay/jetty/jsp-2.1/6.1.14/jsp-2.1-6.1.14.jar
 /home/jenkins/.m2/repository/org/eclipse/jdt/core/3.1.1/core-3.1.1.jar
 /home/jenkins/.m2/repository/org/mortbay/jetty/jsp-api-2.1/6.1.14/jsp-api-2.1-6.1.14.jar
 /home/jenkins/.m2/repository/org/mortbay/jetty/servlet-api-2.5/6.1.14/servlet-api-2.5-6.1.14.jar
 /home/jenkins/.m2/repository/org/codehaus/jackson/jackson-core-asl/1.5.5/jackson-core-asl-1.5.5.jar
 /home/jenkins/.m2/repository/org/codehaus/jackson/jackson-mapper-asl/1.5.5/jackson-mapper-asl-1.5.5.jar
 /home/jenkins/.m2/repository/org/codehaus/jackson/jackson-jaxrs/1.5.5/jackson-jaxrs-1.5.5.jar
 /home/jenkins/.m2/repository/org/codehaus/jackson/jackson-xc/1.5.5/jackson-xc-1.5.5.jar
 /home/jenkins/.m2/repository/org/slf4j/slf4j-api/1.5.8/slf4j-api-1.5.8.jar
 /home/jenkins/.m2/repository/org/slf4j/slf4j-log4j12/1.5.8/slf4j-log4j12-1.5.8.jar
 /home/jenkins/.m2/repository/tomcat/jasper-compiler/5.5.23/jasper-compiler-5.5.23.jar
 /home/jenkins/.m2/repository/tomcat/jasper-runtime/5.5.23/jasper-runtime-5.5.23.jar
 /home/jenkins/.m2/repository/commons-el/commons-el/1.0/commons-el-1.0.jar
 /home/jenkins/.m2/repository/org/jamon/jamon-runtime/2.3.1/jamon-runtime-2.3.1.jar
 /home/jenkins/.m2/repository/com/google/protobuf/protobuf-java/2.4.0a/protobuf-java-2.4.0a.jar
 /home/jenkins/.m2/repository/com/sun/jersey/jersey-core/1.4/jersey-core-1.4.jar
 /home/jenkins/.m2/repository/com/sun/jersey/jersey-json/1.4/jersey-json-1.4.jar
 /home/jenkins/.m2/repository/org/codehaus/jettison/jettison/1.1/jettison-1.1.jar
 /home/jenkins/.m2/repository/com/sun/xml/bind/jaxb-impl/2.1.12/jaxb-impl-2.1.12.jar
 /home/jenkins/.m2/repository/com/sun/jersey/jersey-server/1.4/jersey-server-1.4.jar
 /home/jenkins/.m2/repository/asm/asm/3.1/asm-3.1.jar
 /home/jenkins/.m2/repository/javax/xml/bind/jaxb-api/2.1/jaxb-api-2.1.jar
 /home/jenkins/.m2/repository/javax/activation/activation/1.1/activation-1.1.jar
 /home/jenkins/.m2/repository/stax/stax-api/1.0.1/stax-api-1.0.1.jar
 /home/jenkins/.m2/repository/junit/junit/4.10/junit-4.10.jar
 /home/jenkins/.m2/repository/org/hamcrest/hamcrest-core/1.1/hamcrest-core-1.1.jar
 /home/jenkins/.m2/repository/org/mockito/mockito-all/1.8.5/mockito-all-1.8.5.jar
 /home/jenkins/.m2/repository/org/apache/commons/commons-math/2.1/commons-math-2.1.jar
 /home/jenkins/.m2/repository/org/apache/hadoop/hadoop-core/1.0.0/hadoop-core-1.0.0.jar
 /home/jenkins/.m2/repository/xmlenc/xmlenc/0.52/xmlenc-0.52.jar
 /home/jenkins/.m2/repository/commons-net/commons-net/1.4.1/commons-net-1.4.1.jar
 /home/jenkins/.m2/repository/org/apache/hadoop/hadoop-test/1.0.0/hadoop-test-1.0.0.jar
 /home/jenkins/.m2/repository/org/apache/ftpserver/ftplet-api/1.0.0/ftplet-api-1.0.0.jar
 /home/jenkins/.m2/repository/org/apache/mina/mina-core/2.0.0-M5/mina-core-2.0.0-M5.jar
 /home/jenkins/.m2/repository/org/apache/ftpserver/ftpserver-core/1.0.0/ftpserver-core-1.0.0.jar
 /home/jenkins/.m2/repository/org/apache/ftpserver/ftpserver-deprecated/1.0.0-M2/ftpserver-deprecated-1.0.0-M2.jar]
[DEBUG] Output directory: <https://builds.apache.org/job/HBase-0.92/ws/trunk/target/test-classes>
[DEBUG] Classpath:
[DEBUG]  <https://builds.apache.org/job/HBase-0.92/ws/trunk/target/test-classes>
[DEBUG]  <https://builds.apache.org/job/HBase-0.92/ws/trunk/target/classes>
[DEBUG]  /home/jenkins/.m2/repository/com/google/guava/guava/r09/guava-r09.jar
[DEBUG]  /home/jenkins/.m2/repository/commons-cli/commons-cli/1.2/commons-cli-1.2.jar
[DEBUG]  /home/jenkins/.m2/repository/commons-configuration/commons-configuration/1.6/commons-configuration-1.6.jar
[DEBUG]  /home/jenkins/.m2/repository/commons-collections/commons-collections/3.2.1/commons-collections-3.2.1.jar
[DEBUG]  /home/jenkins/.m2/repository/commons-digester/commons-digester/1.8/commons-digester-1.8.jar
[DEBUG]  /home/jenkins/.m2/repository/commons-beanutils/commons-beanutils/1.7.0/commons-beanutils-1.7.0.jar
[DEBUG]  /home/jenkins/.m2/repository/commons-beanutils/commons-beanutils-core/1.8.0/commons-beanutils-core-1.8.0.jar
[DEBUG]  /home/jenkins/.m2/repository/com/github/stephenc/high-scale-lib/high-scale-lib/1.1.1/high-scale-lib-1.1.1.jar
[DEBUG]  /home/jenkins/.m2/repository/commons-codec/commons-codec/1.4/commons-codec-1.4.jar
[DEBUG]  /home/jenkins/.m2/repository/commons-httpclient/commons-httpclient/3.1/commons-httpclient-3.1.jar
[DEBUG]  /home/jenkins/.m2/repository/commons-lang/commons-lang/2.5/commons-lang-2.5.jar
[DEBUG]  /home/jenkins/.m2/repository/commons-logging/commons-logging/1.1.1/commons-logging-1.1.1.jar
[DEBUG]  /home/jenkins/.m2/repository/log4j/log4j/1.2.16/log4j-1.2.16.jar
[DEBUG]  /home/jenkins/.m2/repository/org/apache/avro/avro/1.5.3/avro-1.5.3.jar
[DEBUG]  /home/jenkins/.m2/repository/org/xerial/snappy/snappy-java/1.0.3.2/snappy-java-1.0.3.2.jar
[DEBUG]  /home/jenkins/.m2/repository/org/apache/avro/avro-ipc/1.5.3/avro-ipc-1.5.3.jar
[DEBUG]  /home/jenkins/.m2/repository/org/jboss/netty/netty/3.2.4.Final/netty-3.2.4.Final.jar
[DEBUG]  /home/jenkins/.m2/repository/org/apache/velocity/velocity/1.7/velocity-1.7.jar
[DEBUG]  /home/jenkins/.m2/repository/org/apache/zookeeper/zookeeper/3.4.3/zookeeper-3.4.3.jar
[DEBUG]  /home/jenkins/.m2/repository/org/apache/thrift/libthrift/0.7.0/libthrift-0.7.0.jar
[DEBUG]  /home/jenkins/.m2/repository/javax/servlet/servlet-api/2.5/servlet-api-2.5.jar
[DEBUG]  /home/jenkins/.m2/repository/org/apache/httpcomponents/httpclient/4.0.1/httpclient-4.0.1.jar
[DEBUG]  /home/jenkins/.m2/repository/org/apache/httpcomponents/httpcore/4.0.1/httpcore-4.0.1.jar
[DEBUG]  /home/jenkins/.m2/repository/org/jruby/jruby-complete/1.6.5/jruby-complete-1.6.5.jar
[DEBUG]  /home/jenkins/.m2/repository/org/mortbay/jetty/jetty/6.1.26/jetty-6.1.26.jar
[DEBUG]  /home/jenkins/.m2/repository/org/mortbay/jetty/jetty-util/6.1.26/jetty-util-6.1.26.jar
[DEBUG]  /home/jenkins/.m2/repository/org/mortbay/jetty/jsp-2.1/6.1.14/jsp-2.1-6.1.14.jar
[DEBUG]  /home/jenkins/.m2/repository/org/eclipse/jdt/core/3.1.1/core-3.1.1.jar
[DEBUG]  /home/jenkins/.m2/repository/org/mortbay/jetty/jsp-api-2.1/6.1.14/jsp-api-2.1-6.1.14.jar
[DEBUG]  /home/jenkins/.m2/repository/org/mortbay/jetty/servlet-api-2.5/6.1.14/servlet-api-2.5-6.1.14.jar
[DEBUG]  /home/jenkins/.m2/repository/org/codehaus/jackson/jackson-core-asl/1.5.5/jackson-core-asl-1.5.5.jar
[DEBUG]  /home/jenkins/.m2/repository/org/codehaus/jackson/jackson-mapper-asl/1.5.5/jackson-mapper-asl-1.5.5.jar
[DEBUG]  /home/jenkins/.m2/repository/org/codehaus/jackson/jackson-jaxrs/1.5.5/jackson-jaxrs-1.5.5.jar
[DEBUG]  /home/jenkins/.m2/repository/org/codehaus/jackson/jackson-xc/1.5.5/jackson-xc-1.5.5.jar
[DEBUG]  /home/jenkins/.m2/repository/org/slf4j/slf4j-api/1.5.8/slf4j-api-1.5.8.jar
[DEBUG]  /home/jenkins/.m2/repository/org/slf4j/slf4j-log4j12/1.5.8/slf4j-log4j12-1.5.8.jar
[DEBUG]  /home/jenkins/.m2/repository/tomcat/jasper-compiler/5.5.23/jasper-compiler-5.5.23.jar
[DEBUG]  /home/jenkins/.m2/repository/tomcat/jasper-runtime/5.5.23/jasper-runtime-5.5.23.jar
[DEBUG]  /home/jenkins/.m2/repository/commons-el/commons-el/1.0/commons-el-1.0.jar
[DEBUG]  /home/jenkins/.m2/repository/org/jamon/jamon-runtime/2.3.1/jamon-runtime-2.3.1.jar
[DEBUG]  /home/jenkins/.m2/repository/com/google/protobuf/protobuf-java/2.4.0a/protobuf-java-2.4.0a.jar
[DEBUG]  /home/jenkins/.m2/repository/com/sun/jersey/jersey-core/1.4/jersey-core-1.4.jar
[DEBUG]  /home/jenkins/.m2/repository/com/sun/jersey/jersey-json/1.4/jersey-json-1.4.jar
[DEBUG]  /home/jenkins/.m2/repository/org/codehaus/jettison/jettison/1.1/jettison-1.1.jar
[DEBUG]  /home/jenkins/.m2/repository/com/sun/xml/bind/jaxb-impl/2.1.12/jaxb-impl-2.1.12.jar
[DEBUG]  /home/jenkins/.m2/repository/com/sun/jersey/jersey-server/1.4/jersey-server-1.4.jar
[DEBUG]  /home/jenkins/.m2/repository/asm/asm/3.1/asm-3.1.jar
[DEBUG]  /home/jenkins/.m2/repository/javax/xml/bind/jaxb-api/2.1/jaxb-api-2.1.jar
[DEBUG]  /home/jenkins/.m2/repository/javax/activation/activation/1.1/activation-1.1.jar
[DEBUG]  /home/jenkins/.m2/repository/stax/stax-api/1.0.1/stax-api-1.0.1.jar
[DEBUG]  /home/jenkins/.m2/repository/junit/junit/4.10/junit-4.10.jar
[DEBUG]  /home/jenkins/.m2/repository/org/hamcrest/hamcrest-core/1.1/hamcrest-core-1.1.jar
[DEBUG]  /home/jenkins/.m2/repository/org/mockito/mockito-all/1.8.5/mockito-all-1.8.5.jar
[DEBUG]  /home/jenkins/.m2/repository/org/apache/commons/commons-math/2.1/commons-math-2.1.jar
[DEBUG]  /home/jenkins/.m2/repository/org/apache/hadoop/hadoop-core/1.0.0/hadoop-core-1.0.0.jar
[DEBUG]  /home/jenkins/.m2/repository/xmlenc/xmlenc/0.52/xmlenc-0.52.jar
[DEBUG]  /home/jenkins/.m2/repository/commons-net/commons-net/1.4.1/commons-net-1.4.1.jar
[DEBUG]  /home/jenkins/.m2/repository/org/apache/hadoop/hadoop-test/1.0.0/hadoop-test-1.0.0.jar
[DEBUG]  /home/jenkins/.m2/repository/org/apache/ftpserver/ftplet-api/1.0.0/ftplet-api-1.0.0.jar
[DEBUG]  /home/jenkins/.m2/repository/org/apache/mina/mina-core/2.0.0-M5/mina-core-2.0.0-M5.jar
[DEBUG]  /home/jenkins/.m2/repository/org/apache/ftpserver/ftpserver-core/1.0.0/ftpserver-core-1.0.0.jar
[DEBUG]  /home/jenkins/.m2/repository/org/apache/ftpserver/ftpserver-deprecated/1.0.0-M2/ftpserver-deprecated-1.0.0-M2.jar
[DEBUG] Source roots:
[DEBUG]  <https://builds.apache.org/job/HBase-0.92/ws/trunk/src/test/java>
[INFO] Compiling 283 source files to <https://builds.apache.org/job/HBase-0.92/ws/trunk/target/test-classes>
[INFO] ------------------------------------------------------------------------
[INFO] BUILD FAILURE
[INFO] ------------------------------------------------------------------------
[INFO] Total time: 43.095s
[INFO] Finished at: Thu Apr 05 21:43:09 UTC 2012
[INFO] Final Memory: 46M/683M
[INFO] ------------------------------------------------------------------------
[ERROR] Failed to execute goal org.apache.maven.plugins:maven-compiler-plugin:2.0.2:testCompile
(default-testCompile) on project hbase: Compilation failure
[ERROR] <https://builds.apache.org/job/HBase-0.92/ws/trunk/src/test/java/org/apache/hadoop/hbase/TestKeyValue.java>:[402,64]
cannot find symbol
[ERROR] symbol  : variable WritableUtils
[ERROR] location: class org.apache.hadoop.hbase.TestKeyValue
[ERROR] -> [Help 1]
org.apache.maven.lifecycle.LifecycleExecutionException: Failed to execute goal org.apache.maven.plugins:maven-compiler-plugin:2.0.2:testCompile
(default-testCompile) on project hbase: Compilation failure
<https://builds.apache.org/job/HBase-0.92/ws/trunk/src/test/java/org/apache/hadoop/hbase/TestKeyValue.java>:[402,64]
cannot find symbol
symbol  : variable WritableUtils
location: class org.apache.hadoop.hbase.TestKeyValue


	at org.apache.maven.lifecycle.internal.MojoExecutor.execute(MojoExecutor.java:213)
	at org.apache.maven.lifecycle.internal.MojoExecutor.execute(MojoExecutor.java:153)
	at org.apache.maven.lifecycle.internal.MojoExecutor.execute(MojoExecutor.java:145)
	at org.apache.maven.lifecycle.internal.LifecycleModuleBuilder.buildProject(LifecycleModuleBuilder.java:84)
	at org.apache.maven.lifecycle.internal.LifecycleModuleBuilder.buildProject(LifecycleModuleBuilder.java:59)
	at org.apache.maven.lifecycle.internal.LifecycleStarter.singleThreadedBuild(LifecycleStarter.java:183)
	at org.apache.maven.lifecycle.internal.LifecycleStarter.execute(LifecycleStarter.java:161)
	at org.apache.maven.DefaultMaven.doExecute(DefaultMaven.java:319)
	at org.apache.maven.DefaultMaven.execute(DefaultMaven.java:156)
	at org.apache.maven.cli.MavenCli.execute(MavenCli.java:537)
	at org.apache.maven.cli.MavenCli.doMain(MavenCli.java:196)
	at org.apache.maven.cli.MavenCli.main(MavenCli.java:141)
	at sun.reflect.NativeMethodAccessorImpl.invoke0(Native Method)
	at sun.reflect.NativeMethodAccessorImpl.invoke(NativeMethodAccessorImpl.java:39)
	at sun.reflect.DelegatingMethodAccessorImpl.invoke(DelegatingMethodAccessorImpl.java:25)
	at java.lang.reflect.Method.invoke(Method.java:597)
	at org.codehaus.plexus.classworlds.launcher.Launcher.launchEnhanced(Launcher.java:290)
	at org.codehaus.plexus.classworlds.launcher.Launcher.launch(Launcher.java:230)
	at org.codehaus.plexus.classworlds.launcher.Launcher.mainWithExitCode(Launcher.java:409)
	at org.codehaus.plexus.classworlds.launcher.Launcher.main(Launcher.java:352)
Caused by: org.apache.maven.plugin.CompilationFailureException: Compilation failure
<https://builds.apache.org/job/HBase-0.92/ws/trunk/src/test/java/org/apache/hadoop/hbase/TestKeyValue.java>:[402,64]
cannot find symbol
symbol  : variable WritableUtils
location: class org.apache.hadoop.hbase.TestKeyValue


	at org.apache.maven.plugin.AbstractCompilerMojo.execute(AbstractCompilerMojo.java:516)
	at org.apache.maven.plugin.TestCompilerMojo.execute(TestCompilerMojo.java:102)
	at org.apache.maven.plugin.DefaultBuildPluginManager.executeMojo(DefaultBuildPluginManager.java:101)
	at org.apache.maven.lifecycle.internal.MojoExecutor.execute(MojoExecutor.java:209)
	... 19 more
[ERROR] 
[ERROR] 
[ERROR] For more information about the errors and possible solutions, please read the following
articles:
[ERROR] [Help 1] http://cwiki.apache.org/confluence/display/MAVEN/MojoFailureException
Build step 'Invoke top-level Maven targets' marked build as failure
Archiving artifacts
Updating HBASE-5711
Updating HBASE-5724
Recording test results

Mime
View raw message