hbase-dev mailing list archives

Site index · List index
Message view « Date » · « Thread »
Top « Date » · « Thread »
From Apache Jenkins Server <jenk...@builds.apache.org>
Subject Build failed in Jenkins: HBase-0.94 #150
Date Thu, 26 Apr 2012 18:48:40 GMT
See <https://builds.apache.org/job/HBase-0.94/150/changes>

Changes:

[stack] HBASE-5862 After Region Close remove the Operation Metrics

------------------------------------------
Started by an SCM change
Building remotely on ubuntu1 in workspace <https://builds.apache.org/job/HBase-0.94/ws/>
Updating https://svn.apache.org/repos/asf/hbase/branches/0.94
U         src/test/java/org/apache/hadoop/hbase/regionserver/TestRegionServerMetrics.java
U         src/main/java/org/apache/hadoop/hbase/regionserver/metrics/RegionMetricsStorage.java
U         src/main/java/org/apache/hadoop/hbase/regionserver/metrics/RegionServerDynamicMetrics.java
U         src/main/java/org/apache/hadoop/hbase/regionserver/metrics/OperationMetrics.java
U         src/main/java/org/apache/hadoop/hbase/regionserver/HRegion.java
U         src/main/java/org/apache/hadoop/hbase/regionserver/HRegionServer.java
At revision 1331027
[HBase-0.94] $ /bin/bash -xe /tmp/hudson9030884746774334888.sh
+ uname -a
Linux minerva 2.6.32-33-server #70-Ubuntu SMP Thu Jul 7 22:28:30 UTC 2011 x86_64 GNU/Linux
[HBase-0.94] $ /bin/bash -xe /tmp/hudson6209410804688319581.sh
+ ulimit -a
core file size          (blocks, -c) 0
data seg size           (kbytes, -d) unlimited
scheduling priority             (-e) 20
file size               (blocks, -f) unlimited
pending signals                 (-i) 16382
max locked memory       (kbytes, -l) 64
max memory size         (kbytes, -m) unlimited
open files                      (-n) 40000
pipe size            (512 bytes, -p) 8
POSIX message queues     (bytes, -q) 819200
real-time priority              (-r) 0
stack size              (kbytes, -s) 8192
cpu time               (seconds, -t) unlimited
max user processes              (-u) unlimited
virtual memory          (kbytes, -v) unlimited
file locks                      (-x) unlimited
[trunk] $ /home/hudson/tools/maven/latest3/bin/mvn clean -PrunAllTests -Dmaven.test.redirectTestOutputToFile=true
site install assembly:single -DskipITs -Prelease
[INFO] Scanning for projects...
[INFO]                                                                         
[INFO] ------------------------------------------------------------------------
[INFO] Building HBase 0.94.0
[INFO] ------------------------------------------------------------------------
[INFO] 
[INFO] --- maven-clean-plugin:2.4.1:clean (default-clean) @ hbase ---
[INFO] Deleting <https://builds.apache.org/job/HBase-0.94/ws/trunk/target>
[INFO] Deleting <https://builds.apache.org/job/HBase-0.94/ws/trunk/build> (includes
= [], excludes = [])
[INFO] 
[INFO] --- xml-maven-plugin:1.0-beta-3:transform (default) @ hbase ---
[INFO] Transforming file: <https://builds.apache.org/job/HBase-0.94/ws/trunk/src/main/resources/hbase-default.xml>
[INFO] Transformed 1 file(s).
[INFO] 
[INFO] --- docbkx-maven-plugin:2.0.13:generate-html (multipage) @ hbase ---
[INFO] Processing input file: upgrading.xml
[INFO] Chunking output.
[INFO] See <https://builds.apache.org/job/HBase-0.94/ws/trunk/target/site/book/upgrading>
for generated file(s)
[INFO] Processing input file: preface.xml
[INFO] Chunking output.
[INFO] See <https://builds.apache.org/job/HBase-0.94/ws/trunk/target/site/book/preface>
for generated file(s)
[INFO] Processing input file: configuration.xml
[INFO] Chunking output.
[INFO] See <https://builds.apache.org/job/HBase-0.94/ws/trunk/target/site/book/configuration>
for generated file(s)
[INFO] Processing input file: shell.xml
[INFO] Chunking output.
[INFO] See <https://builds.apache.org/job/HBase-0.94/ws/trunk/target/site/book/shell>
for generated file(s)
[INFO] Processing input file: performance.xml
[INFO] Chunking output.
[INFO] See <https://builds.apache.org/job/HBase-0.94/ws/trunk/target/site/book/performance>
for generated file(s)
[INFO] Processing input file: getting_started.xml
[INFO] Chunking output.
[INFO] See <https://builds.apache.org/job/HBase-0.94/ws/trunk/target/site/book/getting_started>
for generated file(s)
[INFO] Processing input file: external_apis.xml
[INFO] Chunking output.
[INFO] See <https://builds.apache.org/job/HBase-0.94/ws/trunk/target/site/book/external_apis>
for generated file(s)
[INFO] Processing input file: book.xml
[INFO] Chunking output.
[INFO] See <https://builds.apache.org/job/HBase-0.94/ws/trunk/target/site/book/book>
for generated file(s)
[INFO] Processing input file: ops_mgt.xml
[INFO] Chunking output.
[INFO] See <https://builds.apache.org/job/HBase-0.94/ws/trunk/target/site/book/ops_mgt>
for generated file(s)
[INFO] Processing input file: troubleshooting.xml
[INFO] Chunking output.
[INFO] See <https://builds.apache.org/job/HBase-0.94/ws/trunk/target/site/book/troubleshooting>
for generated file(s)
[INFO] Processing input file: developer.xml
[INFO] Chunking output.
[INFO] See <https://builds.apache.org/job/HBase-0.94/ws/trunk/target/site/book/developer>
for generated file(s)
[INFO] 
[INFO] --- docbkx-maven-plugin:2.0.13:generate-html (onepage) @ hbase ---
[INFO] Processing input file: upgrading.xml
[INFO] <https://builds.apache.org/job/HBase-0.94/150/artifact/trunk/target/site/upgrading.html>
has been generated.
[INFO] Processing input file: preface.xml
[INFO] <https://builds.apache.org/job/HBase-0.94/150/artifact/trunk/target/site/preface.html>
has been generated.
[INFO] Processing input file: configuration.xml
[INFO] <https://builds.apache.org/job/HBase-0.94/150/artifact/trunk/target/site/configuration.html>
has been generated.
[INFO] Processing input file: shell.xml
[INFO] <https://builds.apache.org/job/HBase-0.94/150/artifact/trunk/target/site/shell.html>
has been generated.
[INFO] Processing input file: performance.xml
[INFO] <https://builds.apache.org/job/HBase-0.94/150/artifact/trunk/target/site/performance.html>
has been generated.
[INFO] Processing input file: getting_started.xml
[INFO] <https://builds.apache.org/job/HBase-0.94/150/artifact/trunk/target/site/getting_started.html>
has been generated.
[INFO] Processing input file: external_apis.xml
[INFO] <https://builds.apache.org/job/HBase-0.94/150/artifact/trunk/target/site/external_apis.html>
has been generated.
[INFO] Processing input file: book.xml
[INFO] <https://builds.apache.org/job/HBase-0.94/150/artifact/trunk/target/site/book.html>
has been generated.
[INFO] Processing input file: ops_mgt.xml
[INFO] <https://builds.apache.org/job/HBase-0.94/150/artifact/trunk/target/site/ops_mgt.html>
has been generated.
[INFO] Processing input file: troubleshooting.xml
[INFO] <https://builds.apache.org/job/HBase-0.94/150/artifact/trunk/target/site/troubleshooting.html>
has been generated.
[INFO] Processing input file: developer.xml
[INFO] <https://builds.apache.org/job/HBase-0.94/150/artifact/trunk/target/site/developer.html>
has been generated.
[INFO] 
[INFO] --- maven-site-plugin:2.0.1:site (default-site) @ hbase ---
[INFO] Parent project loaded from repository.
[INFO] Parent project loaded from repository.
Downloading: http://repository.codehaus.org/org/apache/maven/skins/maven-stylus-skin/maven-metadata.xml
Downloading: http://download.java.net/maven/2/org/apache/maven/skins/maven-stylus-skin/maven-metadata.xml
Downloading: https://repository.apache.org/content/repositories/releases/org/apache/maven/skins/maven-stylus-skin/maven-metadata.xml
Downloading: http://people.apache.org/~stack/m2/repository/org/apache/maven/skins/maven-stylus-skin/maven-metadata.xml

Downloading: http://repository.jboss.org/nexus/content/groups/public-jboss/org/apache/maven/skins/maven-stylus-skin/maven-metadata.xml

Downloading: http://people.apache.org/~garyh/mvn/org/apache/maven/skins/maven-stylus-skin/maven-metadata.xml

Downloading: http://repo1.maven.org/maven2/org/apache/maven/skins/maven-stylus-skin/maven-metadata.xml

487 B   
        
        
Downloaded: http://repo1.maven.org/maven2/org/apache/maven/skins/maven-stylus-skin/maven-metadata.xml
(487 B at 1.2 KB/sec)
487 B   
        
Downloaded: https://repository.apache.org/content/repositories/releases/org/apache/maven/skins/maven-stylus-skin/maven-metadata.xml
(487 B at 0.4 KB/sec)
[INFO] 
[INFO] --- maven-antrun-plugin:1.6:run (arc-setup) @ hbase ---
[WARNING] Parameter tasks is deprecated, use target instead
[INFO] Executing tasks

main:
[INFO] Executed tasks
[INFO] 
[INFO] --- avro-maven-plugin:1.5.3:schema (generate-avro-sources) @ hbase ---
[INFO] 
[INFO] --- avro-maven-plugin:1.5.3:protocol (generate-avro-sources) @ hbase ---
[INFO] 
[INFO] --- maven-antrun-plugin:1.6:run (generate) @ hbase ---
[INFO] Executing tasks

main:
    [mkdir] Created dir: <https://builds.apache.org/job/HBase-0.94/ws/trunk/target/hbase-webapps>
     [copy] Copying 6 files to <https://builds.apache.org/job/HBase-0.94/ws/trunk/target/hbase-webapps>
12/04/26 18:48:09 INFO mortbay.log: Logging to org.slf4j.impl.Log4jLoggerAdapter(org.mortbay.log)
via org.mortbay.log.Slf4jLog
    [mkdir] Created dir: <https://builds.apache.org/job/HBase-0.94/ws/trunk/target/hbase-webapps/master/WEB-INF>
    [mkdir] Created dir: <https://builds.apache.org/job/HBase-0.94/ws/trunk/target/hbase-webapps/regionserver/WEB-INF>
[INFO] Executed tasks
[INFO] 
[INFO] --- build-helper-maven-plugin:1.5:add-source (jspcSource-packageInfo-Avro-source) @
hbase ---
[INFO] Source directory: <https://builds.apache.org/job/HBase-0.94/ws/trunk/target/generated-jamon>
added.
[INFO] Source directory: <https://builds.apache.org/job/HBase-0.94/ws/trunk/target/generated-sources/java>
added.
[INFO] 
[INFO] --- jamon-maven-plugin:2.3.4:translate (default) @ hbase ---
[INFO] Translating 4 templates from <https://builds.apache.org/job/HBase-0.94/ws/trunk/src/main/jamon>
to <https://builds.apache.org/job/HBase-0.94/ws/trunk/target/generated-jamon>
[INFO] 
[INFO] --- maven-remote-resources-plugin:1.1:process (default) @ hbase ---
[INFO] Setting property: classpath.resource.loader.class => 'org.codehaus.plexus.velocity.ContextClassLoaderResourceLoader'.
[INFO] Setting property: velocimacro.messages.on => 'false'.
[INFO] Setting property: resource.loader => 'classpath'.
[INFO] Setting property: resource.manager.logwhenfound => 'false'.
[INFO] 
[INFO] --- maven-resources-plugin:2.4:resources (default-resources) @ hbase ---
[INFO] Using 'UTF-8' encoding to copy filtered resources.
[INFO] Copying 1 resource
[INFO] Copying 8 resources
[INFO] Copying 3 resources
[INFO] 
[INFO] --- maven-antrun-plugin:1.6:run (default) @ hbase ---
[INFO] Executing tasks

main:
    [mkdir] Created dir: <https://builds.apache.org/job/HBase-0.94/ws/trunk/target/nativelib>
     [exec] tar: hadoop-snappy-nativelibs.tar: Cannot open: No such file or directory
     [exec] tar: Error is not recoverable: exiting now
     [exec] Result: 2
[INFO] Executed tasks
[INFO] 
[INFO] --- maven-compiler-plugin:2.0.2:compile (default-compile) @ hbase ---
[INFO] Compiling 704 source files to <https://builds.apache.org/job/HBase-0.94/ws/trunk/target/classes>
[WARNING] <https://builds.apache.org/job/HBase-0.94/ws/trunk/src/main/java/org/apache/hadoop/hbase/util/Bytes.java>:[45,15]
sun.misc.Unsafe is Sun proprietary API and may be removed in a future release

[WARNING] <https://builds.apache.org/job/HBase-0.94/ws/trunk/src/main/java/org/apache/hadoop/hbase/util/Bytes.java>:[1036,19]
sun.misc.Unsafe is Sun proprietary API and may be removed in a future release

[WARNING] <https://builds.apache.org/job/HBase-0.94/ws/trunk/src/main/java/org/apache/hadoop/hbase/util/Bytes.java>:[1042,21]
sun.misc.Unsafe is Sun proprietary API and may be removed in a future release

[WARNING] <https://builds.apache.org/job/HBase-0.94/ws/trunk/src/main/java/org/apache/hadoop/hbase/util/Bytes.java>:[1047,28]
sun.misc.Unsafe is Sun proprietary API and may be removed in a future release

[INFO] 
[INFO] --- build-helper-maven-plugin:1.5:add-test-resource (add-test-resource) @ hbase ---
[INFO] 
[INFO] --- maven-resources-plugin:2.4:testResources (default-testResources) @ hbase ---
[INFO] Using 'UTF-8' encoding to copy filtered resources.
[INFO] Copying 4 resources
[INFO] Copying 3 resources
[INFO] Copying 1 resource
[INFO] 
[INFO] --- maven-compiler-plugin:2.0.2:testCompile (default-testCompile) @ hbase ---
[INFO] Compiling 351 source files to <https://builds.apache.org/job/HBase-0.94/ws/trunk/target/test-classes>
[INFO] ------------------------------------------------------------------------
[INFO] BUILD FAILURE
[INFO] ------------------------------------------------------------------------
[INFO] Total time: 1:05.551s
[INFO] Finished at: Thu Apr 26 18:48:33 UTC 2012
[INFO] Final Memory: 49M/623M
[INFO] ------------------------------------------------------------------------
[ERROR] Failed to execute goal org.apache.maven.plugins:maven-compiler-plugin:2.0.2:testCompile
(default-testCompile) on project hbase: Compilation failure
[ERROR] <https://builds.apache.org/job/HBase-0.94/ws/trunk/src/test/java/org/apache/hadoop/hbase/regionserver/TestRegionServerMetrics.java>:[222,4]
cannot find symbol
[ERROR] symbol  : class HBaseAdmin
[ERROR] location: class org.apache.hadoop.hbase.regionserver.TestRegionServerMetrics
[ERROR] -> [Help 1]
[ERROR] 
[ERROR] To see the full stack trace of the errors, re-run Maven with the -e switch.
[ERROR] Re-run Maven using the -X switch to enable full debug logging.
[ERROR] 
[ERROR] For more information about the errors and possible solutions, please read the following
articles:
[ERROR] [Help 1] http://cwiki.apache.org/confluence/display/MAVEN/MojoFailureException
Build step 'Invoke top-level Maven targets' marked build as failure
Archiving artifacts
Recording test results
Error updating JIRA issues. Saving issues for next build.
JIRA is currently being reindexed. Depending on how large the database is, this may take a
few minutes. Jira will automatically become available as soon as this task is complete.  
         

Mime
View raw message