hbase-dev mailing list archives

Site index · List index
Message view « Date » · « Thread »
Top « Date » · « Thread »
From Apache Jenkins Server <jenk...@builds.apache.org>
Subject Build failed in Jenkins: HBase-0.94 #95
Date Sat, 07 Apr 2012 01:32:00 GMT
See <https://builds.apache.org/job/HBase-0.94/95/changes>

Changes:

[tedyu] HBASE-5736 revert TestThriftServer doesn't compile

[tedyu] HBASE-5736 ThriftServerRunner.HbaseHandler.mutateRow() does not use ByteBuffer correctly
(Scott Chen)

------------------------------------------
[...truncated 21027 lines...]
Forking command line: /bin/sh -c cd /x1/jenkins/jenkins-slave/workspace/HBase-0.94/trunk &&
/x1/jenkins/tools/java/jdk1.6.0_27-32/jre/bin/java -enableassertions -Xmx1900m -Djava.security.egd=file:/dev/./urandom
-jar /x1/jenkins/jenkins-slave/workspace/HBase-0.94/trunk/target/surefire/surefirebooter1253625641327138126.jar
/x1/jenkins/jenkins-slave/workspace/HBase-0.94/trunk/target/surefire/surefire5847491885904885326tmp
/x1/jenkins/jenkins-slave/workspace/HBase-0.94/trunk/target/surefire/surefire_587616000722791389157tmp
Running org.apache.hadoop.hbase.regionserver.TestFSErrorsExposed
Tests run: 3, Failures: 0, Errors: 0, Skipped: 0, Time elapsed: 28.354 sec
Forking command line: /bin/sh -c cd /x1/jenkins/jenkins-slave/workspace/HBase-0.94/trunk &&
/x1/jenkins/tools/java/jdk1.6.0_27-32/jre/bin/java -enableassertions -Xmx1900m -Djava.security.egd=file:/dev/./urandom
-jar /x1/jenkins/jenkins-slave/workspace/HBase-0.94/trunk/target/surefire/surefirebooter6507279753532192718.jar
/x1/jenkins/jenkins-slave/workspace/HBase-0.94/trunk/target/surefire/surefire8801289744302009602tmp
/x1/jenkins/jenkins-slave/workspace/HBase-0.94/trunk/target/surefire/surefire_597445821214612475449tmp
Running org.apache.hadoop.hbase.regionserver.TestServerCustomProtocol
Tests run: 7, Failures: 0, Errors: 0, Skipped: 0, Time elapsed: 15.294 sec
Forking command line: /bin/sh -c cd /x1/jenkins/jenkins-slave/workspace/HBase-0.94/trunk &&
/x1/jenkins/tools/java/jdk1.6.0_27-32/jre/bin/java -enableassertions -Xmx1900m -Djava.security.egd=file:/dev/./urandom
-jar /x1/jenkins/jenkins-slave/workspace/HBase-0.94/trunk/target/surefire/surefirebooter6722586012240101838.jar
/x1/jenkins/jenkins-slave/workspace/HBase-0.94/trunk/target/surefire/surefire8163695015577078789tmp
/x1/jenkins/jenkins-slave/workspace/HBase-0.94/trunk/target/surefire/surefire_604540599401799345683tmp
Running org.apache.hadoop.hbase.regionserver.TestParallelPut
Tests run: 2, Failures: 0, Errors: 0, Skipped: 0, Time elapsed: 3.091 sec
Forking command line: /bin/sh -c cd /x1/jenkins/jenkins-slave/workspace/HBase-0.94/trunk &&
/x1/jenkins/tools/java/jdk1.6.0_27-32/jre/bin/java -enableassertions -Xmx1900m -Djava.security.egd=file:/dev/./urandom
-jar /x1/jenkins/jenkins-slave/workspace/HBase-0.94/trunk/target/surefire/surefirebooter810467234663720817.jar
/x1/jenkins/jenkins-slave/workspace/HBase-0.94/trunk/target/surefire/surefire5647719649899485418tmp
/x1/jenkins/jenkins-slave/workspace/HBase-0.94/trunk/target/surefire/surefire_618552530914809984450tmp
Running org.apache.hadoop.hbase.regionserver.TestRpcMetrics
Tests run: 1, Failures: 0, Errors: 0, Skipped: 0, Time elapsed: 1.925 sec
Forking command line: /bin/sh -c cd /x1/jenkins/jenkins-slave/workspace/HBase-0.94/trunk &&
/x1/jenkins/tools/java/jdk1.6.0_27-32/jre/bin/java -enableassertions -Xmx1900m -Djava.security.egd=file:/dev/./urandom
-jar /x1/jenkins/jenkins-slave/workspace/HBase-0.94/trunk/target/surefire/surefirebooter8165601011223986986.jar
/x1/jenkins/jenkins-slave/workspace/HBase-0.94/trunk/target/surefire/surefire1142214278194241338tmp
/x1/jenkins/jenkins-slave/workspace/HBase-0.94/trunk/target/surefire/surefire_628523655584118572860tmp
Running org.apache.hadoop.hbase.regionserver.TestSeekOptimizations
Tests run: 6, Failures: 0, Errors: 0, Skipped: 0, Time elapsed: 2.364 sec
Forking command line: /bin/sh -c cd /x1/jenkins/jenkins-slave/workspace/HBase-0.94/trunk &&
/x1/jenkins/tools/java/jdk1.6.0_27-32/jre/bin/java -enableassertions -Xmx1900m -Djava.security.egd=file:/dev/./urandom
-jar /x1/jenkins/jenkins-slave/workspace/HBase-0.94/trunk/target/surefire/surefirebooter5185597140649649202.jar
/x1/jenkins/jenkins-slave/workspace/HBase-0.94/trunk/target/surefire/surefire8327296386126899480tmp
/x1/jenkins/jenkins-slave/workspace/HBase-0.94/trunk/target/surefire/surefire_637350861271210487270tmp
Running org.apache.hadoop.hbase.regionserver.handler.TestCloseRegionHandler
Tests run: 3, Failures: 0, Errors: 0, Skipped: 0, Time elapsed: 1.077 sec
Forking command line: /bin/sh -c cd /x1/jenkins/jenkins-slave/workspace/HBase-0.94/trunk &&
/x1/jenkins/tools/java/jdk1.6.0_27-32/jre/bin/java -enableassertions -Xmx1900m -Djava.security.egd=file:/dev/./urandom
-jar /x1/jenkins/jenkins-slave/workspace/HBase-0.94/trunk/target/surefire/surefirebooter5955489428705079573.jar
/x1/jenkins/jenkins-slave/workspace/HBase-0.94/trunk/target/surefire/surefire3045029962987998548tmp
/x1/jenkins/jenkins-slave/workspace/HBase-0.94/trunk/target/surefire/surefire_647028987868021305745tmp
Running org.apache.hadoop.hbase.regionserver.handler.TestOpenRegionHandler
Tests run: 3, Failures: 0, Errors: 0, Skipped: 0, Time elapsed: 0.796 sec
Forking command line: /bin/sh -c cd /x1/jenkins/jenkins-slave/workspace/HBase-0.94/trunk &&
/x1/jenkins/tools/java/jdk1.6.0_27-32/jre/bin/java -enableassertions -Xmx1900m -Djava.security.egd=file:/dev/./urandom
-jar /x1/jenkins/jenkins-slave/workspace/HBase-0.94/trunk/target/surefire/surefirebooter3085085396665513412.jar
/x1/jenkins/jenkins-slave/workspace/HBase-0.94/trunk/target/surefire/surefire1377702118848319917tmp
/x1/jenkins/jenkins-slave/workspace/HBase-0.94/trunk/target/surefire/surefire_651224896170655648182tmp
Forking command line: /bin/sh -c cd /x1/jenkins/jenkins-slave/workspace/HBase-0.94/trunk &&
/x1/jenkins/tools/java/jdk1.6.0_27-32/jre/bin/java -enableassertions -Xmx1900m -Djava.security.egd=file:/dev/./urandom
-jar /x1/jenkins/jenkins-slave/workspace/HBase-0.94/trunk/target/surefire/surefirebooter184690042332517840.jar
/x1/jenkins/jenkins-slave/workspace/HBase-0.94/trunk/target/surefire/surefire9191845393992930645tmp
/x1/jenkins/jenkins-slave/workspace/HBase-0.94/trunk/target/surefire/surefire_663446002952880192675tmp
Running org.apache.hadoop.hbase.regionserver.TestBlocksRead
Tests run: 4, Failures: 0, Errors: 0, Skipped: 0, Time elapsed: 0.76 sec
Forking command line: /bin/sh -c cd /x1/jenkins/jenkins-slave/workspace/HBase-0.94/trunk &&
/x1/jenkins/tools/java/jdk1.6.0_27-32/jre/bin/java -enableassertions -Xmx1900m -Djava.security.egd=file:/dev/./urandom
-jar /x1/jenkins/jenkins-slave/workspace/HBase-0.94/trunk/target/surefire/surefirebooter5349755575598962533.jar
/x1/jenkins/jenkins-slave/workspace/HBase-0.94/trunk/target/surefire/surefire7436758484527296421tmp
/x1/jenkins/jenkins-slave/workspace/HBase-0.94/trunk/target/surefire/surefire_676152479989534388232tmp
Running org.apache.hadoop.hbase.regionserver.TestStoreScanner
Tests run: 16, Failures: 0, Errors: 0, Skipped: 0, Time elapsed: 0.087 sec
Forking command line: /bin/sh -c cd /x1/jenkins/jenkins-slave/workspace/HBase-0.94/trunk &&
/x1/jenkins/tools/java/jdk1.6.0_27-32/jre/bin/java -enableassertions -Xmx1900m -Djava.security.egd=file:/dev/./urandom
-jar /x1/jenkins/jenkins-slave/workspace/HBase-0.94/trunk/target/surefire/surefirebooter6861636409140146146.jar
/x1/jenkins/jenkins-slave/workspace/HBase-0.94/trunk/target/surefire/surefire3068263208254276872tmp
/x1/jenkins/jenkins-slave/workspace/HBase-0.94/trunk/target/surefire/surefire_685736523721062303488tmp
Running org.apache.hadoop.hbase.regionserver.TestSplitLogWorker
Tests run: 5, Failures: 0, Errors: 0, Skipped: 0, Time elapsed: 2.11 sec
Forking command line: /bin/sh -c cd /x1/jenkins/jenkins-slave/workspace/HBase-0.94/trunk &&
/x1/jenkins/tools/java/jdk1.6.0_27-32/jre/bin/java -enableassertions -Xmx1900m -Djava.security.egd=file:/dev/./urandom
-jar /x1/jenkins/jenkins-slave/workspace/HBase-0.94/trunk/target/surefire/surefirebooter961502994257817672.jar
/x1/jenkins/jenkins-slave/workspace/HBase-0.94/trunk/target/surefire/surefire2348488060286736019tmp
/x1/jenkins/jenkins-slave/workspace/HBase-0.94/trunk/target/surefire/surefire_696581544203487099559tmp
Running org.apache.hadoop.hbase.regionserver.metrics.TestSchemaMetrics
Tests run: 6, Failures: 0, Errors: 0, Skipped: 0, Time elapsed: 10.986 sec
Forking command line: /bin/sh -c cd /x1/jenkins/jenkins-slave/workspace/HBase-0.94/trunk &&
/x1/jenkins/tools/java/jdk1.6.0_27-32/jre/bin/java -enableassertions -Xmx1900m -Djava.security.egd=file:/dev/./urandom
-jar /x1/jenkins/jenkins-slave/workspace/HBase-0.94/trunk/target/surefire/surefirebooter4615646500555620468.jar
/x1/jenkins/jenkins-slave/workspace/HBase-0.94/trunk/target/surefire/surefire512919436387527796tmp
/x1/jenkins/jenkins-slave/workspace/HBase-0.94/trunk/target/surefire/surefire_706361692677322747462tmp
Running org.apache.hadoop.hbase.regionserver.TestStoreFileBlockCacheSummary
Tests run: 1, Failures: 0, Errors: 0, Skipped: 0, Time elapsed: 15.384 sec
Forking command line: /bin/sh -c cd /x1/jenkins/jenkins-slave/workspace/HBase-0.94/trunk &&
/x1/jenkins/tools/java/jdk1.6.0_27-32/jre/bin/java -enableassertions -Xmx1900m -Djava.security.egd=file:/dev/./urandom
-jar /x1/jenkins/jenkins-slave/workspace/HBase-0.94/trunk/target/surefire/surefirebooter2802272629579224968.jar
/x1/jenkins/jenkins-slave/workspace/HBase-0.94/trunk/target/surefire/surefire2506464303943528912tmp
/x1/jenkins/jenkins-slave/workspace/HBase-0.94/trunk/target/surefire/surefire_712303018284965555205tmp
Running org.apache.hadoop.hbase.regionserver.TestMasterAddressManager
Tests run: 1, Failures: 0, Errors: 0, Skipped: 0, Time elapsed: 0.536 sec
Forking command line: /bin/sh -c cd /x1/jenkins/jenkins-slave/workspace/HBase-0.94/trunk &&
/x1/jenkins/tools/java/jdk1.6.0_27-32/jre/bin/java -enableassertions -Xmx1900m -Djava.security.egd=file:/dev/./urandom
-jar /x1/jenkins/jenkins-slave/workspace/HBase-0.94/trunk/target/surefire/surefirebooter3547823177702217721.jar
/x1/jenkins/jenkins-slave/workspace/HBase-0.94/trunk/target/surefire/surefire3091812180635033954tmp
/x1/jenkins/jenkins-slave/workspace/HBase-0.94/trunk/target/surefire/surefire_729213646326692158642tmp
Running org.apache.hadoop.hbase.regionserver.TestMultiColumnScanner
Tests run: 12, Failures: 0, Errors: 0, Skipped: 0, Time elapsed: 28.868 sec
Forking command line: /bin/sh -c cd /x1/jenkins/jenkins-slave/workspace/HBase-0.94/trunk &&
/x1/jenkins/tools/java/jdk1.6.0_27-32/jre/bin/java -enableassertions -Xmx1900m -Djava.security.egd=file:/dev/./urandom
-jar /x1/jenkins/jenkins-slave/workspace/HBase-0.94/trunk/target/surefire/surefirebooter5191488003326312456.jar
/x1/jenkins/jenkins-slave/workspace/HBase-0.94/trunk/target/surefire/surefire9094337906260647198tmp
/x1/jenkins/jenkins-slave/workspace/HBase-0.94/trunk/target/surefire/surefire_739094526617309279290tmp
Running org.apache.hadoop.hbase.ipc.TestDelayedRpc
Tests run: 4, Failures: 0, Errors: 0, Skipped: 0, Time elapsed: 2.524 sec
Forking command line: /bin/sh -c cd /x1/jenkins/jenkins-slave/workspace/HBase-0.94/trunk &&
/x1/jenkins/tools/java/jdk1.6.0_27-32/jre/bin/java -enableassertions -Xmx1900m -Djava.security.egd=file:/dev/./urandom
-jar /x1/jenkins/jenkins-slave/workspace/HBase-0.94/trunk/target/surefire/surefirebooter4895484855441462546.jar
/x1/jenkins/jenkins-slave/workspace/HBase-0.94/trunk/target/surefire/surefire8632172211489430513tmp
/x1/jenkins/jenkins-slave/workspace/HBase-0.94/trunk/target/surefire/surefire_747798613219705060540tmp
Running org.apache.hadoop.hbase.regionserver.TestHRegion
Tests run: 61, Failures: 0, Errors: 0, Skipped: 0, Time elapsed: 30.726 sec
Forking command line: /bin/sh -c cd /x1/jenkins/jenkins-slave/workspace/HBase-0.94/trunk &&
/x1/jenkins/tools/java/jdk1.6.0_27-32/jre/bin/java -enableassertions -Xmx1900m -Djava.security.egd=file:/dev/./urandom
-jar /x1/jenkins/jenkins-slave/workspace/HBase-0.94/trunk/target/surefire/surefirebooter8761467040446188244.jar
/x1/jenkins/jenkins-slave/workspace/HBase-0.94/trunk/target/surefire/surefire3416500521495188488tmp
/x1/jenkins/jenkins-slave/workspace/HBase-0.94/trunk/target/surefire/surefire_756337152823675908894tmp
Running org.apache.hadoop.hbase.TestGlobalMemStoreSize
Tests run: 1, Failures: 0, Errors: 0, Skipped: 0, Time elapsed: 15.873 sec
Forking command line: /bin/sh -c cd /x1/jenkins/jenkins-slave/workspace/HBase-0.94/trunk &&
/x1/jenkins/tools/java/jdk1.6.0_27-32/jre/bin/java -enableassertions -Xmx1900m -Djava.security.egd=file:/dev/./urandom
-jar /x1/jenkins/jenkins-slave/workspace/HBase-0.94/trunk/target/surefire/surefirebooter8191854783228688107.jar
/x1/jenkins/jenkins-slave/workspace/HBase-0.94/trunk/target/surefire/surefire6123913990550597645tmp
/x1/jenkins/jenkins-slave/workspace/HBase-0.94/trunk/target/surefire/surefire_769049461087911230689tmp
Running org.apache.hadoop.hbase.constraint.TestConstraint
Tests run: 5, Failures: 0, Errors: 0, Skipped: 0, Time elapsed: 28.125 sec
Forking command line: /bin/sh -c cd /x1/jenkins/jenkins-slave/workspace/HBase-0.94/trunk &&
/x1/jenkins/tools/java/jdk1.6.0_27-32/jre/bin/java -enableassertions -Xmx1900m -Djava.security.egd=file:/dev/./urandom
-jar /x1/jenkins/jenkins-slave/workspace/HBase-0.94/trunk/target/surefire/surefirebooter2493947118453118022.jar
/x1/jenkins/jenkins-slave/workspace/HBase-0.94/trunk/target/surefire/surefire2818304289520569247tmp
/x1/jenkins/jenkins-slave/workspace/HBase-0.94/trunk/target/surefire/surefire_774597474640455727358tmp
Running org.apache.hadoop.hbase.rest.TestSchemaResource
Tests run: 2, Failures: 0, Errors: 0, Skipped: 0, Time elapsed: 19.736 sec
Forking command line: /bin/sh -c cd /x1/jenkins/jenkins-slave/workspace/HBase-0.94/trunk &&
/x1/jenkins/tools/java/jdk1.6.0_27-32/jre/bin/java -enableassertions -Xmx1900m -Djava.security.egd=file:/dev/./urandom
-jar /x1/jenkins/jenkins-slave/workspace/HBase-0.94/trunk/target/surefire/surefirebooter150246969522093751.jar
/x1/jenkins/jenkins-slave/workspace/HBase-0.94/trunk/target/surefire/surefire2412868131567205702tmp
/x1/jenkins/jenkins-slave/workspace/HBase-0.94/trunk/target/surefire/surefire_788270152028268245309tmp
Running org.apache.hadoop.hbase.rest.client.TestRemoteAdmin
Tests run: 1, Failures: 0, Errors: 0, Skipped: 0, Time elapsed: 14.629 sec
Forking command line: /bin/sh -c cd /x1/jenkins/jenkins-slave/workspace/HBase-0.94/trunk &&
/x1/jenkins/tools/java/jdk1.6.0_27-32/jre/bin/java -enableassertions -Xmx1900m -Djava.security.egd=file:/dev/./urandom
-jar /x1/jenkins/jenkins-slave/workspace/HBase-0.94/trunk/target/surefire/surefirebooter4988875928142874343.jar
/x1/jenkins/jenkins-slave/workspace/HBase-0.94/trunk/target/surefire/surefire6942278536596809795tmp
/x1/jenkins/jenkins-slave/workspace/HBase-0.94/trunk/target/surefire/surefire_796284535523371069907tmp
Running org.apache.hadoop.hbase.rest.client.TestRemoteTable
Tests run: 3, Failures: 0, Errors: 0, Skipped: 0, Time elapsed: 13.919 sec
Forking command line: /bin/sh -c cd /x1/jenkins/jenkins-slave/workspace/HBase-0.94/trunk &&
/x1/jenkins/tools/java/jdk1.6.0_27-32/jre/bin/java -enableassertions -Xmx1900m -Djava.security.egd=file:/dev/./urandom
-jar /x1/jenkins/jenkins-slave/workspace/HBase-0.94/trunk/target/surefire/surefirebooter5631906015915254444.jar
/x1/jenkins/jenkins-slave/workspace/HBase-0.94/trunk/target/surefire/surefire333129503213227442tmp
/x1/jenkins/jenkins-slave/workspace/HBase-0.94/trunk/target/surefire/surefire_808141076289286200333tmp
Running org.apache.hadoop.hbase.rest.TestMultiRowResource
Tests run: 3, Failures: 0, Errors: 0, Skipped: 0, Time elapsed: 14.82 sec
Forking command line: /bin/sh -c cd /x1/jenkins/jenkins-slave/workspace/HBase-0.94/trunk &&
/x1/jenkins/tools/java/jdk1.6.0_27-32/jre/bin/java -enableassertions -Xmx1900m -Djava.security.egd=file:/dev/./urandom
-jar /x1/jenkins/jenkins-slave/workspace/HBase-0.94/trunk/target/surefire/surefirebooter1806257314960274460.jar
/x1/jenkins/jenkins-slave/workspace/HBase-0.94/trunk/target/surefire/surefire9035562824601143935tmp
/x1/jenkins/jenkins-slave/workspace/HBase-0.94/trunk/target/surefire/surefire_813759915430906563718tmp
Running org.apache.hadoop.hbase.rest.TestTableResource
Tests run: 8, Failures: 0, Errors: 0, Skipped: 0, Time elapsed: 23.394 sec
Forking command line: /bin/sh -c cd /x1/jenkins/jenkins-slave/workspace/HBase-0.94/trunk &&
/x1/jenkins/tools/java/jdk1.6.0_27-32/jre/bin/java -enableassertions -Xmx1900m -Djava.security.egd=file:/dev/./urandom
-jar /x1/jenkins/jenkins-slave/workspace/HBase-0.94/trunk/target/surefire/surefirebooter2664689264154559036.jar
/x1/jenkins/jenkins-slave/workspace/HBase-0.94/trunk/target/surefire/surefire4893729921952975154tmp
/x1/jenkins/jenkins-slave/workspace/HBase-0.94/trunk/target/surefire/surefire_827452558914101044295tmp
Running org.apache.hadoop.hbase.rest.TestGzipFilter
Tests run: 3, Failures: 0, Errors: 0, Skipped: 0, Time elapsed: 13.326 sec
Forking command line: /bin/sh -c cd /x1/jenkins/jenkins-slave/workspace/HBase-0.94/trunk &&
/x1/jenkins/tools/java/jdk1.6.0_27-32/jre/bin/java -enableassertions -Xmx1900m -Djava.security.egd=file:/dev/./urandom
-jar /x1/jenkins/jenkins-slave/workspace/HBase-0.94/trunk/target/surefire/surefirebooter6033962747937749231.jar
/x1/jenkins/jenkins-slave/workspace/HBase-0.94/trunk/target/surefire/surefire10998686715529237tmp
/x1/jenkins/jenkins-slave/workspace/HBase-0.94/trunk/target/surefire/surefire_831999144540464773905tmp
Running org.apache.hadoop.hbase.rest.TestRowResource
Tests run: 11, Failures: 0, Errors: 0, Skipped: 0, Time elapsed: 15.098 sec
Forking command line: /bin/sh -c cd /x1/jenkins/jenkins-slave/workspace/HBase-0.94/trunk &&
/x1/jenkins/tools/java/jdk1.6.0_27-32/jre/bin/java -enableassertions -Xmx1900m -Djava.security.egd=file:/dev/./urandom
-jar /x1/jenkins/jenkins-slave/workspace/HBase-0.94/trunk/target/surefire/surefirebooter7136295756955117407.jar
/x1/jenkins/jenkins-slave/workspace/HBase-0.94/trunk/target/surefire/surefire6021747011808992453tmp
/x1/jenkins/jenkins-slave/workspace/HBase-0.94/trunk/target/surefire/surefire_841601036289830771483tmp
Running org.apache.hadoop.hbase.rest.TestVersionResource
Tests run: 7, Failures: 0, Errors: 0, Skipped: 0, Time elapsed: 11.409 sec
Forking command line: /bin/sh -c cd /x1/jenkins/jenkins-slave/workspace/HBase-0.94/trunk &&
/x1/jenkins/tools/java/jdk1.6.0_27-32/jre/bin/java -enableassertions -Xmx1900m -Djava.security.egd=file:/dev/./urandom
-jar /x1/jenkins/jenkins-slave/workspace/HBase-0.94/trunk/target/surefire/surefirebooter8646349101511189226.jar
/x1/jenkins/jenkins-slave/workspace/HBase-0.94/trunk/target/surefire/surefire2830267608398911321tmp
/x1/jenkins/jenkins-slave/workspace/HBase-0.94/trunk/target/surefire/surefire_851827880252309529985tmp
Running org.apache.hadoop.hbase.rest.TestScannerResource
Tests run: 5, Failures: 0, Errors: 0, Skipped: 0, Time elapsed: 29.091 sec
Forking command line: /bin/sh -c cd /x1/jenkins/jenkins-slave/workspace/HBase-0.94/trunk &&
/x1/jenkins/tools/java/jdk1.6.0_27-32/jre/bin/java -enableassertions -Xmx1900m -Djava.security.egd=file:/dev/./urandom
-jar /x1/jenkins/jenkins-slave/workspace/HBase-0.94/trunk/target/surefire/surefirebooter974939991003928678.jar
/x1/jenkins/jenkins-slave/workspace/HBase-0.94/trunk/target/surefire/surefire6575042176569100784tmp
/x1/jenkins/jenkins-slave/workspace/HBase-0.94/trunk/target/surefire/surefire_86975935900734074861tmp
Running org.apache.hadoop.hbase.rest.TestStatusResource
Tests run: 2, Failures: 0, Errors: 0, Skipped: 0, Time elapsed: 10.394 sec
Forking command line: /bin/sh -c cd /x1/jenkins/jenkins-slave/workspace/HBase-0.94/trunk &&
/x1/jenkins/tools/java/jdk1.6.0_27-32/jre/bin/java -enableassertions -Xmx1900m -Djava.security.egd=file:/dev/./urandom
-jar /x1/jenkins/jenkins-slave/workspace/HBase-0.94/trunk/target/surefire/surefirebooter3347004207212254169.jar
/x1/jenkins/jenkins-slave/workspace/HBase-0.94/trunk/target/surefire/surefire1535451587452005226tmp
/x1/jenkins/jenkins-slave/workspace/HBase-0.94/trunk/target/surefire/surefire_877437753988908507804tmp
Running org.apache.hadoop.hbase.metrics.TestMetricsMBeanBase
Tests run: 2, Failures: 0, Errors: 0, Skipped: 0, Time elapsed: 1.101 sec
Forking command line: /bin/sh -c cd /x1/jenkins/jenkins-slave/workspace/HBase-0.94/trunk &&
/x1/jenkins/tools/java/jdk1.6.0_27-32/jre/bin/java -enableassertions -Xmx1900m -Djava.security.egd=file:/dev/./urandom
-jar /x1/jenkins/jenkins-slave/workspace/HBase-0.94/trunk/target/surefire/surefirebooter900984337714344335.jar
/x1/jenkins/jenkins-slave/workspace/HBase-0.94/trunk/target/surefire/surefire7449430915366682294tmp
/x1/jenkins/jenkins-slave/workspace/HBase-0.94/trunk/target/surefire/surefire_883885768364646794927tmp
Running org.apache.hadoop.hbase.io.hfile.TestHFileBlockIndex
Tests run: 10, Failures: 0, Errors: 0, Skipped: 0, Time elapsed: 7.009 sec
Forking command line: /bin/sh -c cd /x1/jenkins/jenkins-slave/workspace/HBase-0.94/trunk &&
/x1/jenkins/tools/java/jdk1.6.0_27-32/jre/bin/java -enableassertions -Xmx1900m -Djava.security.egd=file:/dev/./urandom
-jar /x1/jenkins/jenkins-slave/workspace/HBase-0.94/trunk/target/surefire/surefirebooter8161355146086271041.jar
/x1/jenkins/jenkins-slave/workspace/HBase-0.94/trunk/target/surefire/surefire4992476630561713740tmp
/x1/jenkins/jenkins-slave/workspace/HBase-0.94/trunk/target/surefire/surefire_896029723804879642152tmp
Running org.apache.hadoop.hbase.io.hfile.TestHFileSeek
Tests run: 1, Failures: 0, Errors: 0, Skipped: 0, Time elapsed: 6.371 sec
Forking command line: /bin/sh -c cd /x1/jenkins/jenkins-slave/workspace/HBase-0.94/trunk &&
/x1/jenkins/tools/java/jdk1.6.0_27-32/jre/bin/java -enableassertions -Xmx1900m -Djava.security.egd=file:/dev/./urandom
-jar /x1/jenkins/jenkins-slave/workspace/HBase-0.94/trunk/target/surefire/surefirebooter5435344891540256568.jar
/x1/jenkins/jenkins-slave/workspace/HBase-0.94/trunk/target/surefire/surefire1411256654185417162tmp
/x1/jenkins/jenkins-slave/workspace/HBase-0.94/trunk/target/surefire/surefire_902007454582521260332tmp
Running org.apache.hadoop.hbase.rest.TestScannersWithFilters
Tests run: 10, Failures: 0, Errors: 0, Skipped: 0, Time elapsed: 17.023 sec
Forking command line: /bin/sh -c cd /x1/jenkins/jenkins-slave/workspace/HBase-0.94/trunk &&
/x1/jenkins/tools/java/jdk1.6.0_27-32/jre/bin/java -enableassertions -Xmx1900m -Djava.security.egd=file:/dev/./urandom
-jar /x1/jenkins/jenkins-slave/workspace/HBase-0.94/trunk/target/surefire/surefirebooter6373051242056224787.jar
/x1/jenkins/jenkins-slave/workspace/HBase-0.94/trunk/target/surefire/surefire1176726653991724080tmp
/x1/jenkins/jenkins-slave/workspace/HBase-0.94/trunk/target/surefire/surefire_911615503789622026157tmp
Running org.apache.hadoop.hbase.io.hfile.TestLruBlockCache
Tests run: 16, Failures: 0, Errors: 0, Skipped: 0, Time elapsed: 0.805 sec
Forking command line: /bin/sh -c cd /x1/jenkins/jenkins-slave/workspace/HBase-0.94/trunk &&
/x1/jenkins/tools/java/jdk1.6.0_27-32/jre/bin/java -enableassertions -Xmx1900m -Djava.security.egd=file:/dev/./urandom
-jar /x1/jenkins/jenkins-slave/workspace/HBase-0.94/trunk/target/surefire/surefirebooter2425432135000314722.jar
/x1/jenkins/jenkins-slave/workspace/HBase-0.94/trunk/target/surefire/surefire52820481559267863tmp
/x1/jenkins/jenkins-slave/workspace/HBase-0.94/trunk/target/surefire/surefire_929078419138383330968tmp
Running org.apache.hadoop.hbase.io.hfile.TestFixedFileTrailer
Tests run: 2, Failures: 0, Errors: 0, Skipped: 0, Time elapsed: 0.522 sec
Forking command line: /bin/sh -c cd /x1/jenkins/jenkins-slave/workspace/HBase-0.94/trunk &&
/x1/jenkins/tools/java/jdk1.6.0_27-32/jre/bin/java -enableassertions -Xmx1900m -Djava.security.egd=file:/dev/./urandom
-jar /x1/jenkins/jenkins-slave/workspace/HBase-0.94/trunk/target/surefire/surefirebooter7834720119276866531.jar
/x1/jenkins/jenkins-slave/workspace/HBase-0.94/trunk/target/surefire/surefire190611244220165109tmp
/x1/jenkins/jenkins-slave/workspace/HBase-0.94/trunk/target/surefire/surefire_938431190028276785308tmp
Running org.apache.hadoop.hbase.io.hfile.TestHFilePerformance
Tests run: 1, Failures: 0, Errors: 0, Skipped: 0, Time elapsed: 4.384 sec
Forking command line: /bin/sh -c cd /x1/jenkins/jenkins-slave/workspace/HBase-0.94/trunk &&
/x1/jenkins/tools/java/jdk1.6.0_27-32/jre/bin/java -enableassertions -Xmx1900m -Djava.security.egd=file:/dev/./urandom
-jar /x1/jenkins/jenkins-slave/workspace/HBase-0.94/trunk/target/surefire/surefirebooter5297382732065564920.jar
/x1/jenkins/jenkins-slave/workspace/HBase-0.94/trunk/target/surefire/surefire7473482346986010728tmp
/x1/jenkins/jenkins-slave/workspace/HBase-0.94/trunk/target/surefire/surefire_947591252540209531100tmp
Running org.apache.hadoop.hbase.io.hfile.TestHFileBlockCompatibility
Tests run: 10, Failures: 0, Errors: 0, Skipped: 0, Time elapsed: 0.956 sec
Forking command line: /bin/sh -c cd /x1/jenkins/jenkins-slave/workspace/HBase-0.94/trunk &&
/x1/jenkins/tools/java/jdk1.6.0_27-32/jre/bin/java -enableassertions -Xmx1900m -Djava.security.egd=file:/dev/./urandom
-jar /x1/jenkins/jenkins-slave/workspace/HBase-0.94/trunk/target/surefire/surefirebooter4269832488468027272.jar
/x1/jenkins/jenkins-slave/workspace/HBase-0.94/trunk/target/surefire/surefire5541100782917134506tmp
/x1/jenkins/jenkins-slave/workspace/HBase-0.94/trunk/target/surefire/surefire_953598905221655873873tmp
Running org.apache.hadoop.hbase.io.hfile.TestForceCacheImportantBlocks
Tests run: 4, Failures: 0, Errors: 0, Skipped: 0, Time elapsed: 36.218 sec
Forking command line: /bin/sh -c cd /x1/jenkins/jenkins-slave/workspace/HBase-0.94/trunk &&
/x1/jenkins/tools/java/jdk1.6.0_27-32/jre/bin/java -enableassertions -Xmx1900m -Djava.security.egd=file:/dev/./urandom
-jar /x1/jenkins/jenkins-slave/workspace/HBase-0.94/trunk/target/surefire/surefirebooter4727744582266609393.jar
/x1/jenkins/jenkins-slave/workspace/HBase-0.94/trunk/target/surefire/surefire127771461009239423tmp
/x1/jenkins/jenkins-slave/workspace/HBase-0.94/trunk/target/surefire/surefire_967855676663470491362tmp
Running org.apache.hadoop.hbase.io.hfile.TestCacheOnWrite
Tests run: 36, Failures: 0, Errors: 0, Skipped: 0, Time elapsed: 28.937 sec
Forking command line: /bin/sh -c cd /x1/jenkins/jenkins-slave/workspace/HBase-0.94/trunk &&
/x1/jenkins/tools/java/jdk1.6.0_27-32/jre/bin/java -enableassertions -Xmx1900m -Djava.security.egd=file:/dev/./urandom
-jar /x1/jenkins/jenkins-slave/workspace/HBase-0.94/trunk/target/surefire/surefirebooter8869628257568226117.jar
/x1/jenkins/jenkins-slave/workspace/HBase-0.94/trunk/target/surefire/surefire1031049013483667181tmp
/x1/jenkins/jenkins-slave/workspace/HBase-0.94/trunk/target/surefire/surefire_973621838566166082298tmp
Running org.apache.hadoop.hbase.io.hfile.TestChecksum
Tests run: 3, Failures: 0, Errors: 0, Skipped: 0, Time elapsed: 0.731 sec
Forking command line: /bin/sh -c cd /x1/jenkins/jenkins-slave/workspace/HBase-0.94/trunk &&
/x1/jenkins/tools/java/jdk1.6.0_27-32/jre/bin/java -enableassertions -Xmx1900m -Djava.security.egd=file:/dev/./urandom
-jar /x1/jenkins/jenkins-slave/workspace/HBase-0.94/trunk/target/surefire/surefirebooter2572336852775680716.jar
/x1/jenkins/jenkins-slave/workspace/HBase-0.94/trunk/target/surefire/surefire6676324982127212840tmp
/x1/jenkins/jenkins-slave/workspace/HBase-0.94/trunk/target/surefire/surefire_98881258288446396579tmp
Running org.apache.hadoop.hbase.io.hfile.slab.TestSlabCache
Tests run: 7, Failures: 0, Errors: 0, Skipped: 0, Time elapsed: 10.506 sec
Forking command line: /bin/sh -c cd /x1/jenkins/jenkins-slave/workspace/HBase-0.94/trunk &&
/x1/jenkins/tools/java/jdk1.6.0_27-32/jre/bin/java -enableassertions -Xmx1900m -Djava.security.egd=file:/dev/./urandom
-jar /x1/jenkins/jenkins-slave/workspace/HBase-0.94/trunk/target/surefire/surefirebooter1647417978644385916.jar
/x1/jenkins/jenkins-slave/workspace/HBase-0.94/trunk/target/surefire/surefire2049107311091529374tmp
/x1/jenkins/jenkins-slave/workspace/HBase-0.94/trunk/target/surefire/surefire_993607456138391200120tmp
Running org.apache.hadoop.hbase.io.hfile.slab.TestSingleSizeCache
Tests run: 5, Failures: 0, Errors: 0, Skipped: 0, Time elapsed: 15.374 sec
Forking command line: /bin/sh -c cd /x1/jenkins/jenkins-slave/workspace/HBase-0.94/trunk &&
/x1/jenkins/tools/java/jdk1.6.0_27-32/jre/bin/java -enableassertions -Xmx1900m -Djava.security.egd=file:/dev/./urandom
-jar /x1/jenkins/jenkins-slave/workspace/HBase-0.94/trunk/target/surefire/surefirebooter5810270246065548534.jar
/x1/jenkins/jenkins-slave/workspace/HBase-0.94/trunk/target/surefire/surefire3710982240920222601tmp
/x1/jenkins/jenkins-slave/workspace/HBase-0.94/trunk/target/surefire/surefire_1004229831220332481720tmp
Running org.apache.hadoop.hbase.io.hfile.TestHFileBlock
Tests run: 16, Failures: 0, Errors: 0, Skipped: 0, Time elapsed: 46.247 sec
Forking command line: /bin/sh -c cd /x1/jenkins/jenkins-slave/workspace/HBase-0.94/trunk &&
/x1/jenkins/tools/java/jdk1.6.0_27-32/jre/bin/java -enableassertions -Xmx1900m -Djava.security.egd=file:/dev/./urandom
-jar /x1/jenkins/jenkins-slave/workspace/HBase-0.94/trunk/target/surefire/surefirebooter5820027478927524777.jar
/x1/jenkins/jenkins-slave/workspace/HBase-0.94/trunk/target/surefire/surefire7125274068333215282tmp
/x1/jenkins/jenkins-slave/workspace/HBase-0.94/trunk/target/surefire/surefire_1012445436943022159714tmp
Running org.apache.hadoop.hbase.replication.TestReplicationZookeeper
Tests run: 1, Failures: 0, Errors: 0, Skipped: 0, Time elapsed: 0.664 sec
Forking command line: /bin/sh -c cd /x1/jenkins/jenkins-slave/workspace/HBase-0.94/trunk &&
/x1/jenkins/tools/java/jdk1.6.0_27-32/jre/bin/java -enableassertions -Xmx1900m -Djava.security.egd=file:/dev/./urandom
-jar /x1/jenkins/jenkins-slave/workspace/HBase-0.94/trunk/target/surefire/surefirebooter6231437240935062706.jar
/x1/jenkins/jenkins-slave/workspace/HBase-0.94/trunk/target/surefire/surefire6565816755260198233tmp
/x1/jenkins/jenkins-slave/workspace/HBase-0.94/trunk/target/surefire/surefire_1025433970062660944041tmp
Running org.apache.hadoop.hbase.io.encoding.TestLoadAndSwitchEncodeOnDisk
Tests run: 1, Failures: 0, Errors: 0, Skipped: 0, Time elapsed: 24.496 sec
Forking command line: /bin/sh -c cd /x1/jenkins/jenkins-slave/workspace/HBase-0.94/trunk &&
/x1/jenkins/tools/java/jdk1.6.0_27-32/jre/bin/java -enableassertions -Xmx1900m -Djava.security.egd=file:/dev/./urandom
-jar /x1/jenkins/jenkins-slave/workspace/HBase-0.94/trunk/target/surefire/surefirebooter6199044981970543570.jar
/x1/jenkins/jenkins-slave/workspace/HBase-0.94/trunk/target/surefire/surefire5258710237344431443tmp
/x1/jenkins/jenkins-slave/workspace/HBase-0.94/trunk/target/surefire/surefire_103623499959570524420tmp
Running org.apache.hadoop.hbase.replication.regionserver.TestReplicationSourceManager
Tests run: 1, Failures: 0, Errors: 0, Skipped: 0, Time elapsed: 0.954 sec
Forking command line: /bin/sh -c cd /x1/jenkins/jenkins-slave/workspace/HBase-0.94/trunk &&
/x1/jenkins/tools/java/jdk1.6.0_27-32/jre/bin/java -enableassertions -Xmx1900m -Djava.security.egd=file:/dev/./urandom
-jar /x1/jenkins/jenkins-slave/workspace/HBase-0.94/trunk/target/surefire/surefirebooter2376800487861640871.jar
/x1/jenkins/jenkins-slave/workspace/HBase-0.94/trunk/target/surefire/surefire4103795760887565489tmp
/x1/jenkins/jenkins-slave/workspace/HBase-0.94/trunk/target/surefire/surefire_104178739572673902547tmp
Running org.apache.hadoop.hbase.replication.TestReplicationSource
Tests run: 1, Failures: 0, Errors: 0, Skipped: 0, Time elapsed: 2.69 sec
Forking command line: /bin/sh -c cd /x1/jenkins/jenkins-slave/workspace/HBase-0.94/trunk &&
/x1/jenkins/tools/java/jdk1.6.0_27-32/jre/bin/java -enableassertions -Xmx1900m -Djava.security.egd=file:/dev/./urandom
-jar /x1/jenkins/jenkins-slave/workspace/HBase-0.94/trunk/target/surefire/surefirebooter2721857945514499210.jar
/x1/jenkins/jenkins-slave/workspace/HBase-0.94/trunk/target/surefire/surefire5547565319858793628tmp
/x1/jenkins/jenkins-slave/workspace/HBase-0.94/trunk/target/surefire/surefire_1051403994497063528788tmp
Running org.apache.hadoop.hbase.replication.regionserver.TestReplicationSink
Tests run: 5, Failures: 0, Errors: 0, Skipped: 0, Time elapsed: 14.123 sec
Forking command line: /bin/sh -c cd /x1/jenkins/jenkins-slave/workspace/HBase-0.94/trunk &&
/x1/jenkins/tools/java/jdk1.6.0_27-32/jre/bin/java -enableassertions -Xmx1900m -Djava.security.egd=file:/dev/./urandom
-jar /x1/jenkins/jenkins-slave/workspace/HBase-0.94/trunk/target/surefire/surefirebooter3611592361116551443.jar
/x1/jenkins/jenkins-slave/workspace/HBase-0.94/trunk/target/surefire/surefire6704560900505415860tmp
/x1/jenkins/jenkins-slave/workspace/HBase-0.94/trunk/target/surefire/surefire_1062418295556480727263tmp
Running org.apache.hadoop.hbase.util.TestFSTableDescriptors
Tests run: 10, Failures: 0, Errors: 0, Skipped: 0, Time elapsed: 0.872 sec
Forking command line: /bin/sh -c cd /x1/jenkins/jenkins-slave/workspace/HBase-0.94/trunk &&
/x1/jenkins/tools/java/jdk1.6.0_27-32/jre/bin/java -enableassertions -Xmx1900m -Djava.security.egd=file:/dev/./urandom
-jar /x1/jenkins/jenkins-slave/workspace/HBase-0.94/trunk/target/surefire/surefirebooter7637444663514808612.jar
/x1/jenkins/jenkins-slave/workspace/HBase-0.94/trunk/target/surefire/surefire7028207372945422777tmp
/x1/jenkins/jenkins-slave/workspace/HBase-0.94/trunk/target/surefire/surefire_107174402487315130964tmp
Running org.apache.hadoop.hbase.replication.TestReplicationPeer
Tests run: 1, Failures: 0, Errors: 0, Skipped: 0, Time elapsed: 7.64 sec
Forking command line: /bin/sh -c cd /x1/jenkins/jenkins-slave/workspace/HBase-0.94/trunk &&
/x1/jenkins/tools/java/jdk1.6.0_27-32/jre/bin/java -enableassertions -Xmx1900m -Djava.security.egd=file:/dev/./urandom
-jar /x1/jenkins/jenkins-slave/workspace/HBase-0.94/trunk/target/surefire/surefirebooter5961323655402892224.jar
/x1/jenkins/jenkins-slave/workspace/HBase-0.94/trunk/target/surefire/surefire7165442254169771041tmp
/x1/jenkins/jenkins-slave/workspace/HBase-0.94/trunk/target/surefire/surefire_1088539405684700302733tmp
Running org.apache.hadoop.hbase.util.TestEnvironmentEdgeManager
Tests run: 2, Failures: 0, Errors: 0, Skipped: 0, Time elapsed: 0.465 sec
Forking command line: /bin/sh -c cd /x1/jenkins/jenkins-slave/workspace/HBase-0.94/trunk &&
/x1/jenkins/tools/java/jdk1.6.0_27-32/jre/bin/java -enableassertions -Xmx1900m -Djava.security.egd=file:/dev/./urandom
-jar /x1/jenkins/jenkins-slave/workspace/HBase-0.94/trunk/target/surefire/surefirebooter3386592371878977511.jar
/x1/jenkins/jenkins-slave/workspace/HBase-0.94/trunk/target/surefire/surefire6845798891495848954tmp
/x1/jenkins/jenkins-slave/workspace/HBase-0.94/trunk/target/surefire/surefire_1096979569914253132264tmp
Running org.apache.hadoop.hbase.util.TestIdLock
Tests run: 1, Failures: 0, Errors: 0, Skipped: 0, Time elapsed: 15.243 sec
Forking command line: /bin/sh -c cd /x1/jenkins/jenkins-slave/workspace/HBase-0.94/trunk &&
/x1/jenkins/tools/java/jdk1.6.0_27-32/jre/bin/java -enableassertions -Xmx1900m -Djava.security.egd=file:/dev/./urandom
-jar /x1/jenkins/jenkins-slave/workspace/HBase-0.94/trunk/target/surefire/surefirebooter8217074041711222682.jar
/x1/jenkins/jenkins-slave/workspace/HBase-0.94/trunk/target/surefire/surefire4543966437740843180tmp
/x1/jenkins/jenkins-slave/workspace/HBase-0.94/trunk/target/surefire/surefire_1103198926223524542967tmp
Running org.apache.hadoop.hbase.util.TestMergeTable
Tests run: 1, Failures: 0, Errors: 0, Skipped: 0, Time elapsed: 25.381 sec
Forking command line: /bin/sh -c cd /x1/jenkins/jenkins-slave/workspace/HBase-0.94/trunk &&
/x1/jenkins/tools/java/jdk1.6.0_27-32/jre/bin/java -enableassertions -Xmx1900m -Djava.security.egd=file:/dev/./urandom
-jar /x1/jenkins/jenkins-slave/workspace/HBase-0.94/trunk/target/surefire/surefirebooter7661828086041711192.jar
/x1/jenkins/jenkins-slave/workspace/HBase-0.94/trunk/target/surefire/surefire1430693251532680034tmp
/x1/jenkins/jenkins-slave/workspace/HBase-0.94/trunk/target/surefire/surefire_1116191776665816555655tmp
Running org.apache.hadoop.hbase.util.TestFSUtils
Tests run: 3, Failures: 0, Errors: 0, Skipped: 0, Time elapsed: 19.598 sec
Forking command line: /bin/sh -c cd /x1/jenkins/jenkins-slave/workspace/HBase-0.94/trunk &&
/x1/jenkins/tools/java/jdk1.6.0_27-32/jre/bin/java -enableassertions -Xmx1900m -Djava.security.egd=file:/dev/./urandom
-jar /x1/jenkins/jenkins-slave/workspace/HBase-0.94/trunk/target/surefire/surefirebooter5004112224596804315.jar
/x1/jenkins/jenkins-slave/workspace/HBase-0.94/trunk/target/surefire/surefire1440573611431995026tmp
/x1/jenkins/jenkins-slave/workspace/HBase-0.94/trunk/target/surefire/surefire_1126342324355926336843tmp
Running org.apache.hadoop.hbase.util.TestPoolMap$TestRoundRobinPoolType
Tests run: 3, Failures: 0, Errors: 0, Skipped: 0, Time elapsed: 0.01 sec
Running org.apache.hadoop.hbase.util.TestPoolMap$TestThreadLocalPoolType
Tests run: 3, Failures: 0, Errors: 0, Skipped: 0, Time elapsed: 0.006 sec
Running org.apache.hadoop.hbase.util.TestPoolMap$TestReusablePoolType
Tests run: 3, Failures: 0, Errors: 0, Skipped: 0, Time elapsed: 0.034 sec
Forking command line: /bin/sh -c cd /x1/jenkins/jenkins-slave/workspace/HBase-0.94/trunk &&
/x1/jenkins/tools/java/jdk1.6.0_27-32/jre/bin/java -enableassertions -Xmx1900m -Djava.security.egd=file:/dev/./urandom
-jar /x1/jenkins/jenkins-slave/workspace/HBase-0.94/trunk/target/surefire/surefirebooter2025248548739320747.jar
/x1/jenkins/jenkins-slave/workspace/HBase-0.94/trunk/target/surefire/surefire2083740276976456653tmp
/x1/jenkins/jenkins-slave/workspace/HBase-0.94/trunk/target/surefire/surefire_1136934446227554086230tmp
Running org.apache.hadoop.hbase.util.TestRegionSplitter
Tests run: 5, Failures: 0, Errors: 0, Skipped: 0, Time elapsed: 21.843 sec
Forking command line: /bin/sh -c cd /x1/jenkins/jenkins-slave/workspace/HBase-0.94/trunk &&
/x1/jenkins/tools/java/jdk1.6.0_27-32/jre/bin/java -enableassertions -Xmx1900m -Djava.security.egd=file:/dev/./urandom
-jar /x1/jenkins/jenkins-slave/workspace/HBase-0.94/trunk/target/surefire/surefirebooter1836818031115420699.jar
/x1/jenkins/jenkins-slave/workspace/HBase-0.94/trunk/target/surefire/surefire1432555436318864640tmp
/x1/jenkins/jenkins-slave/workspace/HBase-0.94/trunk/target/surefire/surefire_1143126633651251696695tmp
Running org.apache.hadoop.hbase.util.hbck.TestOfflineMetaRebuildBase
Tests run: 1, Failures: 0, Errors: 0, Skipped: 0, Time elapsed: 19.092 sec
Forking command line: /bin/sh -c cd /x1/jenkins/jenkins-slave/workspace/HBase-0.94/trunk &&
/x1/jenkins/tools/java/jdk1.6.0_27-32/jre/bin/java -enableassertions -Xmx1900m -Djava.security.egd=file:/dev/./urandom
-jar /x1/jenkins/jenkins-slave/workspace/HBase-0.94/trunk/target/surefire/surefirebooter5068110194102569037.jar
/x1/jenkins/jenkins-slave/workspace/HBase-0.94/trunk/target/surefire/surefire9094027313883658647tmp
/x1/jenkins/jenkins-slave/workspace/HBase-0.94/trunk/target/surefire/surefire_1153205096784825266475tmp
Running org.apache.hadoop.hbase.util.hbck.TestOfflineMetaRebuildOverlap
Tests run: 1, Failures: 0, Errors: 0, Skipped: 0, Time elapsed: 17.097 sec
Forking command line: /bin/sh -c cd /x1/jenkins/jenkins-slave/workspace/HBase-0.94/trunk &&
/x1/jenkins/tools/java/jdk1.6.0_27-32/jre/bin/java -enableassertions -Xmx1900m -Djava.security.egd=file:/dev/./urandom
-jar /x1/jenkins/jenkins-slave/workspace/HBase-0.94/trunk/target/surefire/surefirebooter2824701263002008782.jar
/x1/jenkins/jenkins-slave/workspace/HBase-0.94/trunk/target/surefire/surefire6621973319655738699tmp
/x1/jenkins/jenkins-slave/workspace/HBase-0.94/trunk/target/surefire/surefire_1165085262632826774546tmp
Running org.apache.hadoop.hbase.util.hbck.TestOfflineMetaRebuildHole
Tests run: 1, Failures: 0, Errors: 0, Skipped: 0, Time elapsed: 17.235 sec
Forking command line: /bin/sh -c cd /x1/jenkins/jenkins-slave/workspace/HBase-0.94/trunk &&
/x1/jenkins/tools/java/jdk1.6.0_27-32/jre/bin/java -enableassertions -Xmx1900m -Djava.security.egd=file:/dev/./urandom
-jar /x1/jenkins/jenkins-slave/workspace/HBase-0.94/trunk/target/surefire/surefirebooter1570806955556094477.jar
/x1/jenkins/jenkins-slave/workspace/HBase-0.94/trunk/target/surefire/surefire6144670758117902302tmp
/x1/jenkins/jenkins-slave/workspace/HBase-0.94/trunk/target/surefire/surefire_1171709596124205895254tmp
Running org.apache.hadoop.hbase.util.TestDefaultEnvironmentEdge
Tests run: 1, Failures: 0, Errors: 0, Skipped: 0, Time elapsed: 0.299 sec
Forking command line: /bin/sh -c cd /x1/jenkins/jenkins-slave/workspace/HBase-0.94/trunk &&
/x1/jenkins/tools/java/jdk1.6.0_27-32/jre/bin/java -enableassertions -Xmx1900m -Djava.security.egd=file:/dev/./urandom
-jar /x1/jenkins/jenkins-slave/workspace/HBase-0.94/trunk/target/surefire/surefirebooter7594495747795731644.jar
/x1/jenkins/jenkins-slave/workspace/HBase-0.94/trunk/target/surefire/surefire6285401994511229601tmp
/x1/jenkins/jenkins-slave/workspace/HBase-0.94/trunk/target/surefire/surefire_1189053279842325385271tmp
Running org.apache.hadoop.hbase.TestInfoServers
Tests run: 2, Failures: 0, Errors: 0, Skipped: 0, Time elapsed: 9.717 sec
Running org.apache.hadoop.hbase.util.TestHBaseFsck
Tests run: 14, Failures: 0, Errors: 0, Skipped: 0, Time elapsed: 166.58 sec

Results :

Tests in error: 
  testTableOperations(org.apache.hadoop.hbase.coprocessor.TestMasterObserver): org.apache.hadoop.hbase.InvalidFamilyOperationException:
Column family 'fam2' does not exist(..)
  testRegionTransitionOperations(org.apache.hadoop.hbase.coprocessor.TestMasterObserver):
org.apache.hadoop.hbase.TableExistsException: observed_table

Tests run: 616, Failures: 0, Errors: 2, Skipped: 2

[INFO] ------------------------------------------------------------------------
[INFO] BUILD FAILURE
[INFO] ------------------------------------------------------------------------
[INFO] Total time: 24:29.848s
[INFO] Finished at: Sat Apr 07 01:31:53 UTC 2012
[INFO] Final Memory: 53M/941M
[INFO] ------------------------------------------------------------------------
[ERROR] Failed to execute goal org.apache.maven.plugins:maven-surefire-plugin:2.12-TRUNK-HBASE-2:test
(secondPartTestsExecution) on project hbase: There are test failures.
[ERROR] 
[ERROR] Please refer to /x1/jenkins/jenkins-slave/workspace/HBase-0.94/trunk/target/surefire-reports
for the individual test results.
[ERROR] -> [Help 1]
org.apache.maven.lifecycle.LifecycleExecutionException: Failed to execute goal org.apache.maven.plugins:maven-surefire-plugin:2.12-TRUNK-HBASE-2:test
(secondPartTestsExecution) on project hbase: There are test failures.

Please refer to /x1/jenkins/jenkins-slave/workspace/HBase-0.94/trunk/target/surefire-reports
for the individual test results.
	at org.apache.maven.lifecycle.internal.MojoExecutor.execute(MojoExecutor.java:213)
	at org.apache.maven.lifecycle.internal.MojoExecutor.execute(MojoExecutor.java:153)
	at org.apache.maven.lifecycle.internal.MojoExecutor.execute(MojoExecutor.java:145)
	at org.apache.maven.lifecycle.internal.LifecycleModuleBuilder.buildProject(LifecycleModuleBuilder.java:84)
	at org.apache.maven.lifecycle.internal.LifecycleModuleBuilder.buildProject(LifecycleModuleBuilder.java:59)
	at org.apache.maven.lifecycle.internal.LifecycleStarter.singleThreadedBuild(LifecycleStarter.java:183)
	at org.apache.maven.lifecycle.internal.LifecycleStarter.execute(LifecycleStarter.java:161)
	at org.apache.maven.DefaultMaven.doExecute(DefaultMaven.java:319)
	at org.apache.maven.DefaultMaven.execute(DefaultMaven.java:156)
	at org.apache.maven.cli.MavenCli.execute(MavenCli.java:537)
	at org.apache.maven.cli.MavenCli.doMain(MavenCli.java:196)
	at org.apache.maven.cli.MavenCli.main(MavenCli.java:141)
	at sun.reflect.NativeMethodAccessorImpl.invoke0(Native Method)
	at sun.reflect.NativeMethodAccessorImpl.invoke(NativeMethodAccessorImpl.java:39)
	at sun.reflect.DelegatingMethodAccessorImpl.invoke(DelegatingMethodAccessorImpl.java:25)
	at java.lang.reflect.Method.invoke(Method.java:597)
	at org.codehaus.plexus.classworlds.launcher.Launcher.launchEnhanced(Launcher.java:290)
	at org.codehaus.plexus.classworlds.launcher.Launcher.launch(Launcher.java:230)
	at org.codehaus.plexus.classworlds.launcher.Launcher.mainWithExitCode(Launcher.java:409)
	at org.codehaus.plexus.classworlds.launcher.Launcher.main(Launcher.java:352)
Caused by: org.apache.maven.plugin.MojoFailureException: There are test failures.

Please refer to /x1/jenkins/jenkins-slave/workspace/HBase-0.94/trunk/target/surefire-reports
for the individual test results.
	at org.apache.maven.plugin.surefire.SurefireHelper.reportExecution(SurefireHelper.java:87)
	at org.apache.maven.plugin.surefire.SurefirePlugin.writeSummary(SurefirePlugin.java:651)
	at org.apache.maven.plugin.surefire.SurefirePlugin.handleSummary(SurefirePlugin.java:625)
	at org.apache.maven.plugin.surefire.AbstractSurefireMojo.executeAfterPreconditionsChecked(AbstractSurefireMojo.java:137)
	at org.apache.maven.plugin.surefire.AbstractSurefireMojo.execute(AbstractSurefireMojo.java:98)
	at org.apache.maven.plugin.DefaultBuildPluginManager.executeMojo(DefaultBuildPluginManager.java:101)
	at org.apache.maven.lifecycle.internal.MojoExecutor.execute(MojoExecutor.java:209)
	... 19 more
[ERROR] 
[ERROR] 
[ERROR] For more information about the errors and possible solutions, please read the following
articles:
[ERROR] [Help 1] http://cwiki.apache.org/confluence/display/MAVEN/MojoFailureException
Build step 'Invoke top-level Maven targets' marked build as failure
Archiving artifacts
Recording test results
Updating HBASE-5736

Mime
View raw message