hbase-dev mailing list archives

Site index · List index
Message view « Date » · « Thread »
Top « Date » · « Thread »
From Jonathan Hsieh <...@cloudera.com>
Subject Re: Build failed in Jenkins: HBase-0.92 #337
Date Sat, 24 Mar 2012 07:55:28 GMT
Sorry about this fellas.  Should be fixed now.  I didn't realize I missed
the step where I 'svn add' files that are new (and I bet in HBASE-5377, I
missed the step where I have to 'svn rm' files being removed).  I'll get
this right next time.

Thanks,
Jon.

On Fri, Mar 23, 2012 at 8:59 PM, Ted Yu <yuzhihong@gmail.com> wrote:

> Applied addendum to trunk so that Hadoop QA can function.
>
> The other 3 branches would be back to normal by Monday.
>
> On Fri, Mar 23, 2012 at 8:30 PM, lars hofhansl <lhofhansl@yahoo.com>
> wrote:
>
> > Uh oh, you broke the build Jon.
> >
> >
> >
> > ________________________________
> >  From: Apache Jenkins Server <jenkins@builds.apache.org>
> > To: dev@hbase.apache.org
> > Sent: Friday, March 23, 2012 5:40 PM
> > Subject: Build failed in Jenkins: HBase-0.92 #337
> >
> > See <https://builds.apache.org/job/HBase-0.92/337/changes>
> >
> > Changes:
> >
> > [jmhsieh] HBASE-5128 [uber hbck] Online automated repair of table
> > integrity and region consistency problems
> >
> > ------------------------------------------
> > [...truncated 5934 lines...]
> > [DEBUG]   (f) showDeprecation = false
> > [DEBUG]   (f) showWarnings = true
> > [DEBUG]   (f) source = 1.6
> > [DEBUG]   (f) staleMillis = 0
> > [DEBUG]   (f) target = 1.6
> > [DEBUG]   (f) verbose = false
> > [DEBUG] -- end configuration --
> > [DEBUG] Using compiler 'javac'.
> > [DEBUG] Source directories: [<
> > https://builds.apache.org/job/HBase-0.92/ws/trunk/src/main/java>
> > <
> >
> https://builds.apache.org/job/HBase-0.92/ws/trunk/target/generated-sources/java
> > >
> > <
> https://builds.apache.org/job/HBase-0.92/ws/trunk/target/generated-jamon
> > ]>
> > [DEBUG] Classpath: [<
> > https://builds.apache.org/job/HBase-0.92/ws/trunk/target/classes>
> > /home/jenkins/.m2/repository/com/google/guava/guava/r09/guava-r09.jar
> >
> >
> /home/jenkins/.m2/repository/commons-cli/commons-cli/1.2/commons-cli-1.2.jar
> >
> >
> /home/jenkins/.m2/repository/commons-configuration/commons-configuration/1.6/commons-configuration-1.6.jar
> >
> >
> /home/jenkins/.m2/repository/commons-collections/commons-collections/3.2.1/commons-collections-3.2.1.jar
> >
> >
> /home/jenkins/.m2/repository/commons-digester/commons-digester/1.8/commons-digester-1.8.jar
> >
> >
> /home/jenkins/.m2/repository/commons-beanutils/commons-beanutils/1.7.0/commons-beanutils-1.7.0.jar
> >
> >
> /home/jenkins/.m2/repository/commons-beanutils/commons-beanutils-core/1.8.0/commons-beanutils-core-1.8.0.jar
> >
> >
> /home/jenkins/.m2/repository/com/github/stephenc/high-scale-lib/high-scale-lib/1.1.1/high-scale-lib-1.1.1.jar
> >
> >
> /home/jenkins/.m2/repository/commons-codec/commons-codec/1.4/commons-codec-1.4.jar
> >
> >
> /home/jenkins/.m2/repository/commons-httpclient/commons-httpclient/3.1/commons-httpclient-3.1.jar
> >
> >
> /home/jenkins/.m2/repository/commons-lang/commons-lang/2.5/commons-lang-2.5.jar
> >
> >
> /home/jenkins/.m2/repository/commons-logging/commons-logging/1.1.1/commons-logging-1.1.1.jar
> > /home/jenkins/.m2/repository/log4j/log4j/1.2.16/log4j-1.2.16.jar
> > /home/jenkins/.m2/repository/org/apache/avro/avro/1.5.3/avro-1.5.3.jar
> > /home/jenkins/.m2/repository/org/xerial/snappy/snappy-java/
> > 1.0.3.2/snappy-java-1.0.3.2.jar
> >
> >
> /home/jenkins/.m2/repository/org/apache/avro/avro-ipc/1.5.3/avro-ipc-1.5.3.jar
> >
> >
> /home/jenkins/.m2/repository/org/jboss/netty/netty/3.2.4.Final/netty-3.2.4.Final.jar
> >
> >
> /home/jenkins/.m2/repository/org/apache/velocity/velocity/1.7/velocity-1.7.jar
> >
> >
> /home/jenkins/.m2/repository/org/apache/zookeeper/zookeeper/3.4.3/zookeeper-3.4.3.jar
> >
> >
> /home/jenkins/.m2/repository/org/apache/thrift/libthrift/0.7.0/libthrift-0.7.0.jar
> >
> >
> /home/jenkins/.m2/repository/javax/servlet/servlet-api/2.5/servlet-api-2.5.jar
> >
> >
> /home/jenkins/.m2/repository/org/apache/httpcomponents/httpclient/4.0.1/httpclient-4.0.1.jar
> >
> >
> /home/jenkins/.m2/repository/org/apache/httpcomponents/httpcore/4.0.1/httpcore-4.0.1.jar
> >
> >
> /home/jenkins/.m2/repository/org/jruby/jruby-complete/1.6.5/jruby-complete-1.6.5.jar
> >
> >
> /home/jenkins/.m2/repository/org/mortbay/jetty/jetty/6.1.26/jetty-6.1.26.jar
> >
> >
> /home/jenkins/.m2/repository/org/mortbay/jetty/jetty-util/6.1.26/jetty-util-6.1.26.jar
> >
> >
> /home/jenkins/.m2/repository/org/mortbay/jetty/jsp-2.1/6.1.14/jsp-2.1-6.1.14.jar
> > /home/jenkins/.m2/repository/org/eclipse/jdt/core/3.1.1/core-3.1.1.jar
> >
> >
> /home/jenkins/.m2/repository/org/mortbay/jetty/jsp-api-2.1/6.1.14/jsp-api-2.1-6.1.14.jar
> >
> >
> /home/jenkins/.m2/repository/org/mortbay/jetty/servlet-api-2.5/6.1.14/servlet-api-2.5-6.1.14.jar
> >
> >
> /home/jenkins/.m2/repository/org/codehaus/jackson/jackson-core-asl/1.5.5/jackson-core-asl-1.5.5.jar
> >
> >
> /home/jenkins/.m2/repository/org/codehaus/jackson/jackson-mapper-asl/1.5.5/jackson-mapper-asl-1.5.5.jar
> >
> >
> /home/jenkins/.m2/repository/org/codehaus/jackson/jackson-jaxrs/1.5.5/jackson-jaxrs-1.5.5.jar
> >
> >
> /home/jenkins/.m2/repository/org/codehaus/jackson/jackson-xc/1.5.5/jackson-xc-1.5.5.jar
> >
> /home/jenkins/.m2/repository/org/slf4j/slf4j-api/1.5.8/slf4j-api-1.5.8.jar
> >
> >
> /home/jenkins/.m2/repository/org/slf4j/slf4j-log4j12/1.5.8/slf4j-log4j12-1.5.8.jar
> > /home/jenkins/.m2/repository/commons-el/commons-el/1.0/commons-el-1.0.jar
> >
> >
> /home/jenkins/.m2/repository/org/jamon/jamon-runtime/2.3.1/jamon-runtime-2.3.1.jar
> >
> >
> /home/jenkins/.m2/repository/com/google/protobuf/protobuf-java/2.4.0a/protobuf-java-2.4.0a.jar
> >
> >
> /home/jenkins/.m2/repository/com/sun/jersey/jersey-core/1.4/jersey-core-1.4.jar
> >
> >
> /home/jenkins/.m2/repository/com/sun/jersey/jersey-json/1.4/jersey-json-1.4.jar
> >
> >
> /home/jenkins/.m2/repository/org/codehaus/jettison/jettison/1.1/jettison-1.1.jar
> >
> >
> /home/jenkins/.m2/repository/com/sun/xml/bind/jaxb-impl/2.1.12/jaxb-impl-2.1.12.jar
> >
> >
> /home/jenkins/.m2/repository/com/sun/jersey/jersey-server/1.4/jersey-server-1.4.jar
> > /home/jenkins/.m2/repository/asm/asm/3.1/asm-3.1.jar<
> http://1.0.3.2/snappy-java-1.0.3.2.jar%0A/home/jenkins/.m2/repository/org/apache/avro/avro-ipc/1.5.3/avro-ipc-1.5.3.jar%0A/home/jenkins/.m2/repository/org/jboss/netty/netty/3.2.4.Final/netty-3.2.4.Final.jar%0A/home/jenkins/.m2/repository/org/apache/velocity/velocity/1.7/velocity-1.7.jar%0A/home/jenkins/.m2/repository/org/apache/zookeeper/zookeeper/3.4.3/zookeeper-3.4.3.jar%0A/home/jenkins/.m2/repository/org/apache/thrift/libthrift/0.7.0/libthrift-0.7.0.jar%0A/home/jenkins/.m2/repository/javax/servlet/servlet-api/2.5/servlet-api-2.5.jar%0A/home/jenkins/.m2/repository/org/apache/httpcomponents/httpclient/4.0.1/httpclient-4.0.1.jar%0A/home/jenkins/.m2/repository/org/apache/httpcomponents/httpcore/4.0.1/httpcore-4.0.1.jar%0A/home/jenkins/.m2/repository/org/jruby/jruby-complete/1.6.5/jruby-complete-1.6.5.jar%0A/home/jenkins/.m2/repository/org/mortbay/jetty/jetty/6.1.26/jetty-6.1.26.jar%0A/home/jenkins/.m2/repository/org/mortbay/jetty/jetty-util/6.1.26/jetty-util-6.1.26.jar%0A/home/jenkins/.m2/repository/org/mortbay/jetty/jsp-2.1/6.1.14/jsp-2.1-6.1.14.jar%0A/home/jenkins/.m2/repository/org/eclipse/jdt/core/3.1.1/core-3.1.1.jar%0A/home/jenkins/.m2/repository/org/mortbay/jetty/jsp-api-2.1/6.1.14/jsp-api-2.1-6.1.14.jar%0A/home/jenkins/.m2/repository/org/mortbay/jetty/servlet-api-2.5/6.1.14/servlet-api-2.5-6.1.14.jar%0A/home/jenkins/.m2/repository/org/codehaus/jackson/jackson-core-asl/1.5.5/jackson-core-asl-1.5.5.jar%0A/home/jenkins/.m2/repository/org/codehaus/jackson/jackson-mapper-asl/1.5.5/jackson-mapper-asl-1.5.5.jar%0A/home/jenkins/.m2/repository/org/codehaus/jackson/jackson-jaxrs/1.5.5/jackson-jaxrs-1.5.5.jar%0A/home/jenkins/.m2/repository/org/codehaus/jackson/jackson-xc/1.5.5/jackson-xc-1.5.5.jar%0A/home/jenkins/.m2/repository/org/slf4j/slf4j-api/1.5.8/slf4j-api-1.5.8.jar%0A/home/jenkins/.m2/repository/org/slf4j/slf4j-log4j12/1.5.8/slf4j-log4j12-1.5.8.jar%0A/home/jenkins/.m2/repository/commons-el/commons-el/1.0/commons-el-1.0.jar%0A/home/jenkins/.m2/repository/org/jamon/jamon-runtime/2.3.1/jamon-runtime-2.3.1.jar%0A/home/jenkins/.m2/repository/com/google/protobuf/protobuf-java/2.4.0a/protobuf-java-2.4.0a.jar%0A/home/jenkins/.m2/repository/com/sun/jersey/jersey-core/1.4/jersey-core-1.4.jar%0A/home/jenkins/.m2/repository/com/sun/jersey/jersey-json/1.4/jersey-json-1.4.jar%0A/home/jenkins/.m2/repository/org/codehaus/jettison/jettison/1.1/jettison-1.1.jar%0A/home/jenkins/.m2/repository/com/sun/xml/bind/jaxb-impl/2.1.12/jaxb-impl-2.1.12.jar%0A/home/jenkins/.m2/repository/com/sun/jersey/jersey-server/1.4/jersey-server-1.4.jar%0A/home/jenkins/.m2/repository/asm/asm/3.1/asm-3.1.jar
> >
> > /home/jenkins/.m2/repository/javax/xml/bind/jaxb-api/2.1/jaxb-api-2.1.jar
> >
> >
> /home/jenkins/.m2/repository/javax/activation/activation/1.1/activation-1.1.jar
> > /home/jenkins/.m2/repository/stax/stax-api/1.0.1/stax-api-1.0.1.jar
> >
> >
> /home/jenkins/.m2/repository/org/apache/hadoop/hadoop-core/1.0.0/hadoop-core-1.0.0.jar
> > /home/jenkins/.m2/repository/xmlenc/xmlenc/0.52/xmlenc-0.52.jar
> >
> >
> /home/jenkins/.m2/repository/commons-net/commons-net/1.4.1/commons-net-1.4.1.jar]
> > [DEBUG] Output directory: <
> > https://builds.apache.org/job/HBase-0.92/ws/trunk/target/classes>
> > [DEBUG] Classpath:
> > [DEBUG]  <
> https://builds.apache.org/job/HBase-0.92/ws/trunk/target/classes
> > >
> > [DEBUG]
> > /home/jenkins/.m2/repository/com/google/guava/guava/r09/guava-r09.jar
> > [DEBUG]
> >
> /home/jenkins/.m2/repository/commons-cli/commons-cli/1.2/commons-cli-1.2.jar
> > [DEBUG]
> >
> /home/jenkins/.m2/repository/commons-configuration/commons-configuration/1.6/commons-configuration-1.6.jar
> > [DEBUG]
> >
> /home/jenkins/.m2/repository/commons-collections/commons-collections/3.2.1/commons-collections-3.2.1.jar
> > [DEBUG]
> >
> /home/jenkins/.m2/repository/commons-digester/commons-digester/1.8/commons-digester-1.8.jar
> > [DEBUG]
> >
> /home/jenkins/.m2/repository/commons-beanutils/commons-beanutils/1.7.0/commons-beanutils-1.7.0.jar
> > [DEBUG]
> >
> /home/jenkins/.m2/repository/commons-beanutils/commons-beanutils-core/1.8.0/commons-beanutils-core-1.8.0.jar
> > [DEBUG]
> >
> /home/jenkins/.m2/repository/com/github/stephenc/high-scale-lib/high-scale-lib/1.1.1/high-scale-lib-1.1.1.jar
> > [DEBUG]
> >
> /home/jenkins/.m2/repository/commons-codec/commons-codec/1.4/commons-codec-1.4.jar
> > [DEBUG]
> >
> /home/jenkins/.m2/repository/commons-httpclient/commons-httpclient/3.1/commons-httpclient-3.1.jar
> > [DEBUG]
> >
> /home/jenkins/.m2/repository/commons-lang/commons-lang/2.5/commons-lang-2.5.jar
> > [DEBUG]
> >
> /home/jenkins/.m2/repository/commons-logging/commons-logging/1.1.1/commons-logging-1.1.1.jar
> > [DEBUG]  /home/jenkins/.m2/repository/log4j/log4j/1.2.16/log4j-1.2.16.jar
> > [DEBUG]
> > /home/jenkins/.m2/repository/org/apache/avro/avro/1.5.3/avro-1.5.3.jar
> > [DEBUG]  /home/jenkins/.m2/repository/org/xerial/snappy/snappy-java/
> > 1.0.3.2/snappy-java-1.0.3.2.jar
> > [DEBUG]
> >
> /home/jenkins/.m2/repository/org/apache/avro/avro-ipc/1.5.3/avro-ipc-1.5.3.jar
> > [DEBUG]
> >
> /home/jenkins/.m2/repository/org/jboss/netty/netty/3.2.4.Final/netty-3.2.4.Final.jar
> > [DEBUG]
> >
> /home/jenkins/.m2/repository/org/apache/velocity/velocity/1.7/velocity-1.7.jar
> > [DEBUG]
> >
> /home/jenkins/.m2/repository/org/apache/zookeeper/zookeeper/3.4.3/zookeeper-3.4.3.jar
> > [DEBUG]
> >
> /home/jenkins/.m2/repository/org/apache/thrift/libthrift/0.7.0/libthrift-0.7.0.jar
> > [DEBUG]
> >
> /home/jenkins/.m2/repository/javax/servlet/servlet-api/2.5/servlet-api-2.5.jar
> > [DEBUG]
> >
> /home/jenkins/.m2/repository/org/apache/httpcomponents/httpclient/4.0.1/httpclient-4.0.1.jar
> > [DEBUG]
> >
> /home/jenkins/.m2/repository/org/apache/httpcomponents/httpcore/4.0.1/httpcore-4.0.1.jar
> > [DEBUG]
> >
> /home/jenkins/.m2/repository/org/jruby/jruby-complete/1.6.5/jruby-complete-1.6.5.jar
> > [DEBUG]
> >
> /home/jenkins/.m2/repository/org/mortbay/jetty/jetty/6.1.26/jetty-6.1.26.jar
> > [DEBUG]
> >
> /home/jenkins/.m2/repository/org/mortbay/jetty/jetty-util/6.1.26/jetty-util-6.1.26.jar
> > [DEBUG]
> >
> /home/jenkins/.m2/repository/org/mortbay/jetty/jsp-2.1/6.1.14/jsp-2.1-6.1.14.jar
> > [DEBUG]
> > /home/jenkins/.m2/repository/org/eclipse/jdt/core/3.1.1/core-3.1.1.jar
> > [DEBUG]
> >
> /home/jenkins/.m2/repository/org/mortbay/jetty/jsp-api-2.1/6.1.14/jsp-api-2.1-6.1.14.jar
> > [DEBUG]
> >
> /home/jenkins/.m2/repository/org/mortbay/jetty/servlet-api-2.5/6.1.14/servlet-api-2.5-6.1.14.jar
> > [DEBUG]
> >
> /home/jenkins/.m2/repository/org/codehaus/jackson/jackson-core-asl/1.5.5/jackson-core-asl-1.5.5.jar
> > [DEBUG]
> >
> /home/jenkins/.m2/repository/org/codehaus/jackson/jackson-mapper-asl/1.5.5/jackson-mapper-asl-1.5.5.jar
> > [DEBUG]
> >
> /home/jenkins/.m2/repository/org/codehaus/jackson/jackson-jaxrs/1.5.5/jackson-jaxrs-1.5.5.jar
> > [DEBUG]
> >
> /home/jenkins/.m2/repository/org/codehaus/jackson/jackson-xc/1.5.5/jackson-xc-1.5.5.jar
> > [DEBUG]
> >
> /home/jenkins/.m2/repository/org/slf4j/slf4j-api/1.5.8/slf4j-api-1.5.8.jar
> > [DEBUG]
> >
> /home/jenkins/.m2/repository/org/slf4j/slf4j-log4j12/1.5.8/slf4j-log4j12-1.5.8.jar
> > [DEBUG]
> > /home/jenkins/.m2/repository/commons-el/commons-el/1.0/commons-el-1.0.jar
> > [DEBUG]
> >
> /home/jenkins/.m2/repository/org/jamon/jamon-runtime/2.3.1/jamon-runtime-2.3.1.jar
> > [DEBUG]
> >
> /home/jenkins/.m2/repository/com/google/protobuf/protobuf-java/2.4.0a/protobuf-java-2.4.0a.jar
> > [DEBUG]
> >
> /home/jenkins/.m2/repository/com/sun/jersey/jersey-core/1.4/jersey-core-1.4.jar
> > [DEBUG]
> >
> /home/jenkins/.m2/repository/com/sun/jersey/jersey-json/1.4/jersey-json-1.4.jar
> > [DEBUG]
> >
> /home/jenkins/.m2/repository/org/codehaus/jettison/jettison/1.1/jettison-1.1.jar
> > [DEBUG]
> >
> /home/jenkins/.m2/repository/com/sun/xml/bind/jaxb-impl/2.1.12/jaxb-impl-2.1.12.jar
> > [DEBUG]
> >
> /home/jenkins/.m2/repository/com/sun/jersey/jersey-server/1.4/jersey-server-1.4.jar
> > [DEBUG]  /home/jenkins/.m2/repository/asm/asm/3.1/asm-3.1.jar
> > [DEBUG]
> > /home/jenkins/.m2/repository/javax/xml/bind/jaxb-api/2.1/jaxb-api-2.1.jar
> > [DEBUG]
> >
> /home/jenkins/.m2/repository/javax/activation/activation/1.1/activation-1.1.jar
> > [DEBUG]
> > /home/jenkins/.m2/repository/stax/stax-api/1.0.1/stax-api-1.0.1.jar
> > [DEBUG]
> >
> /home/jenkins/.m2/repository/org/apache/hadoop/hadoop-core/1.0.0/hadoop-core-1.0.0.jar
> > [DEBUG]  /home/jenkins/.m2/repository/xmlenc/xmlenc/0.52/xmlenc-0.52.jar
> > [DEBUG]
> >
> /home/jenkins/.m2/repository/commons-net/commons-net/1.4.1/commons-net-1.4.1.jar
> > [DEBUG] Source roots:
> > [DEBUG]  <
> https://builds.apache.org/job/HBase-0.92/ws/trunk/src/main/java>
> > [DEBUG]  <
> >
> https://builds.apache.org/job/HBase-0.92/ws/trunk/target/generated-sources/java
> > >
> > [DEBUG]  <
> > https://builds.apache.org/job/HBase-0.92/ws/trunk/target/generated-jamon
> >
> > [INFO] Compiling 613 source files to <
> > https://builds.apache.org/job/HBase-0.92/ws/trunk/target/classes>
> > [INFO]
> > ------------------------------------------------------------------------
> > [INFO] BUILD FAILURE
> > [INFO]
> > ------------------------------------------------------------------------
> > [INFO] Total time: 37.381s
> > [INFO] Finished at: Sat Mar 24 00:40:40 UTC 2012
> > [INFO] Final Memory: 38M/477M
> > [INFO]
> > ------------------------------------------------------------------------
> > [ERROR] Failed to execute goal
> > org.apache.maven.plugins:maven-compiler-plugin:2.0.2:compile
> > (default-compile) on project hbase: Compilation failure: Compilation
> > failure:
> > [ERROR] <
> >
> https://builds.apache.org/job/HBase-0.92/ws/trunk/src/main/java/org/apache/hadoop/hbase/util/Bytes.java
> >:[44,15]
> > sun.misc.Unsafe is Sun proprietary API and may be removed in a future
> > release
> > [ERROR]
> > [ERROR] <
> >
> https://builds.apache.org/job/HBase-0.92/ws/trunk/src/main/java/org/apache/hadoop/hbase/util/HBaseFsck.java
> >:[74,40]
> > cannot find symbol
> > [ERROR] symbol  : class TableIntegrityErrorHandler
> > [ERROR] location: package org.apache.hadoop.hbase.util.hbck
> > [ERROR]
> > [ERROR] <
> >
> https://builds.apache.org/job/HBase-0.92/ws/trunk/src/main/java/org/apache/hadoop/hbase/util/HBaseFsck.java
> >:[75,40]
> > cannot find symbol
> > [ERROR] symbol  : class TableIntegrityErrorHandlerImpl
> > [ERROR] location: package org.apache.hadoop.hbase.util.hbck
> > [ERROR]
> > [ERROR] <
> >
> https://builds.apache.org/job/HBase-0.92/ws/trunk/src/main/java/org/apache/hadoop/hbase/util/HBaseFsck.java
> >:[1809,36]
> > cannot find symbol
> > [ERROR] symbol  : class TableIntegrityErrorHandler
> > [ERROR] location: class org.apache.hadoop.hbase.util.HBaseFsck.TableInfo
> > [ERROR]
> > [ERROR] <
> >
> https://builds.apache.org/job/HBase-0.92/ws/trunk/src/main/java/org/apache/hadoop/hbase/util/HBaseFsck.java
> >:[1590,48]
> > cannot find symbol
> > [ERROR] symbol  : class TableIntegrityErrorHandlerImpl
> > [ERROR] location: class org.apache.hadoop.hbase.util.HBaseFsck.TableInfo
> > [ERROR]
> > [ERROR] <
> >
> https://builds.apache.org/job/HBase-0.92/ws/trunk/src/main/java/org/apache/hadoop/hbase/util/Bytes.java
> >:[1035,19]
> > sun.misc.Unsafe is Sun proprietary API and may be removed in a future
> > release
> > [ERROR]
> > [ERROR] <
> >
> https://builds.apache.org/job/HBase-0.92/ws/trunk/src/main/java/org/apache/hadoop/hbase/util/Bytes.java
> >:[1041,21]
> > sun.misc.Unsafe is Sun proprietary API and may be removed in a future
> > release
> > [ERROR]
> > [ERROR] <
> >
> https://builds.apache.org/job/HBase-0.92/ws/trunk/src/main/java/org/apache/hadoop/hbase/util/Bytes.java
> >:[1046,28]
> > sun.misc.Unsafe is Sun proprietary API and may be removed in a future
> > release
> > [ERROR]
> > [ERROR] <
> >
> https://builds.apache.org/job/HBase-0.92/ws/trunk/src/main/java/org/apache/hadoop/hbase/util/HBaseFsck.java
> >:[726,6]
> > cannot find symbol
> > [ERROR] symbol  : class TableIntegrityErrorHandler
> > [ERROR] location: class org.apache.hadoop.hbase.util.HBaseFsck
> > [ERROR]
> > [ERROR] <
> >
> https://builds.apache.org/job/HBase-0.92/ws/trunk/src/main/java/org/apache/hadoop/hbase/util/HBaseFsck.java
> >:[799,6]
> > cannot find symbol
> > [ERROR] symbol  : class TableIntegrityErrorHandler
> > [ERROR] location: class org.apache.hadoop.hbase.util.HBaseFsck
> > [ERROR]
> > [ERROR] <
> >
> https://builds.apache.org/job/HBase-0.92/ws/trunk/src/main/java/org/apache/hadoop/hbase/util/HBaseFsck.java
> >:[1451,6]
> > cannot find symbol
> > [ERROR] symbol  : class TableIntegrityErrorHandler
> > [ERROR] location: class org.apache.hadoop.hbase.util.HBaseFsck
> > [ERROR]
> > [ERROR] <
> >
> https://builds.apache.org/job/HBase-0.92/ws/trunk/src/main/java/org/apache/hadoop/hbase/util/HBaseFsck.java
> >:[1603,12]
> > cannot find symbol
> > [ERROR] symbol  : method getTableInfo()
> > [ERROR] location: class
> > org.apache.hadoop.hbase.util.HBaseFsck.TableInfo.IntegrityFixSuggester
> > [ERROR]
> > [ERROR] <
> >
> https://builds.apache.org/job/HBase-0.92/ws/trunk/src/main/java/org/apache/hadoop/hbase/util/HBaseFsck.java
> >:[1598,6]
> > method does not override or implement a method from a supertype
> > [ERROR]
> > [ERROR] <
> >
> https://builds.apache.org/job/HBase-0.92/ws/trunk/src/main/java/org/apache/hadoop/hbase/util/HBaseFsck.java
> >:[1609,54]
> > cannot find symbol
> > [ERROR] symbol  : method getTableInfo()
> > [ERROR] location: class
> > org.apache.hadoop.hbase.util.HBaseFsck.TableInfo.IntegrityFixSuggester
> > [ERROR]
> > [ERROR] <
> >
> https://builds.apache.org/job/HBase-0.92/ws/trunk/src/main/java/org/apache/hadoop/hbase/util/HBaseFsck.java
> >:[1606,6]
> > method does not override or implement a method from a supertype
> > [ERROR]
> > [ERROR] <
> >
> https://builds.apache.org/job/HBase-0.92/ws/trunk/src/main/java/org/apache/hadoop/hbase/util/HBaseFsck.java
> >:[1618,41]
> > cannot find symbol
> > [ERROR] symbol  : method getTableInfo()
> > [ERROR] location: class
> > org.apache.hadoop.hbase.util.HBaseFsck.TableInfo.IntegrityFixSuggester
> > [ERROR]
> > [ERROR] <
> >
> https://builds.apache.org/job/HBase-0.92/ws/trunk/src/main/java/org/apache/hadoop/hbase/util/HBaseFsck.java
> >:[1621,41]
> > cannot find symbol
> > [ERROR] symbol  : method getTableInfo()
> > [ERROR] location: class
> > org.apache.hadoop.hbase.util.HBaseFsck.TableInfo.IntegrityFixSuggester
> > [ERROR]
> > [ERROR] <
> >
> https://builds.apache.org/job/HBase-0.92/ws/trunk/src/main/java/org/apache/hadoop/hbase/util/HBaseFsck.java
> >:[1612,6]
> > method does not override or implement a method from a supertype
> > [ERROR]
> > [ERROR] <
> >
> https://builds.apache.org/job/HBase-0.92/ws/trunk/src/main/java/org/apache/hadoop/hbase/util/HBaseFsck.java
> >:[1628,12]
> > cannot find symbol
> > [ERROR] symbol  : method getTableInfo()
> > [ERROR] location: class
> > org.apache.hadoop.hbase.util.HBaseFsck.TableInfo.IntegrityFixSuggester
> > [ERROR]
> > [ERROR] <
> >
> https://builds.apache.org/job/HBase-0.92/ws/trunk/src/main/java/org/apache/hadoop/hbase/util/HBaseFsck.java
> >:[1624,6]
> > method does not override or implement a method from a supertype
> > [ERROR]
> > [ERROR] <
> >
> https://builds.apache.org/job/HBase-0.92/ws/trunk/src/main/java/org/apache/hadoop/hbase/util/HBaseFsck.java
> >:[1631,6]
> > method does not override or implement a method from a supertype
> > [ERROR]
> > [ERROR] <
> >
> https://builds.apache.org/job/HBase-0.92/ws/trunk/src/main/java/org/apache/hadoop/hbase/util/HBaseFsck.java
> >:[1677,12]
> > cannot find symbol
> > [ERROR] symbol  : method getTableInfo()
> > [ERROR] location: class
> > org.apache.hadoop.hbase.util.HBaseFsck.TableInfo.HDFSIntegrityFixer
> > [ERROR]
> > [ERROR] <
> >
> https://builds.apache.org/job/HBase-0.92/ws/trunk/src/main/java/org/apache/hadoop/hbase/util/HBaseFsck.java
> >:[1678,31]
> > cannot find symbol
> > [ERROR] symbol  : method getTableInfo()
> > [ERROR] location: class
> > org.apache.hadoop.hbase.util.HBaseFsck.TableInfo.HDFSIntegrityFixer
> > [ERROR]
> > [ERROR] <
> >
> https://builds.apache.org/job/HBase-0.92/ws/trunk/src/main/java/org/apache/hadoop/hbase/util/HBaseFsck.java
> >:[1702,31]
> > cannot find symbol
> > [ERROR] symbol  : method getTableInfo()
> > [ERROR] location: class
> > org.apache.hadoop.hbase.util.HBaseFsck.TableInfo.HDFSIntegrityFixer
> > [ERROR]
> > [ERROR] <
> >
> https://builds.apache.org/job/HBase-0.92/ws/trunk/src/main/java/org/apache/hadoop/hbase/util/HBaseFsck.java
> >:[1778,31]
> > cannot find symbol
> > [ERROR] symbol  : method getTableInfo()
> > [ERROR] location: class
> > org.apache.hadoop.hbase.util.HBaseFsck.TableInfo.HDFSIntegrityFixer
> > [ERROR]
> > [ERROR] <
> >
> https://builds.apache.org/job/HBase-0.92/ws/trunk/src/main/java/org/apache/hadoop/hbase/util/HBaseFsck.java
> >:[1718,6]
> > method does not override or implement a method from a supertype
> > [ERROR] -> [Help 1]
> > org.apache.maven.lifecycle.LifecycleExecutionException: Failed to execute
> > goal org.apache.maven.plugins:maven-compiler-plugin:2.0.2:compile
> > (default-compile) on project hbase: Compilation failure
> >     at
> >
> org.apache.maven.lifecycle.internal.MojoExecutor.execute(MojoExecutor.java:213)
> >     at
> >
> org.apache.maven.lifecycle.internal.MojoExecutor.execute(MojoExecutor.java:153)
> >     at
> >
> org.apache.maven.lifecycle.internal.MojoExecutor.execute(MojoExecutor.java:145)
> >     at
> >
> org.apache.maven.lifecycle.internal.LifecycleModuleBuilder.buildProject(LifecycleModuleBuilder.java:84)
> >     at
> >
> org.apache.maven.lifecycle.internal.LifecycleModuleBuilder.buildProject(LifecycleModuleBuilder.java:59)
> >     at
> >
> org.apache.maven.lifecycle.internal.LifecycleStarter.singleThreadedBuild(LifecycleStarter.java:183)
> >     at
> >
> org.apache.maven.lifecycle.internal.LifecycleStarter.execute(LifecycleStarter.java:161)
> >     at org.apache.maven.DefaultMaven.doExecute(DefaultMaven.java:319)
> >     at org.apache.maven.DefaultMaven.execute(DefaultMaven.java:156)
> >     at org.apache.maven.cli.MavenCli.execute(MavenCli.java:537)
> >     at org.apache.maven.cli.MavenCli.doMain(MavenCli.java:196)
> >     at org.apache.maven.cli.MavenCli.main(MavenCli.java:141)
> >     at sun.reflect.NativeMethodAccessorImpl.invoke0(Native Method)
> >     at
> >
> sun.reflect.NativeMethodAccessorImpl.invoke(NativeMethodAccessorImpl.java:39)
> >     at
> >
> sun.reflect.DelegatingMethodAccessorImpl.invoke(DelegatingMethodAccessorImpl.java:25)
> >     at java.lang.reflect.Method.invoke(Method.java:597)
> >     at
> >
> org.codehaus.plexus.classworlds.launcher.Launcher.launchEnhanced(Launcher.java:290)
> >     at
> >
> org.codehaus.plexus.classworlds.launcher.Launcher.launch(Launcher.java:230)
> >     at
> >
> org.codehaus.plexus.classworlds.launcher.Launcher.mainWithExitCode(Launcher.java:409)
> >     at
> > org.codehaus.plexus.classworlds.launcher.Launcher.main(Launcher.java:352)
> > Caused by: org.apache.maven.plugin.CompilationFailureException:
> > Compilation failure
> >     at
> >
> org.apache.maven.plugin.AbstractCompilerMojo.execute(AbstractCompilerMojo.java:516)
> >     at
> org.apache.maven.plugin.CompilerMojo.execute(CompilerMojo.java:114)
> >     at
> >
> org.apache.maven.plugin.DefaultBuildPluginManager.executeMojo(DefaultBuildPluginManager.java:101)
> >     at
> >
> org.apache.maven.lifecycle.internal.MojoExecutor.execute(MojoExecutor.java:209)
> >     ... 19 more
> > [ERROR]
> > [ERROR]
> > [ERROR] For more information about the errors and possible solutions,
> > please read the following articles:
> > [ERROR] [Help 1]
> > http://cwiki.apache.org/confluence/display/MAVEN/MojoFailureException
> > Build step 'Invoke top-level Maven targets' marked build as failure
> > Archiving artifacts
> > Updating HBASE-5128
> > Recording test results
> >
>



-- 
// Jonathan Hsieh (shay)
// Software Engineer, Cloudera
// jon@cloudera.com

Mime
  • Unnamed multipart/alternative (inline, None, 0 bytes)
View raw message