hbase-dev mailing list archives

Site index · List index
Message view « Date » · « Thread »
Top « Date » · « Thread »
From Apache Jenkins Server <jenk...@builds.apache.org>
Subject Build failed in Jenkins: HBase-0.94 #56
Date Mon, 26 Mar 2012 19:21:49 GMT
See <https://builds.apache.org/job/HBase-0.94/56/changes>

Changes:

[jdcryans] HBASE-5190 Limit the IPC queue size based on calls' payload size
           (Ted's addendum)

------------------------------------------
[...truncated 7083 lines...]
Running org.apache.hadoop.hbase.util.TestFSUtils
Tests run: 3, Failures: 0, Errors: 0, Skipped: 0, Time elapsed: 36.092 sec
Forking command line: /bin/sh -c cd <https://builds.apache.org/job/HBase-0.94/ws/trunk>
&& /home/hudson/tools/java/jdk1.6.0_27-32/jre/bin/java -enableassertions -Xmx1900m
-Djava.security.egd=file:/dev/./urandom -jar <https://builds.apache.org/job/HBase-0.94/ws/trunk/target/surefire/surefirebooter9124990757583846042.jar>
<https://builds.apache.org/job/HBase-0.94/ws/trunk/target/surefire/surefire940908223627525379tmp>
<https://builds.apache.org/job/HBase-0.94/ws/trunk/target/surefire/surefire_606225270310144380994tmp>
Running org.apache.hadoop.hbase.util.hbck.TestOfflineMetaRebuildOverlap
Tests run: 1, Failures: 0, Errors: 0, Skipped: 0, Time elapsed: 24.875 sec
Forking command line: /bin/sh -c cd <https://builds.apache.org/job/HBase-0.94/ws/trunk>
&& /home/hudson/tools/java/jdk1.6.0_27-32/jre/bin/java -enableassertions -Xmx1900m
-Djava.security.egd=file:/dev/./urandom -jar <https://builds.apache.org/job/HBase-0.94/ws/trunk/target/surefire/surefirebooter3048412397061208781.jar>
<https://builds.apache.org/job/HBase-0.94/ws/trunk/target/surefire/surefire8175876495610538489tmp>
<https://builds.apache.org/job/HBase-0.94/ws/trunk/target/surefire/surefire_614882534128047748046tmp>
Running org.apache.hadoop.hbase.util.hbck.TestOfflineMetaRebuildBase
Tests run: 1, Failures: 0, Errors: 0, Skipped: 0, Time elapsed: 25.103 sec
Forking command line: /bin/sh -c cd <https://builds.apache.org/job/HBase-0.94/ws/trunk>
&& /home/hudson/tools/java/jdk1.6.0_27-32/jre/bin/java -enableassertions -Xmx1900m
-Djava.security.egd=file:/dev/./urandom -jar <https://builds.apache.org/job/HBase-0.94/ws/trunk/target/surefire/surefirebooter76634889366966833.jar>
<https://builds.apache.org/job/HBase-0.94/ws/trunk/target/surefire/surefire2205945319573044808tmp>
<https://builds.apache.org/job/HBase-0.94/ws/trunk/target/surefire/surefire_62298892855556746171tmp>
Running org.apache.hadoop.hbase.util.TestPoolMap$TestRoundRobinPoolType
Tests run: 3, Failures: 0, Errors: 0, Skipped: 0, Time elapsed: 0.013 sec
Running org.apache.hadoop.hbase.util.TestPoolMap$TestThreadLocalPoolType
Tests run: 3, Failures: 0, Errors: 0, Skipped: 0, Time elapsed: 0.008 sec
Running org.apache.hadoop.hbase.util.TestPoolMap$TestReusablePoolType
Tests run: 3, Failures: 0, Errors: 0, Skipped: 0, Time elapsed: 0.037 sec
Forking command line: /bin/sh -c cd <https://builds.apache.org/job/HBase-0.94/ws/trunk>
&& /home/hudson/tools/java/jdk1.6.0_27-32/jre/bin/java -enableassertions -Xmx1900m
-Djava.security.egd=file:/dev/./urandom -jar <https://builds.apache.org/job/HBase-0.94/ws/trunk/target/surefire/surefirebooter6350675278713085684.jar>
<https://builds.apache.org/job/HBase-0.94/ws/trunk/target/surefire/surefire5210710517730153711tmp>
<https://builds.apache.org/job/HBase-0.94/ws/trunk/target/surefire/surefire_633627636091428658148tmp>
Running org.apache.hadoop.hbase.util.TestIdLock
Tests run: 1, Failures: 0, Errors: 0, Skipped: 0, Time elapsed: 15.289 sec
Forking command line: /bin/sh -c cd <https://builds.apache.org/job/HBase-0.94/ws/trunk>
&& /home/hudson/tools/java/jdk1.6.0_27-32/jre/bin/java -enableassertions -Xmx1900m
-Djava.security.egd=file:/dev/./urandom -jar <https://builds.apache.org/job/HBase-0.94/ws/trunk/target/surefire/surefirebooter197032542892318617.jar>
<https://builds.apache.org/job/HBase-0.94/ws/trunk/target/surefire/surefire8082116093023835480tmp>
<https://builds.apache.org/job/HBase-0.94/ws/trunk/target/surefire/surefire_64837717772900040954tmp>
Running org.apache.hadoop.hbase.util.hbck.TestOfflineMetaRebuildHole
Tests run: 1, Failures: 0, Errors: 0, Skipped: 0, Time elapsed: 23.929 sec
Forking command line: /bin/sh -c cd <https://builds.apache.org/job/HBase-0.94/ws/trunk>
&& /home/hudson/tools/java/jdk1.6.0_27-32/jre/bin/java -enableassertions -Xmx1900m
-Djava.security.egd=file:/dev/./urandom -jar <https://builds.apache.org/job/HBase-0.94/ws/trunk/target/surefire/surefirebooter1574487971766562679.jar>
<https://builds.apache.org/job/HBase-0.94/ws/trunk/target/surefire/surefire779041712413359180tmp>
<https://builds.apache.org/job/HBase-0.94/ws/trunk/target/surefire/surefire_658175608067970131110tmp>
Running org.apache.hadoop.hbase.util.TestDefaultEnvironmentEdge
Tests run: 1, Failures: 0, Errors: 0, Skipped: 0, Time elapsed: 0.201 sec
Forking command line: /bin/sh -c cd <https://builds.apache.org/job/HBase-0.94/ws/trunk>
&& /home/hudson/tools/java/jdk1.6.0_27-32/jre/bin/java -enableassertions -Xmx1900m
-Djava.security.egd=file:/dev/./urandom -jar <https://builds.apache.org/job/HBase-0.94/ws/trunk/target/surefire/surefirebooter6538421314552373383.jar>
<https://builds.apache.org/job/HBase-0.94/ws/trunk/target/surefire/surefire7824336452549637168tmp>
<https://builds.apache.org/job/HBase-0.94/ws/trunk/target/surefire/surefire_665434227099014117021tmp>
Running org.apache.hadoop.hbase.util.TestFSTableDescriptors
Tests run: 10, Failures: 0, Errors: 0, Skipped: 0, Time elapsed: 1.017 sec
Forking command line: /bin/sh -c cd <https://builds.apache.org/job/HBase-0.94/ws/trunk>
&& /home/hudson/tools/java/jdk1.6.0_27-32/jre/bin/java -enableassertions -Xmx1900m
-Djava.security.egd=file:/dev/./urandom -jar <https://builds.apache.org/job/HBase-0.94/ws/trunk/target/surefire/surefirebooter8148808559029647876.jar>
<https://builds.apache.org/job/HBase-0.94/ws/trunk/target/surefire/surefire1621675401196032305tmp>
<https://builds.apache.org/job/HBase-0.94/ws/trunk/target/surefire/surefire_674855607186259323217tmp>
Running org.apache.hadoop.hbase.util.TestEnvironmentEdgeManager
Tests run: 2, Failures: 0, Errors: 0, Skipped: 0, Time elapsed: 0.386 sec
Forking command line: /bin/sh -c cd <https://builds.apache.org/job/HBase-0.94/ws/trunk>
&& /home/hudson/tools/java/jdk1.6.0_27-32/jre/bin/java -enableassertions -Xmx1900m
-Djava.security.egd=file:/dev/./urandom -jar <https://builds.apache.org/job/HBase-0.94/ws/trunk/target/surefire/surefirebooter4138484089976031014.jar>
<https://builds.apache.org/job/HBase-0.94/ws/trunk/target/surefire/surefire1300825713696054214tmp>
<https://builds.apache.org/job/HBase-0.94/ws/trunk/target/surefire/surefire_682437560906351266215tmp>
Running org.apache.hadoop.hbase.util.TestRegionSplitter
Tests run: 5, Failures: 0, Errors: 0, Skipped: 0, Time elapsed: 35.855 sec
Forking command line: /bin/sh -c cd <https://builds.apache.org/job/HBase-0.94/ws/trunk>
&& /home/hudson/tools/java/jdk1.6.0_27-32/jre/bin/java -enableassertions -Xmx1900m
-Djava.security.egd=file:/dev/./urandom -jar <https://builds.apache.org/job/HBase-0.94/ws/trunk/target/surefire/surefirebooter7854619024709433227.jar>
<https://builds.apache.org/job/HBase-0.94/ws/trunk/target/surefire/surefire2080413567443242969tmp>
<https://builds.apache.org/job/HBase-0.94/ws/trunk/target/surefire/surefire_697996702245809072744tmp>
Running org.apache.hadoop.hbase.regionserver.TestStoreFileBlockCacheSummary
Tests run: 1, Failures: 0, Errors: 0, Skipped: 0, Time elapsed: 17.584 sec
Forking command line: /bin/sh -c cd <https://builds.apache.org/job/HBase-0.94/ws/trunk>
&& /home/hudson/tools/java/jdk1.6.0_27-32/jre/bin/java -enableassertions -Xmx1900m
-Djava.security.egd=file:/dev/./urandom -jar <https://builds.apache.org/job/HBase-0.94/ws/trunk/target/surefire/surefirebooter7694517990801751400.jar>
<https://builds.apache.org/job/HBase-0.94/ws/trunk/target/surefire/surefire1399370501782937711tmp>
<https://builds.apache.org/job/HBase-0.94/ws/trunk/target/surefire/surefire_705160378460655490686tmp>
Running org.apache.hadoop.hbase.regionserver.TestStore
Tests run: 12, Failures: 0, Errors: 0, Skipped: 0, Time elapsed: 9.444 sec
Forking command line: /bin/sh -c cd <https://builds.apache.org/job/HBase-0.94/ws/trunk>
&& /home/hudson/tools/java/jdk1.6.0_27-32/jre/bin/java -enableassertions -Xmx1900m
-Djava.security.egd=file:/dev/./urandom -jar <https://builds.apache.org/job/HBase-0.94/ws/trunk/target/surefire/surefirebooter510935117493080525.jar>
<https://builds.apache.org/job/HBase-0.94/ws/trunk/target/surefire/surefire179896187895871943tmp>
<https://builds.apache.org/job/HBase-0.94/ws/trunk/target/surefire/surefire_715792211036883600250tmp>
Running org.apache.hadoop.hbase.regionserver.TestRegionServerMetrics
Tests run: 1, Failures: 0, Errors: 0, Skipped: 0, Time elapsed: 40.98 sec
Forking command line: /bin/sh -c cd <https://builds.apache.org/job/HBase-0.94/ws/trunk>
&& /home/hudson/tools/java/jdk1.6.0_27-32/jre/bin/java -enableassertions -Xmx1900m
-Djava.security.egd=file:/dev/./urandom -jar <https://builds.apache.org/job/HBase-0.94/ws/trunk/target/surefire/surefirebooter702686454343775674.jar>
<https://builds.apache.org/job/HBase-0.94/ws/trunk/target/surefire/surefire7167939673563214663tmp>
<https://builds.apache.org/job/HBase-0.94/ws/trunk/target/surefire/surefire_726767873946322642821tmp>
Running org.apache.hadoop.hbase.regionserver.handler.TestOpenRegionHandler
Tests run: 3, Failures: 0, Errors: 0, Skipped: 0, Time elapsed: 1.171 sec
Forking command line: /bin/sh -c cd <https://builds.apache.org/job/HBase-0.94/ws/trunk>
&& /home/hudson/tools/java/jdk1.6.0_27-32/jre/bin/java -enableassertions -Xmx1900m
-Djava.security.egd=file:/dev/./urandom -jar <https://builds.apache.org/job/HBase-0.94/ws/trunk/target/surefire/surefirebooter999401666103336566.jar>
<https://builds.apache.org/job/HBase-0.94/ws/trunk/target/surefire/surefire5679243221606304034tmp>
<https://builds.apache.org/job/HBase-0.94/ws/trunk/target/surefire/surefire_734455108560836837953tmp>
Running org.apache.hadoop.hbase.regionserver.handler.TestCloseRegionHandler
Tests run: 3, Failures: 0, Errors: 0, Skipped: 0, Time elapsed: 1.452 sec
Forking command line: /bin/sh -c cd <https://builds.apache.org/job/HBase-0.94/ws/trunk>
&& /home/hudson/tools/java/jdk1.6.0_27-32/jre/bin/java -enableassertions -Xmx1900m
-Djava.security.egd=file:/dev/./urandom -jar <https://builds.apache.org/job/HBase-0.94/ws/trunk/target/surefire/surefirebooter1756892342911078905.jar>
<https://builds.apache.org/job/HBase-0.94/ws/trunk/target/surefire/surefire7365726424251304535tmp>
<https://builds.apache.org/job/HBase-0.94/ws/trunk/target/surefire/surefire_747899408778612029034tmp>
Running org.apache.hadoop.hbase.regionserver.TestParallelPut
Tests run: 2, Failures: 0, Errors: 0, Skipped: 0, Time elapsed: 5.444 sec
Forking command line: /bin/sh -c cd <https://builds.apache.org/job/HBase-0.94/ws/trunk>
&& /home/hudson/tools/java/jdk1.6.0_27-32/jre/bin/java -enableassertions -Xmx1900m
-Djava.security.egd=file:/dev/./urandom -jar <https://builds.apache.org/job/HBase-0.94/ws/trunk/target/surefire/surefirebooter8525720392150492541.jar>
<https://builds.apache.org/job/HBase-0.94/ws/trunk/target/surefire/surefire4638108656346656977tmp>
<https://builds.apache.org/job/HBase-0.94/ws/trunk/target/surefire/surefire_751712480783923063206tmp>
Running org.apache.hadoop.hbase.regionserver.TestServerCustomProtocol
Tests run: 7, Failures: 0, Errors: 0, Skipped: 0, Time elapsed: 17.688 sec
Forking command line: /bin/sh -c cd <https://builds.apache.org/job/HBase-0.94/ws/trunk>
&& /home/hudson/tools/java/jdk1.6.0_27-32/jre/bin/java -enableassertions -Xmx1900m
-Djava.security.egd=file:/dev/./urandom -jar <https://builds.apache.org/job/HBase-0.94/ws/trunk/target/surefire/surefirebooter3831314773326333670.jar>
<https://builds.apache.org/job/HBase-0.94/ws/trunk/target/surefire/surefire164381491375964287tmp>
<https://builds.apache.org/job/HBase-0.94/ws/trunk/target/surefire/surefire_763063513673170346553tmp>
Running org.apache.hadoop.hbase.regionserver.TestAtomicOperation
Tests run: 5, Failures: 0, Errors: 0, Skipped: 0, Time elapsed: 26.703 sec
Forking command line: /bin/sh -c cd <https://builds.apache.org/job/HBase-0.94/ws/trunk>
&& /home/hudson/tools/java/jdk1.6.0_27-32/jre/bin/java -enableassertions -Xmx1900m
-Djava.security.egd=file:/dev/./urandom -jar <https://builds.apache.org/job/HBase-0.94/ws/trunk/target/surefire/surefirebooter3560531034884965.jar>
<https://builds.apache.org/job/HBase-0.94/ws/trunk/target/surefire/surefire4894379664622874780tmp>
<https://builds.apache.org/job/HBase-0.94/ws/trunk/target/surefire/surefire_77925700057387295356tmp>
Running org.apache.hadoop.hbase.regionserver.TestBlocksRead
Tests run: 4, Failures: 0, Errors: 0, Skipped: 0, Time elapsed: 1.476 sec
Forking command line: /bin/sh -c cd <https://builds.apache.org/job/HBase-0.94/ws/trunk>
&& /home/hudson/tools/java/jdk1.6.0_27-32/jre/bin/java -enableassertions -Xmx1900m
-Djava.security.egd=file:/dev/./urandom -jar <https://builds.apache.org/job/HBase-0.94/ws/trunk/target/surefire/surefirebooter1672472194305294282.jar>
<https://builds.apache.org/job/HBase-0.94/ws/trunk/target/surefire/surefire2832003739486447304tmp>
<https://builds.apache.org/job/HBase-0.94/ws/trunk/target/surefire/surefire_786230561530394045034tmp>
Running org.apache.hadoop.hbase.regionserver.TestMasterAddressManager
Tests run: 1, Failures: 0, Errors: 0, Skipped: 0, Time elapsed: 0.693 sec
Forking command line: /bin/sh -c cd <https://builds.apache.org/job/HBase-0.94/ws/trunk>
&& /home/hudson/tools/java/jdk1.6.0_27-32/jre/bin/java -enableassertions -Xmx1900m
-Djava.security.egd=file:/dev/./urandom -jar <https://builds.apache.org/job/HBase-0.94/ws/trunk/target/surefire/surefirebooter1471316002007709151.jar>
<https://builds.apache.org/job/HBase-0.94/ws/trunk/target/surefire/surefire2138781928246856401tmp>
<https://builds.apache.org/job/HBase-0.94/ws/trunk/target/surefire/surefire_796944986657014688181tmp>
Running org.apache.hadoop.hbase.util.TestHBaseFsck
Tests run: 14, Failures: 0, Errors: 0, Skipped: 0, Time elapsed: 193.143 sec
Forking command line: /bin/sh -c cd <https://builds.apache.org/job/HBase-0.94/ws/trunk>
&& /home/hudson/tools/java/jdk1.6.0_27-32/jre/bin/java -enableassertions -Xmx1900m
-Djava.security.egd=file:/dev/./urandom -jar <https://builds.apache.org/job/HBase-0.94/ws/trunk/target/surefire/surefirebooter4266041410717776398.jar>
<https://builds.apache.org/job/HBase-0.94/ws/trunk/target/surefire/surefire5229261702494075145tmp>
<https://builds.apache.org/job/HBase-0.94/ws/trunk/target/surefire/surefire_801529656227773182067tmp>
Running org.apache.hadoop.hbase.regionserver.wal.TestWALReplayCompressed
Tests run: 5, Failures: 0, Errors: 0, Skipped: 0, Time elapsed: 42.351 sec
Running org.apache.hadoop.hbase.regionserver.wal.TestWALReplay
Tests run: 5, Failures: 0, Errors: 0, Skipped: 0, Time elapsed: 43.238 sec
Forking command line: /bin/sh -c cd <https://builds.apache.org/job/HBase-0.94/ws/trunk>
&& /home/hudson/tools/java/jdk1.6.0_27-32/jre/bin/java -enableassertions -Xmx1900m
-Djava.security.egd=file:/dev/./urandom -jar <https://builds.apache.org/job/HBase-0.94/ws/trunk/target/surefire/surefirebooter6644351149751843720.jar>
<https://builds.apache.org/job/HBase-0.94/ws/trunk/target/surefire/surefire6625790878656882032tmp>
<https://builds.apache.org/job/HBase-0.94/ws/trunk/target/surefire/surefire_816243532627736887186tmp>
Running org.apache.hadoop.hbase.regionserver.wal.TestHLogBench
Tests run: 1, Failures: 0, Errors: 0, Skipped: 0, Time elapsed: 1.374 sec
Forking command line: /bin/sh -c cd <https://builds.apache.org/job/HBase-0.94/ws/trunk>
&& /home/hudson/tools/java/jdk1.6.0_27-32/jre/bin/java -enableassertions -Xmx1900m
-Djava.security.egd=file:/dev/./urandom -jar <https://builds.apache.org/job/HBase-0.94/ws/trunk/target/surefire/surefirebooter1564717086928537596.jar>
<https://builds.apache.org/job/HBase-0.94/ws/trunk/target/surefire/surefire5234375156123016730tmp>
<https://builds.apache.org/job/HBase-0.94/ws/trunk/target/surefire/surefire_825580333254772382278tmp>
Running org.apache.hadoop.hbase.regionserver.wal.TestLogRollAbort
Tests run: 1, Failures: 0, Errors: 0, Skipped: 0, Time elapsed: 18.995 sec
Forking command line: /bin/sh -c cd <https://builds.apache.org/job/HBase-0.94/ws/trunk>
&& /home/hudson/tools/java/jdk1.6.0_27-32/jre/bin/java -enableassertions -Xmx1900m
-Djava.security.egd=file:/dev/./urandom -jar <https://builds.apache.org/job/HBase-0.94/ws/trunk/target/surefire/surefirebooter3266032110079057310.jar>
<https://builds.apache.org/job/HBase-0.94/ws/trunk/target/surefire/surefire4739682036544579223tmp>
<https://builds.apache.org/job/HBase-0.94/ws/trunk/target/surefire/surefire_836676049703837041471tmp>
Forking command line: /bin/sh -c cd <https://builds.apache.org/job/HBase-0.94/ws/trunk>
&& /home/hudson/tools/java/jdk1.6.0_27-32/jre/bin/java -enableassertions -Xmx1900m
-Djava.security.egd=file:/dev/./urandom -jar <https://builds.apache.org/job/HBase-0.94/ws/trunk/target/surefire/surefirebooter8262284871902464706.jar>
<https://builds.apache.org/job/HBase-0.94/ws/trunk/target/surefire/surefire7906453925818624183tmp>
<https://builds.apache.org/job/HBase-0.94/ws/trunk/target/surefire/surefire_848950039779475991777tmp>
Running org.apache.hadoop.hbase.regionserver.TestRpcMetrics
Tests run: 1, Failures: 0, Errors: 0, Skipped: 0, Time elapsed: 2.085 sec
Forking command line: /bin/sh -c cd <https://builds.apache.org/job/HBase-0.94/ws/trunk>
&& /home/hudson/tools/java/jdk1.6.0_27-32/jre/bin/java -enableassertions -Xmx1900m
-Djava.security.egd=file:/dev/./urandom -jar <https://builds.apache.org/job/HBase-0.94/ws/trunk/target/surefire/surefirebooter1640036612171396147.jar>
<https://builds.apache.org/job/HBase-0.94/ws/trunk/target/surefire/surefire3309833522374528913tmp>
<https://builds.apache.org/job/HBase-0.94/ws/trunk/target/surefire/surefire_854901954617249913276tmp>
Running org.apache.hadoop.hbase.regionserver.TestStoreScanner
Tests run: 16, Failures: 0, Errors: 0, Skipped: 0, Time elapsed: 0.105 sec
Forking command line: /bin/sh -c cd <https://builds.apache.org/job/HBase-0.94/ws/trunk>
&& /home/hudson/tools/java/jdk1.6.0_27-32/jre/bin/java -enableassertions -Xmx1900m
-Djava.security.egd=file:/dev/./urandom -jar <https://builds.apache.org/job/HBase-0.94/ws/trunk/target/surefire/surefirebooter4207008281983368398.jar>
<https://builds.apache.org/job/HBase-0.94/ws/trunk/target/surefire/surefire7573440599953002523tmp>
<https://builds.apache.org/job/HBase-0.94/ws/trunk/target/surefire/surefire_867818327212027105463tmp>
Running org.apache.hadoop.hbase.regionserver.TestSeekOptimizations
Tests run: 6, Failures: 0, Errors: 0, Skipped: 0, Time elapsed: 2.738 sec
Forking command line: /bin/sh -c cd <https://builds.apache.org/job/HBase-0.94/ws/trunk>
&& /home/hudson/tools/java/jdk1.6.0_27-32/jre/bin/java -enableassertions -Xmx1900m
-Djava.security.egd=file:/dev/./urandom -jar <https://builds.apache.org/job/HBase-0.94/ws/trunk/target/surefire/surefirebooter6580893223365370845.jar>
<https://builds.apache.org/job/HBase-0.94/ws/trunk/target/surefire/surefire1274815654022624780tmp>
<https://builds.apache.org/job/HBase-0.94/ws/trunk/target/surefire/surefire_876710681410865948366tmp>
Running org.apache.hadoop.hbase.regionserver.metrics.TestSchemaMetrics
Tests run: 6, Failures: 0, Errors: 0, Skipped: 0, Time elapsed: 15.138 sec
Forking command line: /bin/sh -c cd <https://builds.apache.org/job/HBase-0.94/ws/trunk>
&& /home/hudson/tools/java/jdk1.6.0_27-32/jre/bin/java -enableassertions -Xmx1900m
-Djava.security.egd=file:/dev/./urandom -jar <https://builds.apache.org/job/HBase-0.94/ws/trunk/target/surefire/surefirebooter5173172528246823263.jar>
<https://builds.apache.org/job/HBase-0.94/ws/trunk/target/surefire/surefire5200720623175738104tmp>
<https://builds.apache.org/job/HBase-0.94/ws/trunk/target/surefire/surefire_884555627376445456907tmp>
Running org.apache.hadoop.hbase.regionserver.TestSplitLogWorker
Tests run: 5, Failures: 0, Errors: 0, Skipped: 0, Time elapsed: 3.529 sec
Forking command line: /bin/sh -c cd <https://builds.apache.org/job/HBase-0.94/ws/trunk>
&& /home/hudson/tools/java/jdk1.6.0_27-32/jre/bin/java -enableassertions -Xmx1900m
-Djava.security.egd=file:/dev/./urandom -jar <https://builds.apache.org/job/HBase-0.94/ws/trunk/target/surefire/surefirebooter6579507869295520026.jar>
<https://builds.apache.org/job/HBase-0.94/ws/trunk/target/surefire/surefire4646333875521378806tmp>
<https://builds.apache.org/job/HBase-0.94/ws/trunk/target/surefire/surefire_895369683771511596663tmp>
Running org.apache.hadoop.hbase.regionserver.TestFSErrorsExposed
Tests run: 3, Failures: 0, Errors: 0, Skipped: 0, Time elapsed: 29.774 sec
Forking command line: /bin/sh -c cd <https://builds.apache.org/job/HBase-0.94/ws/trunk>
&& /home/hudson/tools/java/jdk1.6.0_27-32/jre/bin/java -enableassertions -Xmx1900m
-Djava.security.egd=file:/dev/./urandom -jar <https://builds.apache.org/job/HBase-0.94/ws/trunk/target/surefire/surefirebooter6444216075326498230.jar>
<https://builds.apache.org/job/HBase-0.94/ws/trunk/target/surefire/surefire1978086881776383484tmp>
<https://builds.apache.org/job/HBase-0.94/ws/trunk/target/surefire/surefire_901401265512075505336tmp>
Running org.apache.hadoop.hbase.regionserver.TestMultiColumnScanner
Tests run: 12, Failures: 0, Errors: 0, Skipped: 0, Time elapsed: 43.446 sec
Forking command line: /bin/sh -c cd <https://builds.apache.org/job/HBase-0.94/ws/trunk>
&& /home/hudson/tools/java/jdk1.6.0_27-32/jre/bin/java -enableassertions -Xmx1900m
-Djava.security.egd=file:/dev/./urandom -jar <https://builds.apache.org/job/HBase-0.94/ws/trunk/target/surefire/surefirebooter7606076161459387009.jar>
<https://builds.apache.org/job/HBase-0.94/ws/trunk/target/surefire/surefire7359007197027440400tmp>
<https://builds.apache.org/job/HBase-0.94/ws/trunk/target/surefire/surefire_918349895004500345470tmp>
Running org.apache.hadoop.hbase.client.replication.TestReplicationAdmin
Tests run: 1, Failures: 0, Errors: 0, Skipped: 0, Time elapsed: 0.883 sec
Forking command line: /bin/sh -c cd <https://builds.apache.org/job/HBase-0.94/ws/trunk>
&& /home/hudson/tools/java/jdk1.6.0_27-32/jre/bin/java -enableassertions -Xmx1900m
-Djava.security.egd=file:/dev/./urandom -jar <https://builds.apache.org/job/HBase-0.94/ws/trunk/target/surefire/surefirebooter3699431480814834415.jar>
<https://builds.apache.org/job/HBase-0.94/ws/trunk/target/surefire/surefire4264285469770652903tmp>
<https://builds.apache.org/job/HBase-0.94/ws/trunk/target/surefire/surefire_923583368569387441148tmp>
Running org.apache.hadoop.hbase.regionserver.TestHRegion
Tests run: 61, Failures: 0, Errors: 0, Skipped: 0, Time elapsed: 42.023 sec
Forking command line: /bin/sh -c cd <https://builds.apache.org/job/HBase-0.94/ws/trunk>
&& /home/hudson/tools/java/jdk1.6.0_27-32/jre/bin/java -enableassertions -Xmx1900m
-Djava.security.egd=file:/dev/./urandom -jar <https://builds.apache.org/job/HBase-0.94/ws/trunk/target/surefire/surefirebooter8146719098178118082.jar>
<https://builds.apache.org/job/HBase-0.94/ws/trunk/target/surefire/surefire5224892892747550705tmp>
<https://builds.apache.org/job/HBase-0.94/ws/trunk/target/surefire/surefire_935234647637196172575tmp>
Running org.apache.hadoop.hbase.client.TestTimestampsFilter
Tests run: 3, Failures: 0, Errors: 0, Skipped: 0, Time elapsed: 23.708 sec
Forking command line: /bin/sh -c cd <https://builds.apache.org/job/HBase-0.94/ws/trunk>
&& /home/hudson/tools/java/jdk1.6.0_27-32/jre/bin/java -enableassertions -Xmx1900m
-Djava.security.egd=file:/dev/./urandom -jar <https://builds.apache.org/job/HBase-0.94/ws/trunk/target/surefire/surefirebooter179299622567797992.jar>
<https://builds.apache.org/job/HBase-0.94/ws/trunk/target/surefire/surefire4825831156162369418tmp>
<https://builds.apache.org/job/HBase-0.94/ws/trunk/target/surefire/surefire_946939697661720689460tmp>
Running org.apache.hadoop.hbase.client.TestHCM
Tests run: 5, Failures: 0, Errors: 0, Skipped: 0, Time elapsed: 19.061 sec
Forking command line: /bin/sh -c cd <https://builds.apache.org/job/HBase-0.94/ws/trunk>
&& /home/hudson/tools/java/jdk1.6.0_27-32/jre/bin/java -enableassertions -Xmx1900m
-Djava.security.egd=file:/dev/./urandom -jar <https://builds.apache.org/job/HBase-0.94/ws/trunk/target/surefire/surefirebooter6230960321368649169.jar>
<https://builds.apache.org/job/HBase-0.94/ws/trunk/target/surefire/surefire5790255786612333391tmp>
<https://builds.apache.org/job/HBase-0.94/ws/trunk/target/surefire/surefire_956695026929641572300tmp>
Running org.apache.hadoop.hbase.client.TestHTablePool$TestHTableReusablePool
Tests run: 9, Failures: 0, Errors: 0, Skipped: 0, Time elapsed: 5.197 sec
Running org.apache.hadoop.hbase.client.TestHTablePool$TestHTableThreadLocalPool
Tests run: 9, Failures: 0, Errors: 0, Skipped: 0, Time elapsed: 25.384 sec
Forking command line: /bin/sh -c cd <https://builds.apache.org/job/HBase-0.94/ws/trunk>
&& /home/hudson/tools/java/jdk1.6.0_27-32/jre/bin/java -enableassertions -Xmx1900m
-Djava.security.egd=file:/dev/./urandom -jar <https://builds.apache.org/job/HBase-0.94/ws/trunk/target/surefire/surefirebooter3273975033614206249.jar>
<https://builds.apache.org/job/HBase-0.94/ws/trunk/target/surefire/surefire427921793342082951tmp>
<https://builds.apache.org/job/HBase-0.94/ws/trunk/target/surefire/surefire_963872809789032628155tmp>
Running org.apache.hadoop.hbase.client.TestHTableUtil
Tests run: 2, Failures: 0, Errors: 0, Skipped: 0, Time elapsed: 18.233 sec
Forking command line: /bin/sh -c cd <https://builds.apache.org/job/HBase-0.94/ws/trunk>
&& /home/hudson/tools/java/jdk1.6.0_27-32/jre/bin/java -enableassertions -Xmx1900m
-Djava.security.egd=file:/dev/./urandom -jar <https://builds.apache.org/job/HBase-0.94/ws/trunk/target/surefire/surefirebooter4223964414876620944.jar>
<https://builds.apache.org/job/HBase-0.94/ws/trunk/target/surefire/surefire8090854344063039782tmp>
<https://builds.apache.org/job/HBase-0.94/ws/trunk/target/surefire/surefire_974603149915080806898tmp>
Running org.apache.hadoop.hbase.client.TestMetaScanner
Tests run: 1, Failures: 0, Errors: 0, Skipped: 0, Time elapsed: 16.9 sec
Forking command line: /bin/sh -c cd <https://builds.apache.org/job/HBase-0.94/ws/trunk>
&& /home/hudson/tools/java/jdk1.6.0_27-32/jre/bin/java -enableassertions -Xmx1900m
-Djava.security.egd=file:/dev/./urandom -jar <https://builds.apache.org/job/HBase-0.94/ws/trunk/target/surefire/surefirebooter2356661636663707808.jar>
<https://builds.apache.org/job/HBase-0.94/ws/trunk/target/surefire/surefire1203821158643551413tmp>
<https://builds.apache.org/job/HBase-0.94/ws/trunk/target/surefire/surefire_984123963647182775101tmp>
Running org.apache.hadoop.hbase.client.TestMetaMigrationRemovingHTD
Tests run: 3, Failures: 0, Errors: 0, Skipped: 0, Time elapsed: 32.823 sec
Forking command line: /bin/sh -c cd <https://builds.apache.org/job/HBase-0.94/ws/trunk>
&& /home/hudson/tools/java/jdk1.6.0_27-32/jre/bin/java -enableassertions -Xmx1900m
-Djava.security.egd=file:/dev/./urandom -jar <https://builds.apache.org/job/HBase-0.94/ws/trunk/target/surefire/surefirebooter1859772387931801975.jar>
<https://builds.apache.org/job/HBase-0.94/ws/trunk/target/surefire/surefire5137192436221641765tmp>
<https://builds.apache.org/job/HBase-0.94/ws/trunk/target/surefire/surefire_9967260212433763508tmp>
Running org.apache.hadoop.hbase.client.TestMultiParallel
Tests run: 11, Failures: 0, Errors: 0, Skipped: 0, Time elapsed: 56.235 sec
Forking command line: /bin/sh -c cd <https://builds.apache.org/job/HBase-0.94/ws/trunk>
&& /home/hudson/tools/java/jdk1.6.0_27-32/jre/bin/java -enableassertions -Xmx1900m
-Djava.security.egd=file:/dev/./urandom -jar <https://builds.apache.org/job/HBase-0.94/ws/trunk/target/surefire/surefirebooter8715372165405102164.jar>
<https://builds.apache.org/job/HBase-0.94/ws/trunk/target/surefire/surefire6789512040871677501tmp>
<https://builds.apache.org/job/HBase-0.94/ws/trunk/target/surefire/surefire_1003011971251335182734tmp>
Running org.apache.hadoop.hbase.TestMultiVersions
Tests run: 3, Failures: 0, Errors: 0, Skipped: 0, Time elapsed: 41.998 sec
Forking command line: /bin/sh -c cd <https://builds.apache.org/job/HBase-0.94/ws/trunk>
&& /home/hudson/tools/java/jdk1.6.0_27-32/jre/bin/java -enableassertions -Xmx1900m
-Djava.security.egd=file:/dev/./urandom -jar <https://builds.apache.org/job/HBase-0.94/ws/trunk/target/surefire/surefirebooter3671339206935487242.jar>
<https://builds.apache.org/job/HBase-0.94/ws/trunk/target/surefire/surefire6999271157349403956tmp>
<https://builds.apache.org/job/HBase-0.94/ws/trunk/target/surefire/surefire_1016359729920053581677tmp>
Running org.apache.hadoop.hbase.master.TestActiveMasterManager
Tests run: 2, Failures: 0, Errors: 0, Skipped: 0, Time elapsed: 1.318 sec
Forking command line: /bin/sh -c cd <https://builds.apache.org/job/HBase-0.94/ws/trunk>
&& /home/hudson/tools/java/jdk1.6.0_27-32/jre/bin/java -enableassertions -Xmx1900m
-Djava.security.egd=file:/dev/./urandom -jar <https://builds.apache.org/job/HBase-0.94/ws/trunk/target/surefire/surefirebooter5025045914942706419.jar>
<https://builds.apache.org/job/HBase-0.94/ws/trunk/target/surefire/surefire7474717035443693440tmp>
<https://builds.apache.org/job/HBase-0.94/ws/trunk/target/surefire/surefire_1024106800704571990688tmp>
Running org.apache.hadoop.hbase.master.TestDeadServer
Tests run: 1, Failures: 0, Errors: 0, Skipped: 0, Time elapsed: 0.204 sec
Forking command line: /bin/sh -c cd <https://builds.apache.org/job/HBase-0.94/ws/trunk>
&& /home/hudson/tools/java/jdk1.6.0_27-32/jre/bin/java -enableassertions -Xmx1900m
-Djava.security.egd=file:/dev/./urandom -jar <https://builds.apache.org/job/HBase-0.94/ws/trunk/target/surefire/surefirebooter8077785636796073411.jar>
<https://builds.apache.org/job/HBase-0.94/ws/trunk/target/surefire/surefire1879927804686581720tmp>
<https://builds.apache.org/job/HBase-0.94/ws/trunk/target/surefire/surefire_1034184444801659136076tmp>
Running org.apache.hadoop.hbase.master.TestLogsCleaner
Tests run: 1, Failures: 0, Errors: 0, Skipped: 0, Time elapsed: 3.268 sec
Forking command line: /bin/sh -c cd <https://builds.apache.org/job/HBase-0.94/ws/trunk>
&& /home/hudson/tools/java/jdk1.6.0_27-32/jre/bin/java -enableassertions -Xmx1900m
-Djava.security.egd=file:/dev/./urandom -jar <https://builds.apache.org/job/HBase-0.94/ws/trunk/target/surefire/surefirebooter3753749860456749549.jar>
<https://builds.apache.org/job/HBase-0.94/ws/trunk/target/surefire/surefire6670307364324364247tmp>
<https://builds.apache.org/job/HBase-0.94/ws/trunk/target/surefire/surefire_1046837756523831323021tmp>
Running org.apache.hadoop.hbase.master.TestZKBasedOpenCloseRegion
Tests run: 3, Failures: 0, Errors: 0, Skipped: 0, Time elapsed: 30.474 sec
Forking command line: /bin/sh -c cd <https://builds.apache.org/job/HBase-0.94/ws/trunk>
&& /home/hudson/tools/java/jdk1.6.0_27-32/jre/bin/java -enableassertions -Xmx1900m
-Djava.security.egd=file:/dev/./urandom -jar <https://builds.apache.org/job/HBase-0.94/ws/trunk/target/surefire/surefirebooter7076588567197099238.jar>
<https://builds.apache.org/job/HBase-0.94/ws/trunk/target/surefire/surefire4686529809234090737tmp>
<https://builds.apache.org/job/HBase-0.94/ws/trunk/target/surefire/surefire_105171234182586552765tmp>
Running org.apache.hadoop.hbase.thrift.TestThriftServer
Tests run: 1, Failures: 0, Errors: 0, Skipped: 0, Time elapsed: 56.263 sec
Forking command line: /bin/sh -c cd <https://builds.apache.org/job/HBase-0.94/ws/trunk>
&& /home/hudson/tools/java/jdk1.6.0_27-32/jre/bin/java -enableassertions -Xmx1900m
-Djava.security.egd=file:/dev/./urandom -jar <https://builds.apache.org/job/HBase-0.94/ws/trunk/target/surefire/surefirebooter1166698769890258521.jar>
<https://builds.apache.org/job/HBase-0.94/ws/trunk/target/surefire/surefire6598012440920915319tmp>
<https://builds.apache.org/job/HBase-0.94/ws/trunk/target/surefire/surefire_1064924071089895153235tmp>
Running org.apache.hadoop.hbase.master.TestMaster
Tests run: 1, Failures: 0, Errors: 0, Skipped: 0, Time elapsed: 23.423 sec
Forking command line: /bin/sh -c cd <https://builds.apache.org/job/HBase-0.94/ws/trunk>
&& /home/hudson/tools/java/jdk1.6.0_27-32/jre/bin/java -enableassertions -Xmx1900m
-Djava.security.egd=file:/dev/./urandom -jar <https://builds.apache.org/job/HBase-0.94/ws/trunk/target/surefire/surefirebooter6469255802809625190.jar>
<https://builds.apache.org/job/HBase-0.94/ws/trunk/target/surefire/surefire3843376564436944224tmp>
<https://builds.apache.org/job/HBase-0.94/ws/trunk/target/surefire/surefire_1073501180919655168767tmp>
Running org.apache.hadoop.hbase.master.TestClockSkewDetection
Tests run: 1, Failures: 0, Errors: 0, Skipped: 0, Time elapsed: 0.25 sec
Forking command line: /bin/sh -c cd <https://builds.apache.org/job/HBase-0.94/ws/trunk>
&& /home/hudson/tools/java/jdk1.6.0_27-32/jre/bin/java -enableassertions -Xmx1900m
-Djava.security.egd=file:/dev/./urandom -jar <https://builds.apache.org/job/HBase-0.94/ws/trunk/target/surefire/surefirebooter703531935288454660.jar>
<https://builds.apache.org/job/HBase-0.94/ws/trunk/target/surefire/surefire5966001705833168320tmp>
<https://builds.apache.org/job/HBase-0.94/ws/trunk/target/surefire/surefire_1082627030401109694103tmp>
Running org.apache.hadoop.hbase.master.TestOpenedRegionHandler
Tests run: 2, Failures: 0, Errors: 0, Skipped: 0, Time elapsed: 24.191 sec
Forking command line: /bin/sh -c cd <https://builds.apache.org/job/HBase-0.94/ws/trunk>
&& /home/hudson/tools/java/jdk1.6.0_27-32/jre/bin/java -enableassertions -Xmx1900m
-Djava.security.egd=file:/dev/./urandom -jar <https://builds.apache.org/job/HBase-0.94/ws/trunk/target/surefire/surefirebooter1138900220227267038.jar>
<https://builds.apache.org/job/HBase-0.94/ws/trunk/target/surefire/surefire6027322851297417369tmp>
<https://builds.apache.org/job/HBase-0.94/ws/trunk/target/surefire/surefire_1094625618047664048278tmp>
Running org.apache.hadoop.hbase.master.TestDefaultLoadBalancer
Tests run: 4, Failures: 0, Errors: 0, Skipped: 0, Time elapsed: 1.428 sec
Forking command line: /bin/sh -c cd <https://builds.apache.org/job/HBase-0.94/ws/trunk>
&& /home/hudson/tools/java/jdk1.6.0_27-32/jre/bin/java -enableassertions -Xmx1900m
-Djava.security.egd=file:/dev/./urandom -jar <https://builds.apache.org/job/HBase-0.94/ws/trunk/target/surefire/surefirebooter4270526529557492295.jar>
<https://builds.apache.org/job/HBase-0.94/ws/trunk/target/surefire/surefire6335559621950932385tmp>
<https://builds.apache.org/job/HBase-0.94/ws/trunk/target/surefire/surefire_1105694569302499653656tmp>
Running org.apache.hadoop.hbase.master.TestSplitLogManager
Tests run: 12, Failures: 0, Errors: 0, Skipped: 0, Time elapsed: 16.704 sec
Running org.apache.hadoop.hbase.master.TestMasterStatusServlet
Tests run: 5, Failures: 0, Errors: 0, Skipped: 0, Time elapsed: 1.015 sec
Forking command line: /bin/sh -c cd <https://builds.apache.org/job/HBase-0.94/ws/trunk>
&& /home/hudson/tools/java/jdk1.6.0_27-32/jre/bin/java -enableassertions -Xmx1900m
-Djava.security.egd=file:/dev/./urandom -jar <https://builds.apache.org/job/HBase-0.94/ws/trunk/target/surefire/surefirebooter8583591136698602862.jar>
<https://builds.apache.org/job/HBase-0.94/ws/trunk/target/surefire/surefire9106912591950270562tmp>
<https://builds.apache.org/job/HBase-0.94/ws/trunk/target/surefire/surefire_1113003458095240191084tmp>
Forking command line: /bin/sh -c cd <https://builds.apache.org/job/HBase-0.94/ws/trunk>
&& /home/hudson/tools/java/jdk1.6.0_27-32/jre/bin/java -enableassertions -Xmx1900m
-Djava.security.egd=file:/dev/./urandom -jar <https://builds.apache.org/job/HBase-0.94/ws/trunk/target/surefire/surefirebooter7903371764592595649.jar>
<https://builds.apache.org/job/HBase-0.94/ws/trunk/target/surefire/surefire5699036848196176461tmp>
<https://builds.apache.org/job/HBase-0.94/ws/trunk/target/surefire/surefire_1125537667297261434653tmp>
Running org.apache.hadoop.hbase.master.TestHMasterRPCException
Tests run: 1, Failures: 0, Errors: 0, Skipped: 0, Time elapsed: 1.411 sec
Forking command line: /bin/sh -c cd <https://builds.apache.org/job/HBase-0.94/ws/trunk>
&& /home/hudson/tools/java/jdk1.6.0_27-32/jre/bin/java -enableassertions -Xmx1900m
-Djava.security.egd=file:/dev/./urandom -jar <https://builds.apache.org/job/HBase-0.94/ws/trunk/target/surefire/surefirebooter2366045722075415671.jar>
<https://builds.apache.org/job/HBase-0.94/ws/trunk/target/surefire/surefire1352565827127267165tmp>
<https://builds.apache.org/job/HBase-0.94/ws/trunk/target/surefire/surefire_1134777914865153661633tmp>
Running org.apache.hadoop.hbase.master.TestMasterZKSessionRecovery
Tests run: 2, Failures: 0, Errors: 0, Skipped: 0, Time elapsed: 28.453 sec
Forking command line: /bin/sh -c cd <https://builds.apache.org/job/HBase-0.94/ws/trunk>
&& /home/hudson/tools/java/jdk1.6.0_27-32/jre/bin/java -enableassertions -Xmx1900m
-Djava.security.egd=file:/dev/./urandom -jar <https://builds.apache.org/job/HBase-0.94/ws/trunk/target/surefire/surefirebooter6115561942222621244.jar>
<https://builds.apache.org/job/HBase-0.94/ws/trunk/target/surefire/surefire3444542310891312900tmp>
<https://builds.apache.org/job/HBase-0.94/ws/trunk/target/surefire/surefire_1146450842628729902202tmp>
Running org.apache.hadoop.hbase.avro.TestAvroServer
Tests run: 3, Failures: 0, Errors: 0, Skipped: 0, Time elapsed: 33.454 sec
Forking command line: /bin/sh -c cd <https://builds.apache.org/job/HBase-0.94/ws/trunk>
&& /home/hudson/tools/java/jdk1.6.0_27-32/jre/bin/java -enableassertions -Xmx1900m
-Djava.security.egd=file:/dev/./urandom -jar <https://builds.apache.org/job/HBase-0.94/ws/trunk/target/surefire/surefirebooter8542888782645287430.jar>
<https://builds.apache.org/job/HBase-0.94/ws/trunk/target/surefire/surefire8395046661061974296tmp>
<https://builds.apache.org/job/HBase-0.94/ws/trunk/target/surefire/surefire_1157238050624632637132tmp>
Running org.apache.hadoop.hbase.ipc.TestDelayedRpc
Tests run: 4, Failures: 0, Errors: 0, Skipped: 0, Time elapsed: 2.648 sec
Forking command line: /bin/sh -c cd <https://builds.apache.org/job/HBase-0.94/ws/trunk>
&& /home/hudson/tools/java/jdk1.6.0_27-32/jre/bin/java -enableassertions -Xmx1900m
-Djava.security.egd=file:/dev/./urandom -jar <https://builds.apache.org/job/HBase-0.94/ws/trunk/target/surefire/surefirebooter8266371191435826509.jar>
<https://builds.apache.org/job/HBase-0.94/ws/trunk/target/surefire/surefire6300561812703796504tmp>
<https://builds.apache.org/job/HBase-0.94/ws/trunk/target/surefire/surefire_1166858339518982138805tmp>
Running org.apache.hadoop.hbase.thrift2.TestThriftHBaseServiceHandler
Tests run: 12, Failures: 0, Errors: 0, Skipped: 0, Time elapsed: 23.253 sec
Forking command line: /bin/sh -c cd <https://builds.apache.org/job/HBase-0.94/ws/trunk>
&& /home/hudson/tools/java/jdk1.6.0_27-32/jre/bin/java -enableassertions -Xmx1900m
-Djava.security.egd=file:/dev/./urandom -jar <https://builds.apache.org/job/HBase-0.94/ws/trunk/target/surefire/surefirebooter5389092489799830349.jar>
<https://builds.apache.org/job/HBase-0.94/ws/trunk/target/surefire/surefire5240248453207987137tmp>
<https://builds.apache.org/job/HBase-0.94/ws/trunk/target/surefire/surefire_1174191029438288881872tmp>
Running org.apache.hadoop.hbase.TestInfoServers
Tests run: 2, Failures: 0, Errors: 0, Skipped: 0, Time elapsed: 13.589 sec
Running org.apache.hadoop.hbase.TestAcidGuarantees
Tests run: 3, Failures: 0, Errors: 0, Skipped: 0, Time elapsed: 106.173 sec

Results :

Tests in error: 
  loadTest[0](org.apache.hadoop.hbase.io.encoding.TestLoadAndSwitchEncodeOnDisk): org.apache.hadoop.hbase.NotServingRegionException:
Region is not online: load_test_tbl,,1332787889172.e687fc41e444bc4e44f90a1e7165b61a.(..)

Tests run: 614, Failures: 0, Errors: 1, Skipped: 2

[INFO] ------------------------------------------------------------------------
[INFO] BUILD FAILURE
[INFO] ------------------------------------------------------------------------
[INFO] Total time: 31:07.139s
[INFO] Finished at: Mon Mar 26 19:12:48 UTC 2012
[INFO] Final Memory: 40M/477M
[INFO] ------------------------------------------------------------------------
[ERROR] Failed to execute goal org.apache.maven.plugins:maven-surefire-plugin:2.12-TRUNK-HBASE-2:test
(secondPartTestsExecution) on project hbase: There are test failures.
[ERROR] 
[ERROR] Please refer to <https://builds.apache.org/job/HBase-0.94/ws/trunk/target/surefire-reports>
for the individual test results.
[ERROR] -> [Help 1]
org.apache.maven.lifecycle.LifecycleExecutionException: Failed to execute goal org.apache.maven.plugins:maven-surefire-plugin:2.12-TRUNK-HBASE-2:test
(secondPartTestsExecution) on project hbase: There are test failures.

Please refer to <https://builds.apache.org/job/HBase-0.94/ws/trunk/target/surefire-reports>
for the individual test results.
	at org.apache.maven.lifecycle.internal.MojoExecutor.execute(MojoExecutor.java:213)
	at org.apache.maven.lifecycle.internal.MojoExecutor.execute(MojoExecutor.java:153)
	at org.apache.maven.lifecycle.internal.MojoExecutor.execute(MojoExecutor.java:145)
	at org.apache.maven.lifecycle.internal.MojoExecutor.executeForkedExecutions(MojoExecutor.java:365)
	at org.apache.maven.lifecycle.internal.MojoExecutor.execute(MojoExecutor.java:199)
	at org.apache.maven.lifecycle.internal.MojoExecutor.execute(MojoExecutor.java:153)
	at org.apache.maven.lifecycle.internal.MojoExecutor.execute(MojoExecutor.java:145)
	at org.apache.maven.lifecycle.internal.LifecycleModuleBuilder.buildProject(LifecycleModuleBuilder.java:84)
	at org.apache.maven.lifecycle.internal.LifecycleModuleBuilder.buildProject(LifecycleModuleBuilder.java:59)
	at org.apache.maven.lifecycle.internal.LifecycleStarter.singleThreadedBuild(LifecycleStarter.java:183)
	at org.apache.maven.lifecycle.internal.LifecycleStarter.execute(LifecycleStarter.java:161)
	at org.apache.maven.DefaultMaven.doExecute(DefaultMaven.java:319)
	at org.apache.maven.DefaultMaven.execute(DefaultMaven.java:156)
	at org.apache.maven.cli.MavenCli.execute(MavenCli.java:537)
	at org.apache.maven.cli.MavenCli.doMain(MavenCli.java:196)
	at org.apache.maven.cli.MavenCli.main(MavenCli.java:141)
	at sun.reflect.NativeMethodAccessorImpl.invoke0(Native Method)
	at sun.reflect.NativeMethodAccessorImpl.invoke(NativeMethodAccessorImpl.java:39)
	at sun.reflect.DelegatingMethodAccessorImpl.invoke(DelegatingMethodAccessorImpl.java:25)
	at java.lang.reflect.Method.invoke(Method.java:597)
	at org.codehaus.plexus.classworlds.launcher.Launcher.launchEnhanced(Launcher.java:290)
	at org.codehaus.plexus.classworlds.launcher.Launcher.launch(Launcher.java:230)
	at org.codehaus.plexus.classworlds.launcher.Launcher.mainWithExitCode(Launcher.java:409)
	at org.codehaus.plexus.classworlds.launcher.Launcher.main(Launcher.java:352)
Caused by: org.apache.maven.plugin.MojoFailureException: There are test failures.

Please refer to <https://builds.apache.org/job/HBase-0.94/ws/trunk/target/surefire-reports>
for the individual test results.
	at org.apache.maven.plugin.surefire.SurefireHelper.reportExecution(SurefireHelper.java:87)
	at org.apache.maven.plugin.surefire.SurefirePlugin.writeSummary(SurefirePlugin.java:651)
	at org.apache.maven.plugin.surefire.SurefirePlugin.handleSummary(SurefirePlugin.java:625)
	at org.apache.maven.plugin.surefire.AbstractSurefireMojo.executeAfterPreconditionsChecked(AbstractSurefireMojo.java:137)
	at org.apache.maven.plugin.surefire.AbstractSurefireMojo.execute(AbstractSurefireMojo.java:98)
	at org.apache.maven.plugin.DefaultBuildPluginManager.executeMojo(DefaultBuildPluginManager.java:101)
	at org.apache.maven.lifecycle.internal.MojoExecutor.execute(MojoExecutor.java:209)
	... 23 more
[ERROR] 
[ERROR] 
[ERROR] For more information about the errors and possible solutions, please read the following
articles:
[ERROR] [Help 1] http://cwiki.apache.org/confluence/display/MAVEN/MojoFailureException
Build step 'Invoke top-level Maven targets' marked build as failure
Archiving artifacts
Updating HBASE-5190
Recording test results

Mime
View raw message