hbase-dev mailing list archives

Site index · List index
Message view « Date » · « Thread »
Top « Date » · « Thread »
From Apache Jenkins Server <jenk...@builds.apache.org>
Subject Build failed in Jenkins: hbase-0.90 #456
Date Fri, 30 Mar 2012 06:58:13 GMT
See <https://builds.apache.org/job/hbase-0.90/456/changes>

Changes:

[stack] HBASE-5673 The OOM problem of IPC client call cause all handle block; REAPPLY; V2
OF PATCH

[stack] HBASE-5673 The OOM problem of IPC client call cause all handle block; REVERT -- APPLIED
WRONG PATCH

------------------------------------------
[...truncated 933 lines...]
A         src/examples/thrift/DemoClient.java
A         src/examples/thrift/DemoClient.cpp
A         src/examples/thrift/DemoClient.rb
A         src/examples/thrift/DemoClient.php
AU        src/examples/thrift/DemoClient.py
A         src/examples/thrift/README.txt
A         src/examples/thrift/Makefile
A         src/examples/mapreduce
A         src/examples/mapreduce/org
A         src/examples/mapreduce/org/apache
A         src/examples/mapreduce/org/apache/hadoop
A         src/examples/mapreduce/org/apache/hadoop/hbase
A         src/examples/mapreduce/org/apache/hadoop/hbase/mapreduce
A         src/examples/mapreduce/org/apache/hadoop/hbase/mapreduce/SampleUploader.java
A         src/examples/mapreduce/org/apache/hadoop/hbase/mapreduce/IndexBuilder.java
A         src/examples/mapreduce/index-builder-setup.rb
A         src/examples/README.txt
A         bin
AU        bin/hbase-daemons.sh
A         bin/rename_table.rb
AU        bin/hbase
A         bin/copy_table.rb
A         bin/check_meta.rb
AU        bin/start-hbase.sh
A         bin/hirb.rb
A         bin/set_meta_block_caching.rb
A         bin/loadtable.rb
AU        bin/hbase-daemon.sh
A         bin/region_mover.rb
A         bin/hbase-config.sh
A         bin/local-regionservers.sh
AU        bin/zookeepers.sh
A         bin/local-master-backup.sh
A         bin/add_table.rb
AU        bin/rolling-restart.sh
AU        bin/regionservers.sh
A         bin/graceful_stop.sh
AU        bin/master-backup.sh
A         bin/set_meta_memstore_size.rb
A         bin/replication
A         bin/replication/copy_tables_desc.rb
AU        bin/stop-hbase.sh
A         pom.xml
A         README.txt
 U        .
At revision 1307282
[locks-and-latches] Checking to see if we really have the locks
[locks-and-latches] Have all the locks, build can start
[hbase-0.90] $ /bin/bash -xe /tmp/hudson8888313364210193475.sh
+ hostname
hemera
+ ulimit -a
core file size          (blocks, -c) 0
data seg size           (kbytes, -d) unlimited
scheduling priority             (-e) 0
file size               (blocks, -f) unlimited
pending signals                 (-i) 193125
max locked memory       (kbytes, -l) 64
max memory size         (kbytes, -m) unlimited
open files                      (-n) 40000
pipe size            (512 bytes, -p) 8
POSIX message queues     (bytes, -q) 819200
real-time priority              (-r) 0
stack size              (kbytes, -s) 10240
cpu time               (seconds, -t) unlimited
max user processes              (-u) 193125
virtual memory          (kbytes, -v) unlimited
file locks                      (-x) unlimited
+ jps
2066 surefirebooter496180626262524471.jar
14174 surefirebooter4745974203586116286.jar
24575 Jps
27075 jar
32263 surefirebooter1549448917691647749.jar
[trunk] $ /home/hudson/tools/maven/latest3/bin/mvn clean -Dmaven.test.redirectTestOutputToFile=true
site assembly:assembly
[INFO] Scanning for projects...
[INFO]                                                                         
[INFO] ------------------------------------------------------------------------
[INFO] Building HBase 0.90.7-SNAPSHOT
[INFO] ------------------------------------------------------------------------
[INFO] 
[INFO] --- maven-clean-plugin:2.4.1:clean (default-clean) @ hbase ---
[INFO] 
[INFO] --- xml-maven-plugin:1.0-beta-3:transform (default) @ hbase ---
[INFO] Transforming file: /x1/jenkins/jenkins-slave/workspace/hbase-0.90/trunk/src/main/resources/hbase-default.xml
[INFO] Transformed 1 file(s).
[INFO] 
[INFO] --- docbkx-maven-plugin:2.0.11:generate-html (default) @ hbase ---
[INFO] Processing input file: upgrading.xml
[INFO] /x1/jenkins/jenkins-slave/workspace/hbase-0.90/trunk/target/site/upgrading.html has
been generated.
[INFO] Processing input file: shell.xml
[INFO] /x1/jenkins/jenkins-slave/workspace/hbase-0.90/trunk/target/site/shell.html has been
generated.
[INFO] Processing input file: configuration.xml
[INFO] /x1/jenkins/jenkins-slave/workspace/hbase-0.90/trunk/target/site/configuration.html
has been generated.
[INFO] Processing input file: getting_started.xml
[INFO] /x1/jenkins/jenkins-slave/workspace/hbase-0.90/trunk/target/site/getting_started.html
has been generated.
[INFO] Processing input file: troubleshooting.xml
[INFO] /x1/jenkins/jenkins-slave/workspace/hbase-0.90/trunk/target/site/troubleshooting.html
has been generated.
[INFO] Processing input file: build.xml
[INFO] /x1/jenkins/jenkins-slave/workspace/hbase-0.90/trunk/target/site/build.html has been
generated.
[INFO] Processing input file: performance.xml
[INFO] /x1/jenkins/jenkins-slave/workspace/hbase-0.90/trunk/target/site/performance.html has
been generated.
[INFO] Processing input file: developer.xml
[INFO] /x1/jenkins/jenkins-slave/workspace/hbase-0.90/trunk/target/site/developer.html has
been generated.
[INFO] Processing input file: book.xml
[INFO] /x1/jenkins/jenkins-slave/workspace/hbase-0.90/trunk/target/site/book.html has been
generated.
[INFO] /x1/jenkins/jenkins-slave/workspace/hbase-0.90/trunk/target/site/preface.html is up
to date.
[INFO] 
[INFO] --- maven-site-plugin:2.0.1:site (default-site) @ hbase ---
[INFO] Unable to load parent project from a relative path: 1 problem was encountered while
building the effective model
[FATAL] Non-readable POM /x1/jenkins/jenkins-slave/workspace/hbase-0.90/pom.xml: /x1/jenkins/jenkins-slave/workspace/hbase-0.90/pom.xml
(No such file or directory) @ 
 for project  at /x1/jenkins/jenkins-slave/workspace/hbase-0.90/pom.xml for project  at /x1/jenkins/jenkins-slave/workspace/hbase-0.90/pom.xml
[INFO] Parent project loaded from repository.
[INFO] Unable to load parent project from a relative path: 1 problem was encountered while
building the effective model
[FATAL] Non-readable POM /x1/jenkins/jenkins-slave/workspace/hbase-0.90/pom.xml: /x1/jenkins/jenkins-slave/workspace/hbase-0.90/pom.xml
(No such file or directory) @ 
 for project  at /x1/jenkins/jenkins-slave/workspace/hbase-0.90/pom.xml for project  at /x1/jenkins/jenkins-slave/workspace/hbase-0.90/pom.xml
[INFO] Parent project loaded from repository.
[INFO]                                                                         
[INFO] ------------------------------------------------------------------------
[INFO] Building HBase 0.90.7-SNAPSHOT
[INFO] ------------------------------------------------------------------------
[INFO] 
[INFO] >>> maven-assembly-plugin:2.2-beta-5:assembly (default-cli) @ hbase >>>
[INFO] 
[INFO] --- maven-antrun-plugin:1.3:run (generate) @ hbase ---
[INFO] Executing tasks
    [mkdir] Created dir: /x1/jenkins/jenkins-slave/workspace/hbase-0.90/trunk/target/hbase-webapps
     [copy] Copying 4 files to /x1/jenkins/jenkins-slave/workspace/hbase-0.90/trunk/target/hbase-webapps
SLF4J: Failed to load class "org.slf4j.impl.StaticLoggerBinder".
SLF4J: See http://www.slf4j.org/codes.html#StaticLoggerBinder for further details.
2012-03-30 06:17:04.893:INFO::Logging to STDERR via org.mortbay.log.StdErrLog
    [mkdir] Created dir: /x1/jenkins/jenkins-slave/workspace/hbase-0.90/trunk/target/hbase-webapps/master/WEB-INF
    [mkdir] Created dir: /x1/jenkins/jenkins-slave/workspace/hbase-0.90/trunk/target/hbase-webapps/regionserver/WEB-INF
[INFO] Executed tasks
[INFO] 
[INFO] --- build-helper-maven-plugin:1.5:add-source (add-jspc-source) @ hbase ---
[INFO] Source directory: /x1/jenkins/jenkins-slave/workspace/hbase-0.90/trunk/target/jspc
added.
[INFO] 
[INFO] --- build-helper-maven-plugin:1.5:add-source (add-package-info) @ hbase ---
[INFO] Source directory: /x1/jenkins/jenkins-slave/workspace/hbase-0.90/trunk/target/generated-sources
added.
[INFO] 
[INFO] --- maven-remote-resources-plugin:1.1:process (default) @ hbase ---
[INFO] Setting property: classpath.resource.loader.class => 'org.codehaus.plexus.velocity.ContextClassLoaderResourceLoader'.
[INFO] Setting property: velocimacro.messages.on => 'false'.
[INFO] Setting property: resource.loader => 'classpath'.
[INFO] Setting property: resource.manager.logwhenfound => 'false'.
[INFO] 
[INFO] --- maven-resources-plugin:2.4:resources (default-resources) @ hbase ---
[INFO] Using 'UTF-8' encoding to copy filtered resources.
[INFO] Copying 1 resource
[INFO] Copying 6 resources
[INFO] Copying 3 resources
[INFO] 
[INFO] --- maven-antrun-plugin:1.3:run (default) @ hbase ---
[INFO] Executing tasks
[INFO] Executed tasks
[INFO] 
[INFO] --- maven-compiler-plugin:2.0.2:compile (default-compile) @ hbase ---
[INFO] Compiling 468 source files to /x1/jenkins/jenkins-slave/workspace/hbase-0.90/trunk/target/classes
[INFO] 
[INFO] --- maven-resources-plugin:2.4:testResources (default-testResources) @ hbase ---
[INFO] Using 'UTF-8' encoding to copy filtered resources.
[INFO] Copying 4 resources
[INFO] Copying 3 resources
[INFO] 
[INFO] --- maven-compiler-plugin:2.0.2:testCompile (default-testCompile) @ hbase ---
[INFO] Compiling 203 source files to /x1/jenkins/jenkins-slave/workspace/hbase-0.90/trunk/target/test-classes
[INFO] 
[INFO] --- maven-surefire-plugin:2.4.3:test (default-test) @ hbase ---
[INFO] Surefire report directory: /x1/jenkins/jenkins-slave/workspace/hbase-0.90/trunk/target/surefire-reports

-------------------------------------------------------
 T E S T S
-------------------------------------------------------
Running org.apache.hadoop.hbase.master.TestHMasterRPCException
Tests run: 1, Failures: 0, Errors: 0, Skipped: 0, Time elapsed: 0.35 sec
Running org.apache.hadoop.hbase.regionserver.TestColumnSeeking
Tests run: 2, Failures: 0, Errors: 0, Skipped: 0, Time elapsed: 3.352 sec
Running org.apache.hadoop.hbase.client.TestMultipleTimestamps
Tests run: 8, Failures: 0, Errors: 0, Skipped: 0, Time elapsed: 56.105 sec
Running org.apache.hadoop.hbase.regionserver.TestMemStoreLAB
Tests run: 3, Failures: 0, Errors: 0, Skipped: 0, Time elapsed: 0.967 sec
Running org.apache.hadoop.hbase.TestZooKeeper
Tests run: 5, Failures: 0, Errors: 0, Skipped: 0, Time elapsed: 59.7 sec
Running org.apache.hadoop.hbase.regionserver.wal.TestLogRolling
Tests run: 3, Failures: 0, Errors: 0, Skipped: 0, Time elapsed: 769.648 sec
Running org.apache.hadoop.hbase.io.hfile.TestCachedBlockQueue
Tests run: 2, Failures: 0, Errors: 0, Skipped: 0, Time elapsed: 0.014 sec
Running org.apache.hadoop.hbase.filter.TestPrefixFilter
Tests run: 3, Failures: 0, Errors: 0, Skipped: 0, Time elapsed: 0.014 sec
Running org.apache.hadoop.hbase.io.TestHeapSize
Tests run: 2, Failures: 0, Errors: 0, Skipped: 0, Time elapsed: 0.024 sec
Running org.apache.hadoop.hbase.io.TestImmutableBytesWritable
Tests run: 3, Failures: 0, Errors: 0, Skipped: 0, Time elapsed: 0.014 sec
Running org.apache.hadoop.hbase.rest.model.TestRowModel
Tests run: 2, Failures: 0, Errors: 0, Skipped: 0, Time elapsed: 0.036 sec
Running org.apache.hadoop.hbase.io.hfile.TestHFileSeek
Tests run: 1, Failures: 0, Errors: 0, Skipped: 0, Time elapsed: 3.556 sec
Running org.apache.hadoop.hbase.regionserver.wal.TestLogRollAbort
Tests run: 1, Failures: 0, Errors: 0, Skipped: 0, Time elapsed: 185.323 sec
Running org.apache.hadoop.hbase.regionserver.TestStore
Tests run: 9, Failures: 0, Errors: 0, Skipped: 0, Time elapsed: 0.603 sec
Running org.apache.hadoop.hbase.zookeeper.TestHQuorumPeer
Tests run: 3, Failures: 0, Errors: 0, Skipped: 0, Time elapsed: 0.52 sec
Running org.apache.hadoop.hbase.regionserver.TestSplitTransactionOnCluster
Tests run: 2, Failures: 0, Errors: 0, Skipped: 0, Time elapsed: 29.571 sec
Running org.apache.hadoop.hbase.io.hfile.TestHFilePerformance
Tests run: 1, Failures: 0, Errors: 0, Skipped: 0, Time elapsed: 3.836 sec
Running org.apache.hadoop.hbase.rest.TestScannersWithFilters
Tests run: 10, Failures: 0, Errors: 0, Skipped: 0, Time elapsed: 33.099 sec
Running org.apache.hadoop.hbase.io.TestHbaseObjectWritable
Tests run: 3, Failures: 0, Errors: 0, Skipped: 0, Time elapsed: 0.072 sec
Running org.apache.hadoop.hbase.regionserver.handler.TestOpenRegionHandler
Tests run: 3, Failures: 0, Errors: 0, Skipped: 0, Time elapsed: 0.308 sec
Running org.apache.hadoop.hbase.regionserver.TestResettingCounters
Tests run: 1, Failures: 0, Errors: 0, Skipped: 0, Time elapsed: 0.149 sec
Running org.apache.hadoop.hbase.regionserver.wal.TestHLogSplit
Tests run: 24, Failures: 0, Errors: 0, Skipped: 0, Time elapsed: 200.903 sec
Running org.apache.hadoop.hbase.thrift.TestThriftServer
Tests run: 1, Failures: 0, Errors: 0, Skipped: 0, Time elapsed: 89.843 sec
Running org.apache.hadoop.hbase.filter.TestColumnPrefixFilter
Tests run: 2, Failures: 0, Errors: 0, Skipped: 0, Time elapsed: 1.336 sec
Running org.apache.hadoop.hbase.regionserver.TestRpcMetrics
Tests run: 1, Failures: 0, Errors: 0, Skipped: 0, Time elapsed: 1.219 sec
Running org.apache.hadoop.hbase.master.TestZKBasedOpenCloseRegion
Tests run: 3, Failures: 0, Errors: 0, Skipped: 0, Time elapsed: 57.241 sec
Running org.apache.hadoop.hbase.TestCompare
Tests run: 1, Failures: 0, Errors: 0, Skipped: 0, Time elapsed: 0.012 sec
Running org.apache.hadoop.hbase.util.hbck.TestOfflineMetaRebuildHole
killed.
[INFO] ------------------------------------------------------------------------
[INFO] BUILD FAILURE
[INFO] ------------------------------------------------------------------------
[INFO] Total time: 41:15.107s
[INFO] Finished at: Fri Mar 30 06:58:08 UTC 2012
[INFO] Final Memory: 49M/1063M
[INFO] ------------------------------------------------------------------------
[ERROR] Failed to execute goal org.apache.maven.plugins:maven-surefire-plugin:2.4.3:test (default-test)
on project hbase: Error while executing forked tests.; nested exception is org.apache.maven.surefire.booter.shade.org.codehaus.plexus.util.cli.CommandLineException:
Error while executing external command, process killed. Process timeout out after 900 seconds
-> [Help 1]
[ERROR] 
[ERROR] To see the full stack trace of the errors, re-run Maven with the -e switch.
[ERROR] Re-run Maven using the -X switch to enable full debug logging.
[ERROR] 
[ERROR] For more information about the errors and possible solutions, please read the following
articles:
[ERROR] [Help 1] http://cwiki.apache.org/confluence/display/MAVEN/MojoExecutionException
Build step 'Invoke top-level Maven targets' marked build as failure
[locks-and-latches] Releasing all the locks
[locks-and-latches] All the locks released
Archiving artifacts
Recording test results

Mime
View raw message