hbase-dev mailing list archives

Site index · List index
Message view « Date » · « Thread »
Top « Date » · « Thread »
From Apache Jenkins Server <jenk...@builds.apache.org>
Subject Build failed in Jenkins: HBase-0.92-security #97
Date Thu, 08 Mar 2012 21:08:36 GMT
See <https://builds.apache.org/job/HBase-0.92-security/97/changes>

Changes:

[stack] HBASE-4890 fix possible NPE in HConnectionManager

[stack] HBASE-5537 MXBean shouldn't have a dependence on InterfaceStability until 0.96

[stack] HBASE-5519 Incorrect warning in splitlogmanager

[stack] HBASE-5522 hbase 0.92 test artifacts are missing from Maven central

[stack] HBASE-5522 hbase 0.92 test artifacts are missing from Maven central

[ramkrishna] HBASE-5531 Maven hadoop profile (version 23) needs to be updated with latest
23 snapshot (Laxman)

[stack] HBASE-5524 Add a couple of more filters to our rat exclusion set

[tedyu] HBASE-5371  Introduce AccessControllerProtocol.checkPermissions(Permission[] permissons)
               API (Enis)

[tedyu] HBASE-5358  HBaseObjectWritable should be able to serialize/deserialize generic
               arrays (Enis)

------------------------------------------
[...truncated 7098 lines...]
Running org.apache.hadoop.hbase.rest.TestScannersWithFilters
Tests run: 10, Failures: 0, Errors: 0, Skipped: 0, Time elapsed: 24.518 sec
Forking command line: /bin/sh -c cd /x1/jenkins/jenkins-slave/workspace/HBase-0.92-security/trunk
&& /x1/jenkins/tools/java/jdk1.6.0_27-32/jre/bin/java -enableassertions -Xmx1400m
-Djava.security.egd=file:/dev/./urandom -jar /x1/jenkins/jenkins-slave/workspace/HBase-0.92-security/trunk/target/surefire/surefirebooter8162744859306887324.jar
/x1/jenkins/jenkins-slave/workspace/HBase-0.92-security/trunk/target/surefire/surefire4297267152711295563tmp
/x1/jenkins/jenkins-slave/workspace/HBase-0.92-security/trunk/target/surefire/surefire5528113860985637540tmp
Running org.apache.hadoop.hbase.metrics.TestMetricsMBeanBase
Tests run: 2, Failures: 0, Errors: 0, Skipped: 0, Time elapsed: 1.104 sec
Forking command line: /bin/sh -c cd /x1/jenkins/jenkins-slave/workspace/HBase-0.92-security/trunk
&& /x1/jenkins/tools/java/jdk1.6.0_27-32/jre/bin/java -enableassertions -Xmx1400m
-Djava.security.egd=file:/dev/./urandom -jar /x1/jenkins/jenkins-slave/workspace/HBase-0.92-security/trunk/target/surefire/surefirebooter3394368294925662013.jar
/x1/jenkins/jenkins-slave/workspace/HBase-0.92-security/trunk/target/surefire/surefire8040229151343595471tmp
/x1/jenkins/jenkins-slave/workspace/HBase-0.92-security/trunk/target/surefire/surefire5510092526607172773tmp
Running org.apache.hadoop.hbase.io.hfile.TestHFileWriterV2
Tests run: 1, Failures: 0, Errors: 0, Skipped: 0, Time elapsed: 0.873 sec
Forking command line: /bin/sh -c cd /x1/jenkins/jenkins-slave/workspace/HBase-0.92-security/trunk
&& /x1/jenkins/tools/java/jdk1.6.0_27-32/jre/bin/java -enableassertions -Xmx1400m
-Djava.security.egd=file:/dev/./urandom -jar /x1/jenkins/jenkins-slave/workspace/HBase-0.92-security/trunk/target/surefire/surefirebooter2247921281422754923.jar
/x1/jenkins/jenkins-slave/workspace/HBase-0.92-security/trunk/target/surefire/surefire5649482814853054703tmp
/x1/jenkins/jenkins-slave/workspace/HBase-0.92-security/trunk/target/surefire/surefire8173454919289185031tmp
Running org.apache.hadoop.hbase.io.hfile.TestHFile
Tests run: 6, Failures: 0, Errors: 0, Skipped: 0, Time elapsed: 0.692 sec
Forking command line: /bin/sh -c cd /x1/jenkins/jenkins-slave/workspace/HBase-0.92-security/trunk
&& /x1/jenkins/tools/java/jdk1.6.0_27-32/jre/bin/java -enableassertions -Xmx1400m
-Djava.security.egd=file:/dev/./urandom -jar /x1/jenkins/jenkins-slave/workspace/HBase-0.92-security/trunk/target/surefire/surefirebooter1640035157862834931.jar
/x1/jenkins/jenkins-slave/workspace/HBase-0.92-security/trunk/target/surefire/surefire5335552648946722099tmp
/x1/jenkins/jenkins-slave/workspace/HBase-0.92-security/trunk/target/surefire/surefire2228166256734421492tmp
Running org.apache.hadoop.hbase.io.hfile.TestHFileBlockIndex
Tests run: 10, Failures: 0, Errors: 0, Skipped: 0, Time elapsed: 7.119 sec
Forking command line: /bin/sh -c cd /x1/jenkins/jenkins-slave/workspace/HBase-0.92-security/trunk
&& /x1/jenkins/tools/java/jdk1.6.0_27-32/jre/bin/java -enableassertions -Xmx1400m
-Djava.security.egd=file:/dev/./urandom -jar /x1/jenkins/jenkins-slave/workspace/HBase-0.92-security/trunk/target/surefire/surefirebooter2049457907409700532.jar
/x1/jenkins/jenkins-slave/workspace/HBase-0.92-security/trunk/target/surefire/surefire6854294846107532493tmp
/x1/jenkins/jenkins-slave/workspace/HBase-0.92-security/trunk/target/surefire/surefire1858875786684238780tmp
Running org.apache.hadoop.hbase.io.hfile.TestHFileSeek
Tests run: 1, Failures: 0, Errors: 0, Skipped: 0, Time elapsed: 4.096 sec
Forking command line: /bin/sh -c cd /x1/jenkins/jenkins-slave/workspace/HBase-0.92-security/trunk
&& /x1/jenkins/tools/java/jdk1.6.0_27-32/jre/bin/java -enableassertions -Xmx1400m
-Djava.security.egd=file:/dev/./urandom -jar /x1/jenkins/jenkins-slave/workspace/HBase-0.92-security/trunk/target/surefire/surefirebooter1492042602037744079.jar
/x1/jenkins/jenkins-slave/workspace/HBase-0.92-security/trunk/target/surefire/surefire4690172323156748818tmp
/x1/jenkins/jenkins-slave/workspace/HBase-0.92-security/trunk/target/surefire/surefire1288887777942620174tmp
Running org.apache.hadoop.hbase.io.hfile.TestLruBlockCache
Tests run: 7, Failures: 0, Errors: 0, Skipped: 0, Time elapsed: 0.35 sec
Forking command line: /bin/sh -c cd /x1/jenkins/jenkins-slave/workspace/HBase-0.92-security/trunk
&& /x1/jenkins/tools/java/jdk1.6.0_27-32/jre/bin/java -enableassertions -Xmx1400m
-Djava.security.egd=file:/dev/./urandom -jar /x1/jenkins/jenkins-slave/workspace/HBase-0.92-security/trunk/target/surefire/surefirebooter2881867412193269354.jar
/x1/jenkins/jenkins-slave/workspace/HBase-0.92-security/trunk/target/surefire/surefire7230459781189460700tmp
/x1/jenkins/jenkins-slave/workspace/HBase-0.92-security/trunk/target/surefire/surefire8724621515738548697tmp
Running org.apache.hadoop.hbase.io.hfile.TestFixedFileTrailer
Tests run: 2, Failures: 0, Errors: 0, Skipped: 0, Time elapsed: 0.589 sec
Forking command line: /bin/sh -c cd /x1/jenkins/jenkins-slave/workspace/HBase-0.92-security/trunk
&& /x1/jenkins/tools/java/jdk1.6.0_27-32/jre/bin/java -enableassertions -Xmx1400m
-Djava.security.egd=file:/dev/./urandom -jar /x1/jenkins/jenkins-slave/workspace/HBase-0.92-security/trunk/target/surefire/surefirebooter3953279694969640728.jar
/x1/jenkins/jenkins-slave/workspace/HBase-0.92-security/trunk/target/surefire/surefire7852959324318068975tmp
/x1/jenkins/jenkins-slave/workspace/HBase-0.92-security/trunk/target/surefire/surefire3926494812737210551tmp
Running org.apache.hadoop.hbase.io.hfile.TestCachedBlockQueue
Tests run: 2, Failures: 0, Errors: 0, Skipped: 0, Time elapsed: 0.09 sec
Forking command line: /bin/sh -c cd /x1/jenkins/jenkins-slave/workspace/HBase-0.92-security/trunk
&& /x1/jenkins/tools/java/jdk1.6.0_27-32/jre/bin/java -enableassertions -Xmx1400m
-Djava.security.egd=file:/dev/./urandom -jar /x1/jenkins/jenkins-slave/workspace/HBase-0.92-security/trunk/target/surefire/surefirebooter2808108005206230152.jar
/x1/jenkins/jenkins-slave/workspace/HBase-0.92-security/trunk/target/surefire/surefire8035431740245113273tmp
/x1/jenkins/jenkins-slave/workspace/HBase-0.92-security/trunk/target/surefire/surefire7364178250236214222tmp
Running org.apache.hadoop.hbase.io.hfile.TestHFilePerformance
Tests run: 1, Failures: 0, Errors: 0, Skipped: 0, Time elapsed: 4.09 sec
Forking command line: /bin/sh -c cd /x1/jenkins/jenkins-slave/workspace/HBase-0.92-security/trunk
&& /x1/jenkins/tools/java/jdk1.6.0_27-32/jre/bin/java -enableassertions -Xmx1400m
-Djava.security.egd=file:/dev/./urandom -jar /x1/jenkins/jenkins-slave/workspace/HBase-0.92-security/trunk/target/surefire/surefirebooter6883446602301576649.jar
/x1/jenkins/jenkins-slave/workspace/HBase-0.92-security/trunk/target/surefire/surefire7950832805806838594tmp
/x1/jenkins/jenkins-slave/workspace/HBase-0.92-security/trunk/target/surefire/surefire8124950661202751525tmp
Running org.apache.hadoop.hbase.io.hfile.TestCacheOnWrite
Tests run: 6, Failures: 0, Errors: 0, Skipped: 0, Time elapsed: 5.405 sec
Forking command line: /bin/sh -c cd /x1/jenkins/jenkins-slave/workspace/HBase-0.92-security/trunk
&& /x1/jenkins/tools/java/jdk1.6.0_27-32/jre/bin/java -enableassertions -Xmx1400m
-Djava.security.egd=file:/dev/./urandom -jar /x1/jenkins/jenkins-slave/workspace/HBase-0.92-security/trunk/target/surefire/surefirebooter1765640384641091816.jar
/x1/jenkins/jenkins-slave/workspace/HBase-0.92-security/trunk/target/surefire/surefire6257518478411560278tmp
/x1/jenkins/jenkins-slave/workspace/HBase-0.92-security/trunk/target/surefire/surefire2985804805571941739tmp
Running org.apache.hadoop.hbase.io.hfile.TestReseekTo
Tests run: 1, Failures: 0, Errors: 0, Skipped: 0, Time elapsed: 0.654 sec
Forking command line: /bin/sh -c cd /x1/jenkins/jenkins-slave/workspace/HBase-0.92-security/trunk
&& /x1/jenkins/tools/java/jdk1.6.0_27-32/jre/bin/java -enableassertions -Xmx1400m
-Djava.security.egd=file:/dev/./urandom -jar /x1/jenkins/jenkins-slave/workspace/HBase-0.92-security/trunk/target/surefire/surefirebooter7475552953755634849.jar
/x1/jenkins/jenkins-slave/workspace/HBase-0.92-security/trunk/target/surefire/surefire6408562992167309531tmp
/x1/jenkins/jenkins-slave/workspace/HBase-0.92-security/trunk/target/surefire/surefire8409505674074749388tmp
Running org.apache.hadoop.hbase.io.hfile.TestSeekTo
Tests run: 3, Failures: 0, Errors: 0, Skipped: 0, Time elapsed: 0.496 sec
Forking command line: /bin/sh -c cd /x1/jenkins/jenkins-slave/workspace/HBase-0.92-security/trunk
&& /x1/jenkins/tools/java/jdk1.6.0_27-32/jre/bin/java -enableassertions -Xmx1400m
-Djava.security.egd=file:/dev/./urandom -jar /x1/jenkins/jenkins-slave/workspace/HBase-0.92-security/trunk/target/surefire/surefirebooter796350623640915998.jar
/x1/jenkins/jenkins-slave/workspace/HBase-0.92-security/trunk/target/surefire/surefire6735131081933756160tmp
/x1/jenkins/jenkins-slave/workspace/HBase-0.92-security/trunk/target/surefire/surefire1964919091896094750tmp
Running org.apache.hadoop.hbase.io.hfile.TestBlockCacheColumnFamilySummary
Tests run: 4, Failures: 0, Errors: 0, Skipped: 0, Time elapsed: 0.05 sec
Forking command line: /bin/sh -c cd /x1/jenkins/jenkins-slave/workspace/HBase-0.92-security/trunk
&& /x1/jenkins/tools/java/jdk1.6.0_27-32/jre/bin/java -enableassertions -Xmx1400m
-Djava.security.egd=file:/dev/./urandom -jar /x1/jenkins/jenkins-slave/workspace/HBase-0.92-security/trunk/target/surefire/surefirebooter4468053661085169635.jar
/x1/jenkins/jenkins-slave/workspace/HBase-0.92-security/trunk/target/surefire/surefire5605849443005610274tmp
/x1/jenkins/jenkins-slave/workspace/HBase-0.92-security/trunk/target/surefire/surefire1621665336589625578tmp
Running org.apache.hadoop.hbase.io.hfile.TestHFileBlock
Tests run: 7, Failures: 0, Errors: 0, Skipped: 0, Time elapsed: 23.806 sec
Forking command line: /bin/sh -c cd /x1/jenkins/jenkins-slave/workspace/HBase-0.92-security/trunk
&& /x1/jenkins/tools/java/jdk1.6.0_27-32/jre/bin/java -enableassertions -Xmx1400m
-Djava.security.egd=file:/dev/./urandom -jar /x1/jenkins/jenkins-slave/workspace/HBase-0.92-security/trunk/target/surefire/surefirebooter291033327635846685.jar
/x1/jenkins/jenkins-slave/workspace/HBase-0.92-security/trunk/target/surefire/surefire1735500519451641796tmp
/x1/jenkins/jenkins-slave/workspace/HBase-0.92-security/trunk/target/surefire/surefire5450592992775496446tmp
Running org.apache.hadoop.hbase.io.hfile.slab.TestSlabCache
Tests run: 7, Failures: 0, Errors: 0, Skipped: 0, Time elapsed: 13.419 sec
Forking command line: /bin/sh -c cd /x1/jenkins/jenkins-slave/workspace/HBase-0.92-security/trunk
&& /x1/jenkins/tools/java/jdk1.6.0_27-32/jre/bin/java -enableassertions -Xmx1400m
-Djava.security.egd=file:/dev/./urandom -jar /x1/jenkins/jenkins-slave/workspace/HBase-0.92-security/trunk/target/surefire/surefirebooter7568456625929313950.jar
/x1/jenkins/jenkins-slave/workspace/HBase-0.92-security/trunk/target/surefire/surefire6682231696684240412tmp
/x1/jenkins/jenkins-slave/workspace/HBase-0.92-security/trunk/target/surefire/surefire3276082463449249065tmp
Running org.apache.hadoop.hbase.io.hfile.slab.TestSingleSizeCache
Tests run: 5, Failures: 0, Errors: 0, Skipped: 0, Time elapsed: 18.015 sec
Forking command line: /bin/sh -c cd /x1/jenkins/jenkins-slave/workspace/HBase-0.92-security/trunk
&& /x1/jenkins/tools/java/jdk1.6.0_27-32/jre/bin/java -enableassertions -Xmx1400m
-Djava.security.egd=file:/dev/./urandom -jar /x1/jenkins/jenkins-slave/workspace/HBase-0.92-security/trunk/target/surefire/surefirebooter4753033420325594311.jar
/x1/jenkins/jenkins-slave/workspace/HBase-0.92-security/trunk/target/surefire/surefire4623539784355372546tmp
/x1/jenkins/jenkins-slave/workspace/HBase-0.92-security/trunk/target/surefire/surefire5986078657706592295tmp
Running org.apache.hadoop.hbase.io.hfile.slab.TestSlab
Tests run: 1, Failures: 0, Errors: 0, Skipped: 0, Time elapsed: 0.114 sec
Forking command line: /bin/sh -c cd /x1/jenkins/jenkins-slave/workspace/HBase-0.92-security/trunk
&& /x1/jenkins/tools/java/jdk1.6.0_27-32/jre/bin/java -enableassertions -Xmx1400m
-Djava.security.egd=file:/dev/./urandom -jar /x1/jenkins/jenkins-slave/workspace/HBase-0.92-security/trunk/target/surefire/surefirebooter3122755858226162687.jar
/x1/jenkins/jenkins-slave/workspace/HBase-0.92-security/trunk/target/surefire/surefire657351029570931145tmp
/x1/jenkins/jenkins-slave/workspace/HBase-0.92-security/trunk/target/surefire/surefire5184200952037117820tmp
Running org.apache.hadoop.hbase.io.hfile.TestHFileReaderV1
Tests run: 1, Failures: 0, Errors: 0, Skipped: 0, Time elapsed: 0.453 sec
Forking command line: /bin/sh -c cd /x1/jenkins/jenkins-slave/workspace/HBase-0.92-security/trunk
&& /x1/jenkins/tools/java/jdk1.6.0_27-32/jre/bin/java -enableassertions -Xmx1400m
-Djava.security.egd=file:/dev/./urandom -jar /x1/jenkins/jenkins-slave/workspace/HBase-0.92-security/trunk/target/surefire/surefirebooter5759867055470963099.jar
/x1/jenkins/jenkins-slave/workspace/HBase-0.92-security/trunk/target/surefire/surefire8144214619505462647tmp
/x1/jenkins/jenkins-slave/workspace/HBase-0.92-security/trunk/target/surefire/surefire4778839613352059323tmp
Running org.apache.hadoop.hbase.io.TestHalfStoreFileReader
Tests run: 1, Failures: 0, Errors: 0, Skipped: 0, Time elapsed: 0.669 sec
Forking command line: /bin/sh -c cd /x1/jenkins/jenkins-slave/workspace/HBase-0.92-security/trunk
&& /x1/jenkins/tools/java/jdk1.6.0_27-32/jre/bin/java -enableassertions -Xmx1400m
-Djava.security.egd=file:/dev/./urandom -jar /x1/jenkins/jenkins-slave/workspace/HBase-0.92-security/trunk/target/surefire/surefirebooter8803169964943551371.jar
/x1/jenkins/jenkins-slave/workspace/HBase-0.92-security/trunk/target/surefire/surefire2396852058326241257tmp
/x1/jenkins/jenkins-slave/workspace/HBase-0.92-security/trunk/target/surefire/surefire604387660921640949tmp
Running org.apache.hadoop.hbase.io.TestHbaseObjectWritable
Tests run: 5, Failures: 0, Errors: 0, Skipped: 0, Time elapsed: 0.386 sec
Forking command line: /bin/sh -c cd /x1/jenkins/jenkins-slave/workspace/HBase-0.92-security/trunk
&& /x1/jenkins/tools/java/jdk1.6.0_27-32/jre/bin/java -enableassertions -Xmx1400m
-Djava.security.egd=file:/dev/./urandom -jar /x1/jenkins/jenkins-slave/workspace/HBase-0.92-security/trunk/target/surefire/surefirebooter3196353682339024966.jar
/x1/jenkins/jenkins-slave/workspace/HBase-0.92-security/trunk/target/surefire/surefire8598687682974832106tmp
/x1/jenkins/jenkins-slave/workspace/HBase-0.92-security/trunk/target/surefire/surefire5306413344925753321tmp
Running org.apache.hadoop.hbase.io.TestImmutableBytesWritable
Tests run: 3, Failures: 0, Errors: 0, Skipped: 0, Time elapsed: 0.086 sec
Forking command line: /bin/sh -c cd /x1/jenkins/jenkins-slave/workspace/HBase-0.92-security/trunk
&& /x1/jenkins/tools/java/jdk1.6.0_27-32/jre/bin/java -enableassertions -Xmx1400m
-Djava.security.egd=file:/dev/./urandom -jar /x1/jenkins/jenkins-slave/workspace/HBase-0.92-security/trunk/target/surefire/surefirebooter4910542520894939053.jar
/x1/jenkins/jenkins-slave/workspace/HBase-0.92-security/trunk/target/surefire/surefire9165667186097418757tmp
/x1/jenkins/jenkins-slave/workspace/HBase-0.92-security/trunk/target/surefire/surefire1354919944083810333tmp
Running org.apache.hadoop.hbase.io.TestHeapSize
Tests run: 2, Failures: 0, Errors: 0, Skipped: 0, Time elapsed: 0.128 sec
Forking command line: /bin/sh -c cd /x1/jenkins/jenkins-slave/workspace/HBase-0.92-security/trunk
&& /x1/jenkins/tools/java/jdk1.6.0_27-32/jre/bin/java -enableassertions -Xmx1400m
-Djava.security.egd=file:/dev/./urandom -jar /x1/jenkins/jenkins-slave/workspace/HBase-0.92-security/trunk/target/surefire/surefirebooter932667751717933001.jar
/x1/jenkins/jenkins-slave/workspace/HBase-0.92-security/trunk/target/surefire/surefire8535242987950925485tmp
/x1/jenkins/jenkins-slave/workspace/HBase-0.92-security/trunk/target/surefire/surefire4135816288104107459tmp
Running org.apache.hadoop.hbase.TestRegionRebalancing
Tests run: 1, Failures: 0, Errors: 0, Skipped: 0, Time elapsed: 55.451 sec
Forking command line: /bin/sh -c cd /x1/jenkins/jenkins-slave/workspace/HBase-0.92-security/trunk
&& /x1/jenkins/tools/java/jdk1.6.0_27-32/jre/bin/java -enableassertions -Xmx1400m
-Djava.security.egd=file:/dev/./urandom -jar /x1/jenkins/jenkins-slave/workspace/HBase-0.92-security/trunk/target/surefire/surefirebooter807221864400613130.jar
/x1/jenkins/jenkins-slave/workspace/HBase-0.92-security/trunk/target/surefire/surefire4236098079831515231tmp
/x1/jenkins/jenkins-slave/workspace/HBase-0.92-security/trunk/target/surefire/surefire2207430186857578476tmp
Running org.apache.hadoop.hbase.mapred.TestTableInputFormat
Tests run: 6, Failures: 0, Errors: 0, Skipped: 0, Time elapsed: 29.857 sec
Forking command line: /bin/sh -c cd /x1/jenkins/jenkins-slave/workspace/HBase-0.92-security/trunk
&& /x1/jenkins/tools/java/jdk1.6.0_27-32/jre/bin/java -enableassertions -Xmx1400m
-Djava.security.egd=file:/dev/./urandom -jar /x1/jenkins/jenkins-slave/workspace/HBase-0.92-security/trunk/target/surefire/surefirebooter7278636898847229770.jar
/x1/jenkins/jenkins-slave/workspace/HBase-0.92-security/trunk/target/surefire/surefire5923539774173786204tmp
/x1/jenkins/jenkins-slave/workspace/HBase-0.92-security/trunk/target/surefire/surefire7194721205550159278tmp
Running org.apache.hadoop.hbase.mapred.TestTableMapReduce
Tests run: 1, Failures: 0, Errors: 0, Skipped: 0, Time elapsed: 68.577 sec
Forking command line: /bin/sh -c cd /x1/jenkins/jenkins-slave/workspace/HBase-0.92-security/trunk
&& /x1/jenkins/tools/java/jdk1.6.0_27-32/jre/bin/java -enableassertions -Xmx1400m
-Djava.security.egd=file:/dev/./urandom -jar /x1/jenkins/jenkins-slave/workspace/HBase-0.92-security/trunk/target/surefire/surefirebooter8301357152346704380.jar
/x1/jenkins/jenkins-slave/workspace/HBase-0.92-security/trunk/target/surefire/surefire3563938924518373930tmp
/x1/jenkins/jenkins-slave/workspace/HBase-0.92-security/trunk/target/surefire/surefire5291316036111915556tmp
Running org.apache.hadoop.hbase.replication.regionserver.TestReplicationSink
Tests run: 5, Failures: 0, Errors: 0, Skipped: 0, Time elapsed: 19.684 sec
Forking command line: /bin/sh -c cd /x1/jenkins/jenkins-slave/workspace/HBase-0.92-security/trunk
&& /x1/jenkins/tools/java/jdk1.6.0_27-32/jre/bin/java -enableassertions -Xmx1400m
-Djava.security.egd=file:/dev/./urandom -jar /x1/jenkins/jenkins-slave/workspace/HBase-0.92-security/trunk/target/surefire/surefirebooter2614513284982929118.jar
/x1/jenkins/jenkins-slave/workspace/HBase-0.92-security/trunk/target/surefire/surefire2760923015203406013tmp
/x1/jenkins/jenkins-slave/workspace/HBase-0.92-security/trunk/target/surefire/surefire348306656521061919tmp
Running org.apache.hadoop.hbase.replication.regionserver.TestReplicationSourceManager
Tests run: 1, Failures: 0, Errors: 0, Skipped: 0, Time elapsed: 0.894 sec
Forking command line: /bin/sh -c cd /x1/jenkins/jenkins-slave/workspace/HBase-0.92-security/trunk
&& /x1/jenkins/tools/java/jdk1.6.0_27-32/jre/bin/java -enableassertions -Xmx1400m
-Djava.security.egd=file:/dev/./urandom -jar /x1/jenkins/jenkins-slave/workspace/HBase-0.92-security/trunk/target/surefire/surefirebooter7911884000286051095.jar
/x1/jenkins/jenkins-slave/workspace/HBase-0.92-security/trunk/target/surefire/surefire5244673316744220903tmp
/x1/jenkins/jenkins-slave/workspace/HBase-0.92-security/trunk/target/surefire/surefire5018437123802894103tmp
Running org.apache.hadoop.hbase.replication.TestReplicationSource
Tests run: 1, Failures: 0, Errors: 0, Skipped: 0, Time elapsed: 2.266 sec
Forking command line: /bin/sh -c cd /x1/jenkins/jenkins-slave/workspace/HBase-0.92-security/trunk
&& /x1/jenkins/tools/java/jdk1.6.0_27-32/jre/bin/java -enableassertions -Xmx1400m
-Djava.security.egd=file:/dev/./urandom -jar /x1/jenkins/jenkins-slave/workspace/HBase-0.92-security/trunk/target/surefire/surefirebooter3764528221349979269.jar
/x1/jenkins/jenkins-slave/workspace/HBase-0.92-security/trunk/target/surefire/surefire7069632813184245242tmp
/x1/jenkins/jenkins-slave/workspace/HBase-0.92-security/trunk/target/surefire/surefire2441363226969632272tmp
Running org.apache.hadoop.hbase.replication.TestReplication
Tests run: 8, Failures: 1, Errors: 0, Skipped: 0, Time elapsed: 161.342 sec <<< FAILURE!
Forking command line: /bin/sh -c cd /x1/jenkins/jenkins-slave/workspace/HBase-0.92-security/trunk
&& /x1/jenkins/tools/java/jdk1.6.0_27-32/jre/bin/java -enableassertions -Xmx1400m
-Djava.security.egd=file:/dev/./urandom -jar /x1/jenkins/jenkins-slave/workspace/HBase-0.92-security/trunk/target/surefire/surefirebooter215464250197871931.jar
/x1/jenkins/jenkins-slave/workspace/HBase-0.92-security/trunk/target/surefire/surefire6408184209358597756tmp
/x1/jenkins/jenkins-slave/workspace/HBase-0.92-security/trunk/target/surefire/surefire5955132428953653540tmp
Running org.apache.hadoop.hbase.replication.TestReplicationPeer
Tests run: 1, Failures: 0, Errors: 0, Skipped: 0, Time elapsed: 25.537 sec
Forking command line: /bin/sh -c cd /x1/jenkins/jenkins-slave/workspace/HBase-0.92-security/trunk
&& /x1/jenkins/tools/java/jdk1.6.0_27-32/jre/bin/java -enableassertions -Xmx1400m
-Djava.security.egd=file:/dev/./urandom -jar /x1/jenkins/jenkins-slave/workspace/HBase-0.92-security/trunk/target/surefire/surefirebooter1208017580667930462.jar
/x1/jenkins/jenkins-slave/workspace/HBase-0.92-security/trunk/target/surefire/surefire6317937755841486500tmp
/x1/jenkins/jenkins-slave/workspace/HBase-0.92-security/trunk/target/surefire/surefire5629310311789528986tmp
Running org.apache.hadoop.hbase.replication.TestMultiSlaveReplication
Tests run: 1, Failures: 0, Errors: 0, Skipped: 0, Time elapsed: 59.085 sec
Forking command line: /bin/sh -c cd /x1/jenkins/jenkins-slave/workspace/HBase-0.92-security/trunk
&& /x1/jenkins/tools/java/jdk1.6.0_27-32/jre/bin/java -enableassertions -Xmx1400m
-Djava.security.egd=file:/dev/./urandom -jar /x1/jenkins/jenkins-slave/workspace/HBase-0.92-security/trunk/target/surefire/surefirebooter7930303135274479835.jar
/x1/jenkins/jenkins-slave/workspace/HBase-0.92-security/trunk/target/surefire/surefire3069707912560383336tmp
/x1/jenkins/jenkins-slave/workspace/HBase-0.92-security/trunk/target/surefire/surefire914047590393868174tmp
Running org.apache.hadoop.hbase.replication.TestMasterReplication
Tests run: 2, Failures: 0, Errors: 0, Skipped: 0, Time elapsed: 94.343 sec
Forking command line: /bin/sh -c cd /x1/jenkins/jenkins-slave/workspace/HBase-0.92-security/trunk
&& /x1/jenkins/tools/java/jdk1.6.0_27-32/jre/bin/java -enableassertions -Xmx1400m
-Djava.security.egd=file:/dev/./urandom -jar /x1/jenkins/jenkins-slave/workspace/HBase-0.92-security/trunk/target/surefire/surefirebooter6887071547519161602.jar
/x1/jenkins/jenkins-slave/workspace/HBase-0.92-security/trunk/target/surefire/surefire5352490281322101874tmp
/x1/jenkins/jenkins-slave/workspace/HBase-0.92-security/trunk/target/surefire/surefire1210975486906507143tmp
Running org.apache.hadoop.hbase.util.TestHBaseFsckComparator
Tests run: 7, Failures: 0, Errors: 0, Skipped: 0, Time elapsed: 0.129 sec
Forking command line: /bin/sh -c cd /x1/jenkins/jenkins-slave/workspace/HBase-0.92-security/trunk
&& /x1/jenkins/tools/java/jdk1.6.0_27-32/jre/bin/java -enableassertions -Xmx1400m
-Djava.security.egd=file:/dev/./urandom -jar /x1/jenkins/jenkins-slave/workspace/HBase-0.92-security/trunk/target/surefire/surefirebooter1887601361341687630.jar
/x1/jenkins/jenkins-slave/workspace/HBase-0.92-security/trunk/target/surefire/surefire6422575192706604379tmp
/x1/jenkins/jenkins-slave/workspace/HBase-0.92-security/trunk/target/surefire/surefire2830057863762124336tmp
Running org.apache.hadoop.hbase.util.TestMergeTool
Tests run: 1, Failures: 0, Errors: 0, Skipped: 0, Time elapsed: 337.045 sec
Forking command line: /bin/sh -c cd /x1/jenkins/jenkins-slave/workspace/HBase-0.92-security/trunk
&& /x1/jenkins/tools/java/jdk1.6.0_27-32/jre/bin/java -enableassertions -Xmx1400m
-Djava.security.egd=file:/dev/./urandom -jar /x1/jenkins/jenkins-slave/workspace/HBase-0.92-security/trunk/target/surefire/surefirebooter6306997483786587821.jar
/x1/jenkins/jenkins-slave/workspace/HBase-0.92-security/trunk/target/surefire/surefire7123689607946380377tmp
/x1/jenkins/jenkins-slave/workspace/HBase-0.92-security/trunk/target/surefire/surefire3300370654790869971tmp
Running org.apache.hadoop.hbase.util.TestFSTableDescriptors
Tests run: 10, Failures: 0, Errors: 0, Skipped: 0, Time elapsed: 0.79 sec
Forking command line: /bin/sh -c cd /x1/jenkins/jenkins-slave/workspace/HBase-0.92-security/trunk
&& /x1/jenkins/tools/java/jdk1.6.0_27-32/jre/bin/java -enableassertions -Xmx1400m
-Djava.security.egd=file:/dev/./urandom -jar /x1/jenkins/jenkins-slave/workspace/HBase-0.92-security/trunk/target/surefire/surefirebooter5511892967259230435.jar
/x1/jenkins/jenkins-slave/workspace/HBase-0.92-security/trunk/target/surefire/surefire7449765360997518252tmp
/x1/jenkins/jenkins-slave/workspace/HBase-0.92-security/trunk/target/surefire/surefire3192463533776881926tmp
Running org.apache.hadoop.hbase.util.TestIdLock
Tests run: 1, Failures: 0, Errors: 0, Skipped: 0, Time elapsed: 15.201 sec
Forking command line: /bin/sh -c cd /x1/jenkins/jenkins-slave/workspace/HBase-0.92-security/trunk
&& /x1/jenkins/tools/java/jdk1.6.0_27-32/jre/bin/java -enableassertions -Xmx1400m
-Djava.security.egd=file:/dev/./urandom -jar /x1/jenkins/jenkins-slave/workspace/HBase-0.92-security/trunk/target/surefire/surefirebooter7941859816158846421.jar
/x1/jenkins/jenkins-slave/workspace/HBase-0.92-security/trunk/target/surefire/surefire7891429805812659274tmp
/x1/jenkins/jenkins-slave/workspace/HBase-0.92-security/trunk/target/surefire/surefire324157981814573226tmp
Running org.apache.hadoop.hbase.util.TestCompressionTest
Tests run: 1, Failures: 0, Errors: 0, Skipped: 0, Time elapsed: 0.32 sec
Forking command line: /bin/sh -c cd /x1/jenkins/jenkins-slave/workspace/HBase-0.92-security/trunk
&& /x1/jenkins/tools/java/jdk1.6.0_27-32/jre/bin/java -enableassertions -Xmx1400m
-Djava.security.egd=file:/dev/./urandom -jar /x1/jenkins/jenkins-slave/workspace/HBase-0.92-security/trunk/target/surefire/surefirebooter1666589983553894386.jar
/x1/jenkins/jenkins-slave/workspace/HBase-0.92-security/trunk/target/surefire/surefire724554608853919337tmp
/x1/jenkins/jenkins-slave/workspace/HBase-0.92-security/trunk/target/surefire/surefire2674273523489302262tmp
Running org.apache.hadoop.hbase.util.TestBytes
Tests run: 13, Failures: 0, Errors: 0, Skipped: 0, Time elapsed: 0.097 sec
Forking command line: /bin/sh -c cd /x1/jenkins/jenkins-slave/workspace/HBase-0.92-security/trunk
&& /x1/jenkins/tools/java/jdk1.6.0_27-32/jre/bin/java -enableassertions -Xmx1400m
-Djava.security.egd=file:/dev/./urandom -jar /x1/jenkins/jenkins-slave/workspace/HBase-0.92-security/trunk/target/surefire/surefirebooter2553840764754149102.jar
/x1/jenkins/jenkins-slave/workspace/HBase-0.92-security/trunk/target/surefire/surefire6680270889169892205tmp
/x1/jenkins/jenkins-slave/workspace/HBase-0.92-security/trunk/target/surefire/surefire4606009859881042150tmp
Running org.apache.hadoop.hbase.util.TestSortedCopyOnWriteSet
Tests run: 2, Failures: 0, Errors: 0, Skipped: 0, Time elapsed: 0.052 sec
Forking command line: /bin/sh -c cd /x1/jenkins/jenkins-slave/workspace/HBase-0.92-security/trunk
&& /x1/jenkins/tools/java/jdk1.6.0_27-32/jre/bin/java -enableassertions -Xmx1400m
-Djava.security.egd=file:/dev/./urandom -jar /x1/jenkins/jenkins-slave/workspace/HBase-0.92-security/trunk/target/surefire/surefirebooter5646503473136024442.jar
/x1/jenkins/jenkins-slave/workspace/HBase-0.92-security/trunk/target/surefire/surefire1413418490646489775tmp
/x1/jenkins/jenkins-slave/workspace/HBase-0.92-security/trunk/target/surefire/surefire3008967023610868314tmp
Running org.apache.hadoop.hbase.util.TestEnvironmentEdgeManager
Tests run: 2, Failures: 0, Errors: 0, Skipped: 0, Time elapsed: 0.167 sec
Forking command line: /bin/sh -c cd /x1/jenkins/jenkins-slave/workspace/HBase-0.92-security/trunk
&& /x1/jenkins/tools/java/jdk1.6.0_27-32/jre/bin/java -enableassertions -Xmx1400m
-Djava.security.egd=file:/dev/./urandom -jar /x1/jenkins/jenkins-slave/workspace/HBase-0.92-security/trunk/target/surefire/surefirebooter7834605998840856392.jar
/x1/jenkins/jenkins-slave/workspace/HBase-0.92-security/trunk/target/surefire/surefire4547448110703087838tmp
/x1/jenkins/jenkins-slave/workspace/HBase-0.92-security/trunk/target/surefire/surefire6667869850996448566tmp
Running org.apache.hadoop.hbase.util.TestKeying
Tests run: 1, Failures: 0, Errors: 0, Skipped: 0, Time elapsed: 0.021 sec
Forking command line: /bin/sh -c cd /x1/jenkins/jenkins-slave/workspace/HBase-0.92-security/trunk
&& /x1/jenkins/tools/java/jdk1.6.0_27-32/jre/bin/java -enableassertions -Xmx1400m
-Djava.security.egd=file:/dev/./urandom -jar /x1/jenkins/jenkins-slave/workspace/HBase-0.92-security/trunk/target/surefire/surefirebooter2253128112892218257.jar
/x1/jenkins/jenkins-slave/workspace/HBase-0.92-security/trunk/target/surefire/surefire6093119012418609982tmp
/x1/jenkins/jenkins-slave/workspace/HBase-0.92-security/trunk/target/surefire/surefire5987494006735995041tmp
Running org.apache.hadoop.hbase.util.TestByteBloomFilter
Tests run: 5, Failures: 0, Errors: 0, Skipped: 0, Time elapsed: 0.851 sec
Forking command line: /bin/sh -c cd /x1/jenkins/jenkins-slave/workspace/HBase-0.92-security/trunk
&& /x1/jenkins/tools/java/jdk1.6.0_27-32/jre/bin/java -enableassertions -Xmx1400m
-Djava.security.egd=file:/dev/./urandom -jar /x1/jenkins/jenkins-slave/workspace/HBase-0.92-security/trunk/target/surefire/surefirebooter541955159764806167.jar
/x1/jenkins/jenkins-slave/workspace/HBase-0.92-security/trunk/target/surefire/surefire5041800180338605361tmp
/x1/jenkins/jenkins-slave/workspace/HBase-0.92-security/trunk/target/surefire/surefire4331537897178537178tmp
Running org.apache.hadoop.hbase.util.TestRootPath
Tests run: 1, Failures: 0, Errors: 0, Skipped: 0, Time elapsed: 0.091 sec
Forking command line: /bin/sh -c cd /x1/jenkins/jenkins-slave/workspace/HBase-0.92-security/trunk
&& /x1/jenkins/tools/java/jdk1.6.0_27-32/jre/bin/java -enableassertions -Xmx1400m
-Djava.security.egd=file:/dev/./urandom -jar /x1/jenkins/jenkins-slave/workspace/HBase-0.92-security/trunk/target/surefire/surefirebooter3352625448324752135.jar
/x1/jenkins/jenkins-slave/workspace/HBase-0.92-security/trunk/target/surefire/surefire5287395719990292468tmp
/x1/jenkins/jenkins-slave/workspace/HBase-0.92-security/trunk/target/surefire/surefire5315099830549289601tmp
Running org.apache.hadoop.hbase.util.TestMergeTable
Tests run: 1, Failures: 0, Errors: 0, Skipped: 0, Time elapsed: 31.355 sec
Forking command line: /bin/sh -c cd /x1/jenkins/jenkins-slave/workspace/HBase-0.92-security/trunk
&& /x1/jenkins/tools/java/jdk1.6.0_27-32/jre/bin/java -enableassertions -Xmx1400m
-Djava.security.egd=file:/dev/./urandom -jar /x1/jenkins/jenkins-slave/workspace/HBase-0.92-security/trunk/target/surefire/surefirebooter8553472125391945883.jar
/x1/jenkins/jenkins-slave/workspace/HBase-0.92-security/trunk/target/surefire/surefire5319922185733869180tmp
/x1/jenkins/jenkins-slave/workspace/HBase-0.92-security/trunk/target/surefire/surefire3801511316674350716tmp
Running org.apache.hadoop.hbase.util.TestHBaseFsck
Tests run: 6, Failures: 0, Errors: 0, Skipped: 0, Time elapsed: 44.297 sec
Forking command line: /bin/sh -c cd /x1/jenkins/jenkins-slave/workspace/HBase-0.92-security/trunk
&& /x1/jenkins/tools/java/jdk1.6.0_27-32/jre/bin/java -enableassertions -Xmx1400m
-Djava.security.egd=file:/dev/./urandom -jar /x1/jenkins/jenkins-slave/workspace/HBase-0.92-security/trunk/target/surefire/surefirebooter6450270569415008692.jar
/x1/jenkins/jenkins-slave/workspace/HBase-0.92-security/trunk/target/surefire/surefire8856859845588014330tmp
/x1/jenkins/jenkins-slave/workspace/HBase-0.92-security/trunk/target/surefire/surefire2556277087198162004tmp
Running org.apache.hadoop.hbase.util.TestFSUtils
Tests run: 2, Failures: 0, Errors: 0, Skipped: 0, Time elapsed: 20.219 sec
Forking command line: /bin/sh -c cd /x1/jenkins/jenkins-slave/workspace/HBase-0.92-security/trunk
&& /x1/jenkins/tools/java/jdk1.6.0_27-32/jre/bin/java -enableassertions -Xmx1400m
-Djava.security.egd=file:/dev/./urandom -jar /x1/jenkins/jenkins-slave/workspace/HBase-0.92-security/trunk/target/surefire/surefirebooter2504767396388759651.jar
/x1/jenkins/jenkins-slave/workspace/HBase-0.92-security/trunk/target/surefire/surefire7060039948417705111tmp
/x1/jenkins/jenkins-slave/workspace/HBase-0.92-security/trunk/target/surefire/surefire6512752780291337503tmp
Running org.apache.hadoop.hbase.util.TestPoolMap
Tests run: 9, Failures: 0, Errors: 0, Skipped: 0, Time elapsed: 0.033 sec
Forking command line: /bin/sh -c cd /x1/jenkins/jenkins-slave/workspace/HBase-0.92-security/trunk
&& /x1/jenkins/tools/java/jdk1.6.0_27-32/jre/bin/java -enableassertions -Xmx1400m
-Djava.security.egd=file:/dev/./urandom -jar /x1/jenkins/jenkins-slave/workspace/HBase-0.92-security/trunk/target/surefire/surefirebooter6891535099548191668.jar
/x1/jenkins/jenkins-slave/workspace/HBase-0.92-security/trunk/target/surefire/surefire701567085518311289tmp
/x1/jenkins/jenkins-slave/workspace/HBase-0.92-security/trunk/target/surefire/surefire2611391467881654250tmp
Running org.apache.hadoop.hbase.util.TestBase64
Tests run: 1, Failures: 0, Errors: 0, Skipped: 0, Time elapsed: 0.08 sec
Forking command line: /bin/sh -c cd /x1/jenkins/jenkins-slave/workspace/HBase-0.92-security/trunk
&& /x1/jenkins/tools/java/jdk1.6.0_27-32/jre/bin/java -enableassertions -Xmx1400m
-Djava.security.egd=file:/dev/./urandom -jar /x1/jenkins/jenkins-slave/workspace/HBase-0.92-security/trunk/target/surefire/surefirebooter7129637684797575755.jar
/x1/jenkins/jenkins-slave/workspace/HBase-0.92-security/trunk/target/surefire/surefire5750286994676322722tmp
/x1/jenkins/jenkins-slave/workspace/HBase-0.92-security/trunk/target/surefire/surefire5576889269924930907tmp
Running org.apache.hadoop.hbase.util.hbck.TestOfflineMetaRebuildBase
Tests run: 1, Failures: 0, Errors: 0, Skipped: 0, Time elapsed: 34.238 sec
Forking command line: /bin/sh -c cd /x1/jenkins/jenkins-slave/workspace/HBase-0.92-security/trunk
&& /x1/jenkins/tools/java/jdk1.6.0_27-32/jre/bin/java -enableassertions -Xmx1400m
-Djava.security.egd=file:/dev/./urandom -jar /x1/jenkins/jenkins-slave/workspace/HBase-0.92-security/trunk/target/surefire/surefirebooter5650717640791481493.jar
/x1/jenkins/jenkins-slave/workspace/HBase-0.92-security/trunk/target/surefire/surefire1973561103549363191tmp
/x1/jenkins/jenkins-slave/workspace/HBase-0.92-security/trunk/target/surefire/surefire7376372158522843485tmp
Running org.apache.hadoop.hbase.util.hbck.TestOfflineMetaRebuildOverlap
Tests run: 1, Failures: 0, Errors: 0, Skipped: 0, Time elapsed: 32.185 sec
Forking command line: /bin/sh -c cd /x1/jenkins/jenkins-slave/workspace/HBase-0.92-security/trunk
&& /x1/jenkins/tools/java/jdk1.6.0_27-32/jre/bin/java -enableassertions -Xmx1400m
-Djava.security.egd=file:/dev/./urandom -jar /x1/jenkins/jenkins-slave/workspace/HBase-0.92-security/trunk/target/surefire/surefirebooter6012073805851576357.jar
/x1/jenkins/jenkins-slave/workspace/HBase-0.92-security/trunk/target/surefire/surefire1902937500438745840tmp
/x1/jenkins/jenkins-slave/workspace/HBase-0.92-security/trunk/target/surefire/surefire2895139538308787279tmp
Running org.apache.hadoop.hbase.util.hbck.TestOfflineMetaRebuildHole
Tests run: 1, Failures: 0, Errors: 0, Skipped: 0, Time elapsed: 32.338 sec
Forking command line: /bin/sh -c cd /x1/jenkins/jenkins-slave/workspace/HBase-0.92-security/trunk
&& /x1/jenkins/tools/java/jdk1.6.0_27-32/jre/bin/java -enableassertions -Xmx1400m
-Djava.security.egd=file:/dev/./urandom -jar /x1/jenkins/jenkins-slave/workspace/HBase-0.92-security/trunk/target/surefire/surefirebooter3548291932260140991.jar
/x1/jenkins/jenkins-slave/workspace/HBase-0.92-security/trunk/target/surefire/surefire4462524541099445593tmp
/x1/jenkins/jenkins-slave/workspace/HBase-0.92-security/trunk/target/surefire/surefire1311401954736534804tmp
Running org.apache.hadoop.hbase.util.TestDefaultEnvironmentEdge
Tests run: 1, Failures: 0, Errors: 0, Skipped: 0, Time elapsed: 0.044 sec
Forking command line: /bin/sh -c cd /x1/jenkins/jenkins-slave/workspace/HBase-0.92-security/trunk
&& /x1/jenkins/tools/java/jdk1.6.0_27-32/jre/bin/java -enableassertions -Xmx1400m
-Djava.security.egd=file:/dev/./urandom -jar /x1/jenkins/jenkins-slave/workspace/HBase-0.92-security/trunk/target/surefire/surefirebooter5548202325729459224.jar
/x1/jenkins/jenkins-slave/workspace/HBase-0.92-security/trunk/target/surefire/surefire2305132284601466489tmp
/x1/jenkins/jenkins-slave/workspace/HBase-0.92-security/trunk/target/surefire/surefire1898091906448976189tmp
Running org.apache.hadoop.hbase.util.TestIncrementingEnvironmentEdge
Tests run: 1, Failures: 0, Errors: 0, Skipped: 0, Time elapsed: 0.046 sec
Forking command line: /bin/sh -c cd /x1/jenkins/jenkins-slave/workspace/HBase-0.92-security/trunk
&& /x1/jenkins/tools/java/jdk1.6.0_27-32/jre/bin/java -enableassertions -Xmx1400m
-Djava.security.egd=file:/dev/./urandom -jar /x1/jenkins/jenkins-slave/workspace/HBase-0.92-security/trunk/target/surefire/surefirebooter9128311544871208166.jar
/x1/jenkins/jenkins-slave/workspace/HBase-0.92-security/trunk/target/surefire/surefire4771058651724781519tmp
/x1/jenkins/jenkins-slave/workspace/HBase-0.92-security/trunk/target/surefire/surefire7003066060175642433tmp
Running org.apache.hadoop.hbase.util.TestRegionSplitCalculator
Tests run: 14, Failures: 0, Errors: 0, Skipped: 0, Time elapsed: 0.155 sec
Forking command line: /bin/sh -c cd /x1/jenkins/jenkins-slave/workspace/HBase-0.92-security/trunk
&& /x1/jenkins/tools/java/jdk1.6.0_27-32/jre/bin/java -enableassertions -Xmx1400m
-Djava.security.egd=file:/dev/./urandom -jar /x1/jenkins/jenkins-slave/workspace/HBase-0.92-security/trunk/target/surefire/surefirebooter3285084933501125076.jar
/x1/jenkins/jenkins-slave/workspace/HBase-0.92-security/trunk/target/surefire/surefire435133147326700271tmp
/x1/jenkins/jenkins-slave/workspace/HBase-0.92-security/trunk/target/surefire/surefire3348809199227298982tmp
Running org.apache.hadoop.hbase.TestHRegionLocation
Tests run: 3, Failures: 0, Errors: 0, Skipped: 0, Time elapsed: 0.107 sec
Forking command line: /bin/sh -c cd /x1/jenkins/jenkins-slave/workspace/HBase-0.92-security/trunk
&& /x1/jenkins/tools/java/jdk1.6.0_27-32/jre/bin/java -enableassertions -Xmx1400m
-Djava.security.egd=file:/dev/./urandom -jar /x1/jenkins/jenkins-slave/workspace/HBase-0.92-security/trunk/target/surefire/surefirebooter2411790523269947154.jar
/x1/jenkins/jenkins-slave/workspace/HBase-0.92-security/trunk/target/surefire/surefire7898853071569377309tmp
/x1/jenkins/jenkins-slave/workspace/HBase-0.92-security/trunk/target/surefire/surefire7740512497786501104tmp
Running org.apache.hadoop.hbase.migration.TestMigrationFrom090To092
Tests run: 1, Failures: 0, Errors: 0, Skipped: 0, Time elapsed: 0.2 sec
Forking command line: /bin/sh -c cd /x1/jenkins/jenkins-slave/workspace/HBase-0.92-security/trunk
&& /x1/jenkins/tools/java/jdk1.6.0_27-32/jre/bin/java -enableassertions -Xmx1400m
-Djava.security.egd=file:/dev/./urandom -jar /x1/jenkins/jenkins-slave/workspace/HBase-0.92-security/trunk/target/surefire/surefirebooter7030870268031032911.jar
/x1/jenkins/jenkins-slave/workspace/HBase-0.92-security/trunk/target/surefire/surefire3395002097457878448tmp
/x1/jenkins/jenkins-slave/workspace/HBase-0.92-security/trunk/target/surefire/surefire3920930817130649570tmp
Running org.apache.hadoop.hbase.TestCompare
Tests run: 1, Failures: 0, Errors: 0, Skipped: 0, Time elapsed: 0.195 sec
Forking command line: /bin/sh -c cd /x1/jenkins/jenkins-slave/workspace/HBase-0.92-security/trunk
&& /x1/jenkins/tools/java/jdk1.6.0_27-32/jre/bin/java -enableassertions -Xmx1400m
-Djava.security.egd=file:/dev/./urandom -jar /x1/jenkins/jenkins-slave/workspace/HBase-0.92-security/trunk/target/surefire/surefirebooter939666764906235487.jar
/x1/jenkins/jenkins-slave/workspace/HBase-0.92-security/trunk/target/surefire/surefire3449217609843997720tmp
/x1/jenkins/jenkins-slave/workspace/HBase-0.92-security/trunk/target/surefire/surefire9038861183266176293tmp
Running org.apache.hadoop.hbase.TestInfoServers
Tests run: 2, Failures: 0, Errors: 0, Skipped: 0, Time elapsed: 17.248 sec
Forking command line: /bin/sh -c cd /x1/jenkins/jenkins-slave/workspace/HBase-0.92-security/trunk
&& /x1/jenkins/tools/java/jdk1.6.0_27-32/jre/bin/java -enableassertions -Xmx1400m
-Djava.security.egd=file:/dev/./urandom -jar /x1/jenkins/jenkins-slave/workspace/HBase-0.92-security/trunk/target/surefire/surefirebooter5685113823592779422.jar
/x1/jenkins/jenkins-slave/workspace/HBase-0.92-security/trunk/target/surefire/surefire3536840943655525708tmp
/x1/jenkins/jenkins-slave/workspace/HBase-0.92-security/trunk/target/surefire/surefire6250076821994197237tmp
Running org.apache.hadoop.hbase.TestHServerAddress
Tests run: 6, Failures: 0, Errors: 0, Skipped: 0, Time elapsed: 0.052 sec
Forking command line: /bin/sh -c cd /x1/jenkins/jenkins-slave/workspace/HBase-0.92-security/trunk
&& /x1/jenkins/tools/java/jdk1.6.0_27-32/jre/bin/java -enableassertions -Xmx1400m
-Djava.security.egd=file:/dev/./urandom -jar /x1/jenkins/jenkins-slave/workspace/HBase-0.92-security/trunk/target/surefire/surefirebooter8580212360336028024.jar
/x1/jenkins/jenkins-slave/workspace/HBase-0.92-security/trunk/target/surefire/surefire83300506465524494tmp
/x1/jenkins/jenkins-slave/workspace/HBase-0.92-security/trunk/target/surefire/surefire165258266030079648tmp
Running org.apache.hadoop.hbase.TestServerName
Tests run: 4, Failures: 0, Errors: 0, Skipped: 0, Time elapsed: 0.11 sec

Results :

Failed tests:   queueFailover(org.apache.hadoop.hbase.replication.TestReplication): Waited
too much time for queueFailover replication

Tests run: 1116, Failures: 1, Errors: 0, Skipped: 8

[INFO] ------------------------------------------------------------------------
[INFO] BUILD FAILURE
[INFO] ------------------------------------------------------------------------
[INFO] Total time: 1:54:41.389s
[INFO] Finished at: Thu Mar 08 21:08:30 UTC 2012
[INFO] Final Memory: 43M/754M
[INFO] ------------------------------------------------------------------------
[ERROR] Failed to execute goal org.apache.maven.plugins:maven-surefire-plugin:2.10:test (default-test)
on project hbase: There are test failures.
[ERROR] 
[ERROR] Please refer to /x1/jenkins/jenkins-slave/workspace/HBase-0.92-security/trunk/target/surefire-reports
for the individual test results.
[ERROR] -> [Help 1]
org.apache.maven.lifecycle.LifecycleExecutionException: Failed to execute goal org.apache.maven.plugins:maven-surefire-plugin:2.10:test
(default-test) on project hbase: There are test failures.

Please refer to /x1/jenkins/jenkins-slave/workspace/HBase-0.92-security/trunk/target/surefire-reports
for the individual test results.
	at org.apache.maven.lifecycle.internal.MojoExecutor.execute(MojoExecutor.java:213)
	at org.apache.maven.lifecycle.internal.MojoExecutor.execute(MojoExecutor.java:153)
	at org.apache.maven.lifecycle.internal.MojoExecutor.execute(MojoExecutor.java:145)
	at org.apache.maven.lifecycle.internal.LifecycleModuleBuilder.buildProject(LifecycleModuleBuilder.java:84)
	at org.apache.maven.lifecycle.internal.LifecycleModuleBuilder.buildProject(LifecycleModuleBuilder.java:59)
	at org.apache.maven.lifecycle.internal.LifecycleStarter.singleThreadedBuild(LifecycleStarter.java:183)
	at org.apache.maven.lifecycle.internal.LifecycleStarter.execute(LifecycleStarter.java:161)
	at org.apache.maven.DefaultMaven.doExecute(DefaultMaven.java:319)
	at org.apache.maven.DefaultMaven.execute(DefaultMaven.java:156)
	at org.apache.maven.cli.MavenCli.execute(MavenCli.java:537)
	at org.apache.maven.cli.MavenCli.doMain(MavenCli.java:196)
	at org.apache.maven.cli.MavenCli.main(MavenCli.java:141)
	at sun.reflect.NativeMethodAccessorImpl.invoke0(Native Method)
	at sun.reflect.NativeMethodAccessorImpl.invoke(NativeMethodAccessorImpl.java:39)
	at sun.reflect.DelegatingMethodAccessorImpl.invoke(DelegatingMethodAccessorImpl.java:25)
	at java.lang.reflect.Method.invoke(Method.java:597)
	at org.codehaus.plexus.classworlds.launcher.Launcher.launchEnhanced(Launcher.java:290)
	at org.codehaus.plexus.classworlds.launcher.Launcher.launch(Launcher.java:230)
	at org.codehaus.plexus.classworlds.launcher.Launcher.mainWithExitCode(Launcher.java:409)
	at org.codehaus.plexus.classworlds.launcher.Launcher.main(Launcher.java:352)
Caused by: org.apache.maven.plugin.MojoFailureException: There are test failures.

Please refer to /x1/jenkins/jenkins-slave/workspace/HBase-0.92-security/trunk/target/surefire-reports
for the individual test results.
	at org.apache.maven.plugin.surefire.SurefireHelper.reportExecution(SurefireHelper.java:87)
	at org.apache.maven.plugin.surefire.SurefirePlugin.writeSummary(SurefirePlugin.java:641)
	at org.apache.maven.plugin.surefire.SurefirePlugin.handleSummary(SurefirePlugin.java:615)
	at org.apache.maven.plugin.surefire.AbstractSurefireMojo.executeAfterPreconditionsChecked(AbstractSurefireMojo.java:137)
	at org.apache.maven.plugin.surefire.AbstractSurefireMojo.execute(AbstractSurefireMojo.java:98)
	at org.apache.maven.plugin.DefaultBuildPluginManager.executeMojo(DefaultBuildPluginManager.java:101)
	at org.apache.maven.lifecycle.internal.MojoExecutor.execute(MojoExecutor.java:209)
	... 19 more
[ERROR] 
[ERROR] 
[ERROR] For more information about the errors and possible solutions, please read the following
articles:
[ERROR] [Help 1] http://cwiki.apache.org/confluence/display/MAVEN/MojoFailureException
Build step 'Invoke top-level Maven targets' marked build as failure
Archiving artifacts
Updating HBASE-5522
Updating HBASE-5524
Updating HBASE-4890
Updating HBASE-5371
Updating HBASE-5531
Updating HBASE-5519
Updating HBASE-5537
Updating HBASE-5358
Recording test results


Mime
View raw message