hbase-dev mailing list archives

Site index · List index
Message view « Date » · « Thread »
Top « Date » · « Thread »
From Apache Jenkins Server <jenk...@builds.apache.org>
Subject Build failed in Jenkins: HBase-0.94 #73
Date Sat, 31 Mar 2012 18:33:33 GMT
See <https://builds.apache.org/job/HBase-0.94/73/>

------------------------------------------
[...truncated 7126 lines...]
Running org.apache.hadoop.hbase.monitoring.TestTaskMonitor
Tests run: 3, Failures: 0, Errors: 0, Skipped: 0, Time elapsed: 0.317 sec
Forking command line: /bin/sh -c cd <https://builds.apache.org/job/HBase-0.94/ws/trunk>
&& /home/jenkins/tools/java/jdk1.6.0_27-32/jre/bin/java -enableassertions -Xmx1900m
-Djava.security.egd=file:/dev/./urandom -jar <https://builds.apache.org/job/HBase-0.94/ws/trunk/target/surefire/surefirebooter7331436501219812366.jar>
<https://builds.apache.org/job/HBase-0.94/ws/trunk/target/surefire/surefire2564502218788149282tmp>
<https://builds.apache.org/job/HBase-0.94/ws/trunk/target/surefire/surefire_592660406248050769894tmp>
Running org.apache.hadoop.hbase.monitoring.TestMemoryBoundedLogMessageBuffer
Tests run: 2, Failures: 0, Errors: 0, Skipped: 0, Time elapsed: 0.254 sec
Forking command line: /bin/sh -c cd <https://builds.apache.org/job/HBase-0.94/ws/trunk>
&& /home/jenkins/tools/java/jdk1.6.0_27-32/jre/bin/java -enableassertions -Xmx1900m
-Djava.security.egd=file:/dev/./urandom -jar <https://builds.apache.org/job/HBase-0.94/ws/trunk/target/surefire/surefirebooter2621323779190168228.jar>
<https://builds.apache.org/job/HBase-0.94/ws/trunk/target/surefire/surefire6709522079798103272tmp>
<https://builds.apache.org/job/HBase-0.94/ws/trunk/target/surefire/surefire_602035495432092693447tmp>
Running org.apache.hadoop.hbase.metrics.TestMetricsMBeanBase
Tests run: 2, Failures: 0, Errors: 0, Skipped: 0, Time elapsed: 1.116 sec
Forking command line: /bin/sh -c cd <https://builds.apache.org/job/HBase-0.94/ws/trunk>
&& /home/jenkins/tools/java/jdk1.6.0_27-32/jre/bin/java -enableassertions -Xmx1900m
-Djava.security.egd=file:/dev/./urandom -jar <https://builds.apache.org/job/HBase-0.94/ws/trunk/target/surefire/surefirebooter4053727433963639010.jar>
<https://builds.apache.org/job/HBase-0.94/ws/trunk/target/surefire/surefire5113600115319959266tmp>
<https://builds.apache.org/job/HBase-0.94/ws/trunk/target/surefire/surefire_611718203021889744375tmp>
Running org.apache.hadoop.hbase.rest.TestScannersWithFilters
Tests run: 10, Failures: 0, Errors: 0, Skipped: 0, Time elapsed: 17.282 sec
Forking command line: /bin/sh -c cd <https://builds.apache.org/job/HBase-0.94/ws/trunk>
&& /home/jenkins/tools/java/jdk1.6.0_27-32/jre/bin/java -enableassertions -Xmx1900m
-Djava.security.egd=file:/dev/./urandom -jar <https://builds.apache.org/job/HBase-0.94/ws/trunk/target/surefire/surefirebooter8689058854541973945.jar>
<https://builds.apache.org/job/HBase-0.94/ws/trunk/target/surefire/surefire6270734899345460989tmp>
<https://builds.apache.org/job/HBase-0.94/ws/trunk/target/surefire/surefire_624174435793593853592tmp>
Running org.apache.hadoop.hbase.regionserver.TestServerCustomProtocol
Tests run: 7, Failures: 0, Errors: 0, Skipped: 0, Time elapsed: 14.863 sec
Forking command line: /bin/sh -c cd <https://builds.apache.org/job/HBase-0.94/ws/trunk>
&& /home/jenkins/tools/java/jdk1.6.0_27-32/jre/bin/java -enableassertions -Xmx1900m
-Djava.security.egd=file:/dev/./urandom -jar <https://builds.apache.org/job/HBase-0.94/ws/trunk/target/surefire/surefirebooter1465804150106971915.jar>
<https://builds.apache.org/job/HBase-0.94/ws/trunk/target/surefire/surefire5804380380629136445tmp>
<https://builds.apache.org/job/HBase-0.94/ws/trunk/target/surefire/surefire_636517367130234996261tmp>
Running org.apache.hadoop.hbase.regionserver.TestAtomicOperation
Tests run: 5, Failures: 0, Errors: 0, Skipped: 0, Time elapsed: 29.632 sec
Forking command line: /bin/sh -c cd <https://builds.apache.org/job/HBase-0.94/ws/trunk>
&& /home/jenkins/tools/java/jdk1.6.0_27-32/jre/bin/java -enableassertions -Xmx1900m
-Djava.security.egd=file:/dev/./urandom -jar <https://builds.apache.org/job/HBase-0.94/ws/trunk/target/surefire/surefirebooter841553724554237280.jar>
<https://builds.apache.org/job/HBase-0.94/ws/trunk/target/surefire/surefire3691262799242225364tmp>
<https://builds.apache.org/job/HBase-0.94/ws/trunk/target/surefire/surefire_648902149993364100225tmp>
Running org.apache.hadoop.hbase.regionserver.TestHRegion
Tests run: 61, Failures: 0, Errors: 0, Skipped: 0, Time elapsed: 35.013 sec
Forking command line: /bin/sh -c cd <https://builds.apache.org/job/HBase-0.94/ws/trunk>
&& /home/jenkins/tools/java/jdk1.6.0_27-32/jre/bin/java -enableassertions -Xmx1900m
-Djava.security.egd=file:/dev/./urandom -jar <https://builds.apache.org/job/HBase-0.94/ws/trunk/target/surefire/surefirebooter4444263008889424782.jar>
<https://builds.apache.org/job/HBase-0.94/ws/trunk/target/surefire/surefire8074970858122352545tmp>
<https://builds.apache.org/job/HBase-0.94/ws/trunk/target/surefire/surefire_658180740791419977869tmp>
Running org.apache.hadoop.hbase.regionserver.wal.TestWALReplayCompressed
Tests run: 5, Failures: 0, Errors: 0, Skipped: 0, Time elapsed: 27.432 sec
Running org.apache.hadoop.hbase.regionserver.wal.TestLogRollAbort
Tests run: 1, Failures: 0, Errors: 0, Skipped: 0, Time elapsed: 156.259 sec
Forking command line: /bin/sh -c cd <https://builds.apache.org/job/HBase-0.94/ws/trunk>
&& /home/jenkins/tools/java/jdk1.6.0_27-32/jre/bin/java -enableassertions -Xmx1900m
-Djava.security.egd=file:/dev/./urandom -jar <https://builds.apache.org/job/HBase-0.94/ws/trunk/target/surefire/surefirebooter4628989660106703821.jar>
<https://builds.apache.org/job/HBase-0.94/ws/trunk/target/surefire/surefire2661460022552071898tmp>
<https://builds.apache.org/job/HBase-0.94/ws/trunk/target/surefire/surefire_661899694619739524560tmp>
Running org.apache.hadoop.hbase.regionserver.wal.TestWALReplay
Tests run: 5, Failures: 0, Errors: 0, Skipped: 0, Time elapsed: 28.975 sec
Forking command line: /bin/sh -c cd <https://builds.apache.org/job/HBase-0.94/ws/trunk>
&& /home/jenkins/tools/java/jdk1.6.0_27-32/jre/bin/java -enableassertions -Xmx1900m
-Djava.security.egd=file:/dev/./urandom -jar <https://builds.apache.org/job/HBase-0.94/ws/trunk/target/surefire/surefirebooter1761792100387557441.jar>
<https://builds.apache.org/job/HBase-0.94/ws/trunk/target/surefire/surefire6665874769473308966tmp>
<https://builds.apache.org/job/HBase-0.94/ws/trunk/target/surefire/surefire_673379227569642256852tmp>
Running org.apache.hadoop.hbase.regionserver.wal.TestLogRollingNoCluster
Tests run: 1, Failures: 0, Errors: 0, Skipped: 0, Time elapsed: 2.196 sec
Forking command line: /bin/sh -c cd <https://builds.apache.org/job/HBase-0.94/ws/trunk>
&& /home/jenkins/tools/java/jdk1.6.0_27-32/jre/bin/java -enableassertions -Xmx1900m
-Djava.security.egd=file:/dev/./urandom -jar <https://builds.apache.org/job/HBase-0.94/ws/trunk/target/surefire/surefirebooter3315160426854899851.jar>
<https://builds.apache.org/job/HBase-0.94/ws/trunk/target/surefire/surefire6012749481130037561tmp>
<https://builds.apache.org/job/HBase-0.94/ws/trunk/target/surefire/surefire_688900446759639683369tmp>
Running org.apache.hadoop.hbase.regionserver.wal.TestHLogBench
Tests run: 1, Failures: 0, Errors: 0, Skipped: 0, Time elapsed: 1.367 sec
Forking command line: /bin/sh -c cd <https://builds.apache.org/job/HBase-0.94/ws/trunk>
&& /home/jenkins/tools/java/jdk1.6.0_27-32/jre/bin/java -enableassertions -Xmx1900m
-Djava.security.egd=file:/dev/./urandom -jar <https://builds.apache.org/job/HBase-0.94/ws/trunk/target/surefire/surefirebooter3151610842227264703.jar>
<https://builds.apache.org/job/HBase-0.94/ws/trunk/target/surefire/surefire7832742942719419520tmp>
<https://builds.apache.org/job/HBase-0.94/ws/trunk/target/surefire/surefire_691029217120601190979tmp>
Running org.apache.hadoop.hbase.regionserver.TestStore
Tests run: 12, Failures: 0, Errors: 0, Skipped: 0, Time elapsed: 9.351 sec
Forking command line: /bin/sh -c cd <https://builds.apache.org/job/HBase-0.94/ws/trunk>
&& /home/jenkins/tools/java/jdk1.6.0_27-32/jre/bin/java -enableassertions -Xmx1900m
-Djava.security.egd=file:/dev/./urandom -jar <https://builds.apache.org/job/HBase-0.94/ws/trunk/target/surefire/surefirebooter6135352305133066675.jar>
<https://builds.apache.org/job/HBase-0.94/ws/trunk/target/surefire/surefire5067327552561090927tmp>
<https://builds.apache.org/job/HBase-0.94/ws/trunk/target/surefire/surefire_706785973623143669777tmp>
Running org.apache.hadoop.hbase.regionserver.TestRpcMetrics
Tests run: 1, Failures: 0, Errors: 0, Skipped: 0, Time elapsed: 2.185 sec
Forking command line: /bin/sh -c cd <https://builds.apache.org/job/HBase-0.94/ws/trunk>
&& /home/jenkins/tools/java/jdk1.6.0_27-32/jre/bin/java -enableassertions -Xmx1900m
-Djava.security.egd=file:/dev/./urandom -jar <https://builds.apache.org/job/HBase-0.94/ws/trunk/target/surefire/surefirebooter3019496140976489404.jar>
<https://builds.apache.org/job/HBase-0.94/ws/trunk/target/surefire/surefire4608006020773041825tmp>
<https://builds.apache.org/job/HBase-0.94/ws/trunk/target/surefire/surefire_711046635875054726527tmp>
Running org.apache.hadoop.hbase.regionserver.TestBlocksRead
Tests run: 4, Failures: 0, Errors: 0, Skipped: 0, Time elapsed: 0.914 sec
Forking command line: /bin/sh -c cd <https://builds.apache.org/job/HBase-0.94/ws/trunk>
&& /home/jenkins/tools/java/jdk1.6.0_27-32/jre/bin/java -enableassertions -Xmx1900m
-Djava.security.egd=file:/dev/./urandom -jar <https://builds.apache.org/job/HBase-0.94/ws/trunk/target/surefire/surefirebooter981094238710237799.jar>
<https://builds.apache.org/job/HBase-0.94/ws/trunk/target/surefire/surefire3113305443399996500tmp>
<https://builds.apache.org/job/HBase-0.94/ws/trunk/target/surefire/surefire_722166338353218308338tmp>
Running org.apache.hadoop.hbase.regionserver.TestRegionServerMetrics
Tests run: 1, Failures: 0, Errors: 0, Skipped: 0, Time elapsed: 29.368 sec
Forking command line: /bin/sh -c cd <https://builds.apache.org/job/HBase-0.94/ws/trunk>
&& /home/jenkins/tools/java/jdk1.6.0_27-32/jre/bin/java -enableassertions -Xmx1900m
-Djava.security.egd=file:/dev/./urandom -jar <https://builds.apache.org/job/HBase-0.94/ws/trunk/target/surefire/surefirebooter1028414420214475128.jar>
<https://builds.apache.org/job/HBase-0.94/ws/trunk/target/surefire/surefire3770449934079013532tmp>
<https://builds.apache.org/job/HBase-0.94/ws/trunk/target/surefire/surefire_736122588072275903071tmp>
Running org.apache.hadoop.hbase.regionserver.metrics.TestSchemaMetrics
Tests run: 6, Failures: 0, Errors: 0, Skipped: 0, Time elapsed: 14.994 sec
Forking command line: /bin/sh -c cd <https://builds.apache.org/job/HBase-0.94/ws/trunk>
&& /home/jenkins/tools/java/jdk1.6.0_27-32/jre/bin/java -enableassertions -Xmx1900m
-Djava.security.egd=file:/dev/./urandom -jar <https://builds.apache.org/job/HBase-0.94/ws/trunk/target/surefire/surefirebooter72628650688943337.jar>
<https://builds.apache.org/job/HBase-0.94/ws/trunk/target/surefire/surefire7921983002061454834tmp>
<https://builds.apache.org/job/HBase-0.94/ws/trunk/target/surefire/surefire_746284211479392607441tmp>
Running org.apache.hadoop.hbase.regionserver.TestParallelPut
Tests run: 2, Failures: 0, Errors: 0, Skipped: 0, Time elapsed: 5.155 sec
Forking command line: /bin/sh -c cd <https://builds.apache.org/job/HBase-0.94/ws/trunk>
&& /home/jenkins/tools/java/jdk1.6.0_27-32/jre/bin/java -enableassertions -Xmx1900m
-Djava.security.egd=file:/dev/./urandom -jar <https://builds.apache.org/job/HBase-0.94/ws/trunk/target/surefire/surefirebooter9146993277543065247.jar>
<https://builds.apache.org/job/HBase-0.94/ws/trunk/target/surefire/surefire5560696979159174105tmp>
<https://builds.apache.org/job/HBase-0.94/ws/trunk/target/surefire/surefire_75989437073469694206tmp>
Running org.apache.hadoop.hbase.regionserver.TestStoreScanner
Tests run: 16, Failures: 0, Errors: 0, Skipped: 0, Time elapsed: 0.067 sec
Forking command line: /bin/sh -c cd <https://builds.apache.org/job/HBase-0.94/ws/trunk>
&& /home/jenkins/tools/java/jdk1.6.0_27-32/jre/bin/java -enableassertions -Xmx1900m
-Djava.security.egd=file:/dev/./urandom -jar <https://builds.apache.org/job/HBase-0.94/ws/trunk/target/surefire/surefirebooter1850974711092768069.jar>
<https://builds.apache.org/job/HBase-0.94/ws/trunk/target/surefire/surefire1630419267437298080tmp>
<https://builds.apache.org/job/HBase-0.94/ws/trunk/target/surefire/surefire_764009222408163215077tmp>
Running org.apache.hadoop.hbase.regionserver.TestStoreFileBlockCacheSummary
Tests run: 1, Failures: 0, Errors: 0, Skipped: 0, Time elapsed: 12.853 sec
Forking command line: /bin/sh -c cd <https://builds.apache.org/job/HBase-0.94/ws/trunk>
&& /home/jenkins/tools/java/jdk1.6.0_27-32/jre/bin/java -enableassertions -Xmx1900m
-Djava.security.egd=file:/dev/./urandom -jar <https://builds.apache.org/job/HBase-0.94/ws/trunk/target/surefire/surefirebooter344829234221224979.jar>
<https://builds.apache.org/job/HBase-0.94/ws/trunk/target/surefire/surefire6723877945316419614tmp>
<https://builds.apache.org/job/HBase-0.94/ws/trunk/target/surefire/surefire_778294182247112058677tmp>
Running org.apache.hadoop.hbase.regionserver.TestMultiColumnScanner
Tests run: 12, Failures: 0, Errors: 0, Skipped: 0, Time elapsed: 41.438 sec
Forking command line: /bin/sh -c cd <https://builds.apache.org/job/HBase-0.94/ws/trunk>
&& /home/jenkins/tools/java/jdk1.6.0_27-32/jre/bin/java -enableassertions -Xmx1900m
-Djava.security.egd=file:/dev/./urandom -jar <https://builds.apache.org/job/HBase-0.94/ws/trunk/target/surefire/surefirebooter4313241003158968791.jar>
<https://builds.apache.org/job/HBase-0.94/ws/trunk/target/surefire/surefire7639156073360627607tmp>
<https://builds.apache.org/job/HBase-0.94/ws/trunk/target/surefire/surefire_788523430259266936575tmp>
Running org.apache.hadoop.hbase.regionserver.handler.TestCloseRegionHandler
Tests run: 3, Failures: 0, Errors: 0, Skipped: 0, Time elapsed: 1.318 sec
Forking command line: /bin/sh -c cd <https://builds.apache.org/job/HBase-0.94/ws/trunk>
&& /home/jenkins/tools/java/jdk1.6.0_27-32/jre/bin/java -enableassertions -Xmx1900m
-Djava.security.egd=file:/dev/./urandom -jar <https://builds.apache.org/job/HBase-0.94/ws/trunk/target/surefire/surefirebooter6894018026804916103.jar>
<https://builds.apache.org/job/HBase-0.94/ws/trunk/target/surefire/surefire3095977385716953248tmp>
<https://builds.apache.org/job/HBase-0.94/ws/trunk/target/surefire/surefire_794300538281468588612tmp>
Running org.apache.hadoop.hbase.regionserver.handler.TestOpenRegionHandler
Tests run: 3, Failures: 0, Errors: 0, Skipped: 0, Time elapsed: 1.085 sec
Forking command line: /bin/sh -c cd <https://builds.apache.org/job/HBase-0.94/ws/trunk>
&& /home/jenkins/tools/java/jdk1.6.0_27-32/jre/bin/java -enableassertions -Xmx1900m
-Djava.security.egd=file:/dev/./urandom -jar <https://builds.apache.org/job/HBase-0.94/ws/trunk/target/surefire/surefirebooter3296768989729258605.jar>
<https://builds.apache.org/job/HBase-0.94/ws/trunk/target/surefire/surefire5829146236618181895tmp>
<https://builds.apache.org/job/HBase-0.94/ws/trunk/target/surefire/surefire_802720271614075110372tmp>
Running org.apache.hadoop.hbase.regionserver.TestMasterAddressManager
Tests run: 1, Failures: 0, Errors: 0, Skipped: 0, Time elapsed: 0.696 sec
Forking command line: /bin/sh -c cd <https://builds.apache.org/job/HBase-0.94/ws/trunk>
&& /home/jenkins/tools/java/jdk1.6.0_27-32/jre/bin/java -enableassertions -Xmx1900m
-Djava.security.egd=file:/dev/./urandom -jar <https://builds.apache.org/job/HBase-0.94/ws/trunk/target/surefire/surefirebooter4506944045409824780.jar>
<https://builds.apache.org/job/HBase-0.94/ws/trunk/target/surefire/surefire3723052079155455525tmp>
<https://builds.apache.org/job/HBase-0.94/ws/trunk/target/surefire/surefire_812059538186651037243tmp>
Running org.apache.hadoop.hbase.regionserver.TestSplitLogWorker
Tests run: 5, Failures: 0, Errors: 0, Skipped: 0, Time elapsed: 2.197 sec
Forking command line: /bin/sh -c cd <https://builds.apache.org/job/HBase-0.94/ws/trunk>
&& /home/jenkins/tools/java/jdk1.6.0_27-32/jre/bin/java -enableassertions -Xmx1900m
-Djava.security.egd=file:/dev/./urandom -jar <https://builds.apache.org/job/HBase-0.94/ws/trunk/target/surefire/surefirebooter4013418123733596788.jar>
<https://builds.apache.org/job/HBase-0.94/ws/trunk/target/surefire/surefire2283797699319883997tmp>
<https://builds.apache.org/job/HBase-0.94/ws/trunk/target/surefire/surefire_82514640358895944791tmp>
Running org.apache.hadoop.hbase.regionserver.TestSeekOptimizations
Tests run: 6, Failures: 0, Errors: 0, Skipped: 0, Time elapsed: 2.855 sec
Forking command line: /bin/sh -c cd <https://builds.apache.org/job/HBase-0.94/ws/trunk>
&& /home/jenkins/tools/java/jdk1.6.0_27-32/jre/bin/java -enableassertions -Xmx1900m
-Djava.security.egd=file:/dev/./urandom -jar <https://builds.apache.org/job/HBase-0.94/ws/trunk/target/surefire/surefirebooter6761771108815684054.jar>
<https://builds.apache.org/job/HBase-0.94/ws/trunk/target/surefire/surefire9207562171159503685tmp>
<https://builds.apache.org/job/HBase-0.94/ws/trunk/target/surefire/surefire_838757960489154590468tmp>
Running org.apache.hadoop.hbase.regionserver.TestFSErrorsExposed
Tests run: 3, Failures: 0, Errors: 0, Skipped: 0, Time elapsed: 28.924 sec
Forking command line: /bin/sh -c cd <https://builds.apache.org/job/HBase-0.94/ws/trunk>
&& /home/jenkins/tools/java/jdk1.6.0_27-32/jre/bin/java -enableassertions -Xmx1900m
-Djava.security.egd=file:/dev/./urandom -jar <https://builds.apache.org/job/HBase-0.94/ws/trunk/target/surefire/surefirebooter8293504699269113752.jar>
<https://builds.apache.org/job/HBase-0.94/ws/trunk/target/surefire/surefire8564480576490543486tmp>
<https://builds.apache.org/job/HBase-0.94/ws/trunk/target/surefire/surefire_848636168792937052952tmp>
Forking command line: /bin/sh -c cd <https://builds.apache.org/job/HBase-0.94/ws/trunk>
&& /home/jenkins/tools/java/jdk1.6.0_27-32/jre/bin/java -enableassertions -Xmx1900m
-Djava.security.egd=file:/dev/./urandom -jar <https://builds.apache.org/job/HBase-0.94/ws/trunk/target/surefire/surefirebooter1524696348253556997.jar>
<https://builds.apache.org/job/HBase-0.94/ws/trunk/target/surefire/surefire188055005213122464tmp>
<https://builds.apache.org/job/HBase-0.94/ws/trunk/target/surefire/surefire_852339683572699672768tmp>
Running org.apache.hadoop.hbase.filter.TestColumnRangeFilter
Tests run: 1, Failures: 0, Errors: 0, Skipped: 0, Time elapsed: 15.626 sec
Forking command line: /bin/sh -c cd <https://builds.apache.org/job/HBase-0.94/ws/trunk>
&& /home/jenkins/tools/java/jdk1.6.0_27-32/jre/bin/java -enableassertions -Xmx1900m
-Djava.security.egd=file:/dev/./urandom -jar <https://builds.apache.org/job/HBase-0.94/ws/trunk/target/surefire/surefirebooter103098039775486057.jar>
<https://builds.apache.org/job/HBase-0.94/ws/trunk/target/surefire/surefire6340206220666353883tmp>
<https://builds.apache.org/job/HBase-0.94/ws/trunk/target/surefire/surefire_86974005469355613448tmp>
Running org.apache.hadoop.hbase.TestGlobalMemStoreSize
Tests run: 1, Failures: 0, Errors: 0, Skipped: 0, Time elapsed: 14.857 sec
Forking command line: /bin/sh -c cd <https://builds.apache.org/job/HBase-0.94/ws/trunk>
&& /home/jenkins/tools/java/jdk1.6.0_27-32/jre/bin/java -enableassertions -Xmx1900m
-Djava.security.egd=file:/dev/./urandom -jar <https://builds.apache.org/job/HBase-0.94/ws/trunk/target/surefire/surefirebooter3544634949529509179.jar>
<https://builds.apache.org/job/HBase-0.94/ws/trunk/target/surefire/surefire758775789914515821tmp>
<https://builds.apache.org/job/HBase-0.94/ws/trunk/target/surefire/surefire_877429355858616728047tmp>
Running org.apache.hadoop.hbase.thrift2.TestThriftHBaseServiceHandler
Tests run: 12, Failures: 0, Errors: 0, Skipped: 0, Time elapsed: 12.891 sec
Forking command line: /bin/sh -c cd <https://builds.apache.org/job/HBase-0.94/ws/trunk>
&& /home/jenkins/tools/java/jdk1.6.0_27-32/jre/bin/java -enableassertions -Xmx1900m
-Djava.security.egd=file:/dev/./urandom -jar <https://builds.apache.org/job/HBase-0.94/ws/trunk/target/surefire/surefirebooter4020927588310449363.jar>
<https://builds.apache.org/job/HBase-0.94/ws/trunk/target/surefire/surefire1426459512718421395tmp>
<https://builds.apache.org/job/HBase-0.94/ws/trunk/target/surefire/surefire_885233746312940894712tmp>
Running org.apache.hadoop.hbase.TestMultiVersions
Tests run: 3, Failures: 0, Errors: 0, Skipped: 0, Time elapsed: 20.78 sec
Forking command line: /bin/sh -c cd <https://builds.apache.org/job/HBase-0.94/ws/trunk>
&& /home/jenkins/tools/java/jdk1.6.0_27-32/jre/bin/java -enableassertions -Xmx1900m
-Djava.security.egd=file:/dev/./urandom -jar <https://builds.apache.org/job/HBase-0.94/ws/trunk/target/surefire/surefirebooter4035843780602031313.jar>
<https://builds.apache.org/job/HBase-0.94/ws/trunk/target/surefire/surefire3712925883589173000tmp>
<https://builds.apache.org/job/HBase-0.94/ws/trunk/target/surefire/surefire_898141297010431276050tmp>
Running org.apache.hadoop.hbase.replication.TestReplicationZookeeper
Tests run: 1, Failures: 0, Errors: 0, Skipped: 0, Time elapsed: 0.667 sec
Forking command line: /bin/sh -c cd <https://builds.apache.org/job/HBase-0.94/ws/trunk>
&& /home/jenkins/tools/java/jdk1.6.0_27-32/jre/bin/java -enableassertions -Xmx1900m
-Djava.security.egd=file:/dev/./urandom -jar <https://builds.apache.org/job/HBase-0.94/ws/trunk/target/surefire/surefirebooter8451448326252479769.jar>
<https://builds.apache.org/job/HBase-0.94/ws/trunk/target/surefire/surefire6201442959717796447tmp>
<https://builds.apache.org/job/HBase-0.94/ws/trunk/target/surefire/surefire_904254411014376144292tmp>
Running org.apache.hadoop.hbase.replication.regionserver.TestReplicationSourceManager
Tests run: 1, Failures: 0, Errors: 0, Skipped: 0, Time elapsed: 1.033 sec
Forking command line: /bin/sh -c cd <https://builds.apache.org/job/HBase-0.94/ws/trunk>
&& /home/jenkins/tools/java/jdk1.6.0_27-32/jre/bin/java -enableassertions -Xmx1900m
-Djava.security.egd=file:/dev/./urandom -jar <https://builds.apache.org/job/HBase-0.94/ws/trunk/target/surefire/surefirebooter1879514627284242953.jar>
<https://builds.apache.org/job/HBase-0.94/ws/trunk/target/surefire/surefire5464347783851438810tmp>
<https://builds.apache.org/job/HBase-0.94/ws/trunk/target/surefire/surefire_913765384716265821394tmp>
Running org.apache.hadoop.hbase.replication.TestReplicationPeer
Tests run: 1, Failures: 0, Errors: 0, Skipped: 0, Time elapsed: 7.685 sec
Forking command line: /bin/sh -c cd <https://builds.apache.org/job/HBase-0.94/ws/trunk>
&& /home/jenkins/tools/java/jdk1.6.0_27-32/jre/bin/java -enableassertions -Xmx1900m
-Djava.security.egd=file:/dev/./urandom -jar <https://builds.apache.org/job/HBase-0.94/ws/trunk/target/surefire/surefirebooter6355000088679491230.jar>
<https://builds.apache.org/job/HBase-0.94/ws/trunk/target/surefire/surefire8639464592635661145tmp>
<https://builds.apache.org/job/HBase-0.94/ws/trunk/target/surefire/surefire_926959147177796932333tmp>
Running org.apache.hadoop.hbase.replication.regionserver.TestReplicationSink
Tests run: 5, Failures: 0, Errors: 0, Skipped: 0, Time elapsed: 10.304 sec
Forking command line: /bin/sh -c cd <https://builds.apache.org/job/HBase-0.94/ws/trunk>
&& /home/jenkins/tools/java/jdk1.6.0_27-32/jre/bin/java -enableassertions -Xmx1900m
-Djava.security.egd=file:/dev/./urandom -jar <https://builds.apache.org/job/HBase-0.94/ws/trunk/target/surefire/surefirebooter2021562480555335133.jar>
<https://builds.apache.org/job/HBase-0.94/ws/trunk/target/surefire/surefire2530477336758606566tmp>
<https://builds.apache.org/job/HBase-0.94/ws/trunk/target/surefire/surefire_938158355632408776788tmp>
Running org.apache.hadoop.hbase.replication.TestReplicationSource
Tests run: 1, Failures: 0, Errors: 0, Skipped: 0, Time elapsed: 2.238 sec
Forking command line: /bin/sh -c cd <https://builds.apache.org/job/HBase-0.94/ws/trunk>
&& /home/jenkins/tools/java/jdk1.6.0_27-32/jre/bin/java -enableassertions -Xmx1900m
-Djava.security.egd=file:/dev/./urandom -jar <https://builds.apache.org/job/HBase-0.94/ws/trunk/target/surefire/surefirebooter1794051433348192041.jar>
<https://builds.apache.org/job/HBase-0.94/ws/trunk/target/surefire/surefire2059443131838113603tmp>
<https://builds.apache.org/job/HBase-0.94/ws/trunk/target/surefire/surefire_948018885551200481085tmp>
Running org.apache.hadoop.hbase.avro.TestAvroServer
Tests run: 3, Failures: 0, Errors: 0, Skipped: 0, Time elapsed: 27.905 sec
Forking command line: /bin/sh -c cd <https://builds.apache.org/job/HBase-0.94/ws/trunk>
&& /home/jenkins/tools/java/jdk1.6.0_27-32/jre/bin/java -enableassertions -Xmx1900m
-Djava.security.egd=file:/dev/./urandom -jar <https://builds.apache.org/job/HBase-0.94/ws/trunk/target/surefire/surefirebooter6621318999647179786.jar>
<https://builds.apache.org/job/HBase-0.94/ws/trunk/target/surefire/surefire1482900426893870033tmp>
<https://builds.apache.org/job/HBase-0.94/ws/trunk/target/surefire/surefire_954479349350441725278tmp>
Running org.apache.hadoop.hbase.coprocessor.TestRegionServerCoprocessorExceptionWithRemove
Tests run: 1, Failures: 0, Errors: 0, Skipped: 0, Time elapsed: 16.085 sec
Forking command line: /bin/sh -c cd <https://builds.apache.org/job/HBase-0.94/ws/trunk>
&& /home/jenkins/tools/java/jdk1.6.0_27-32/jre/bin/java -enableassertions -Xmx1900m
-Djava.security.egd=file:/dev/./urandom -jar <https://builds.apache.org/job/HBase-0.94/ws/trunk/target/surefire/surefirebooter965472015307232031.jar>
<https://builds.apache.org/job/HBase-0.94/ws/trunk/target/surefire/surefire1617458534796555724tmp>
<https://builds.apache.org/job/HBase-0.94/ws/trunk/target/surefire/surefire_968698493411039816054tmp>
Running org.apache.hadoop.hbase.coprocessor.TestRegionObserverInterface
Tests run: 6, Failures: 0, Errors: 0, Skipped: 0, Time elapsed: 31.187 sec
Forking command line: /bin/sh -c cd <https://builds.apache.org/job/HBase-0.94/ws/trunk>
&& /home/jenkins/tools/java/jdk1.6.0_27-32/jre/bin/java -enableassertions -Xmx1900m
-Djava.security.egd=file:/dev/./urandom -jar <https://builds.apache.org/job/HBase-0.94/ws/trunk/target/surefire/surefirebooter8767534414276835382.jar>
<https://builds.apache.org/job/HBase-0.94/ws/trunk/target/surefire/surefire2321239062683951160tmp>
<https://builds.apache.org/job/HBase-0.94/ws/trunk/target/surefire/surefire_975974410707923245515tmp>
Running org.apache.hadoop.hbase.TestAcidGuarantees
Tests run: 3, Failures: 0, Errors: 0, Skipped: 0, Time elapsed: 94.633 sec
Forking command line: /bin/sh -c cd <https://builds.apache.org/job/HBase-0.94/ws/trunk>
&& /home/jenkins/tools/java/jdk1.6.0_27-32/jre/bin/java -enableassertions -Xmx1900m
-Djava.security.egd=file:/dev/./urandom -jar <https://builds.apache.org/job/HBase-0.94/ws/trunk/target/surefire/surefirebooter6418426947901274230.jar>
<https://builds.apache.org/job/HBase-0.94/ws/trunk/target/surefire/surefire923675850836037468tmp>
<https://builds.apache.org/job/HBase-0.94/ws/trunk/target/surefire/surefire_987610335093679736088tmp>
Running org.apache.hadoop.hbase.coprocessor.TestMasterObserver
Tests run: 3, Failures: 0, Errors: 2, Skipped: 0, Time elapsed: 20.794 sec <<< FAILURE!
Forking command line: /bin/sh -c cd <https://builds.apache.org/job/HBase-0.94/ws/trunk>
&& /home/jenkins/tools/java/jdk1.6.0_27-32/jre/bin/java -enableassertions -Xmx1900m
-Djava.security.egd=file:/dev/./urandom -jar <https://builds.apache.org/job/HBase-0.94/ws/trunk/target/surefire/surefirebooter6634563924153077985.jar>
<https://builds.apache.org/job/HBase-0.94/ws/trunk/target/surefire/surefire3901746126540527662tmp>
<https://builds.apache.org/job/HBase-0.94/ws/trunk/target/surefire/surefire_993155008301631024074tmp>
Running org.apache.hadoop.hbase.coprocessor.TestWALObserver
Tests run: 3, Failures: 0, Errors: 0, Skipped: 0, Time elapsed: 16.446 sec
Running org.apache.hadoop.hbase.coprocessor.TestCoprocessorEndpoint
Tests run: 3, Failures: 0, Errors: 0, Skipped: 1, Time elapsed: 29.476 sec
Forking command line: /bin/sh -c cd <https://builds.apache.org/job/HBase-0.94/ws/trunk>
&& /home/jenkins/tools/java/jdk1.6.0_27-32/jre/bin/java -enableassertions -Xmx1900m
-Djava.security.egd=file:/dev/./urandom -jar <https://builds.apache.org/job/HBase-0.94/ws/trunk/target/surefire/surefirebooter6651906233213791770.jar>
<https://builds.apache.org/job/HBase-0.94/ws/trunk/target/surefire/surefire4634546183721228330tmp>
<https://builds.apache.org/job/HBase-0.94/ws/trunk/target/surefire/surefire_1003892150339435549241tmp>
Forking command line: /bin/sh -c cd <https://builds.apache.org/job/HBase-0.94/ws/trunk>
&& /home/jenkins/tools/java/jdk1.6.0_27-32/jre/bin/java -enableassertions -Xmx1900m
-Djava.security.egd=file:/dev/./urandom -jar <https://builds.apache.org/job/HBase-0.94/ws/trunk/target/surefire/surefirebooter5094192558237484466.jar>
<https://builds.apache.org/job/HBase-0.94/ws/trunk/target/surefire/surefire1474989640552392002tmp>
<https://builds.apache.org/job/HBase-0.94/ws/trunk/target/surefire/surefire_1011894256864029880514tmp>
Running org.apache.hadoop.hbase.coprocessor.TestRegionObserverBypass
Tests run: 2, Failures: 0, Errors: 0, Skipped: 0, Time elapsed: 11.712 sec
Forking command line: /bin/sh -c cd <https://builds.apache.org/job/HBase-0.94/ws/trunk>
&& /home/jenkins/tools/java/jdk1.6.0_27-32/jre/bin/java -enableassertions -Xmx1900m
-Djava.security.egd=file:/dev/./urandom -jar <https://builds.apache.org/job/HBase-0.94/ws/trunk/target/surefire/surefirebooter2124054138494050702.jar>
<https://builds.apache.org/job/HBase-0.94/ws/trunk/target/surefire/surefire4884591412744115848tmp>
<https://builds.apache.org/job/HBase-0.94/ws/trunk/target/surefire/surefire_1022338210258055047180tmp>
Running org.apache.hadoop.hbase.coprocessor.TestMasterCoprocessorExceptionWithAbort
Tests run: 1, Failures: 0, Errors: 0, Skipped: 0, Time elapsed: 11.761 sec
Forking command line: /bin/sh -c cd <https://builds.apache.org/job/HBase-0.94/ws/trunk>
&& /home/jenkins/tools/java/jdk1.6.0_27-32/jre/bin/java -enableassertions -Xmx1900m
-Djava.security.egd=file:/dev/./urandom -jar <https://builds.apache.org/job/HBase-0.94/ws/trunk/target/surefire/surefirebooter3757902721246264981.jar>
<https://builds.apache.org/job/HBase-0.94/ws/trunk/target/surefire/surefire5889446712329130036tmp>
<https://builds.apache.org/job/HBase-0.94/ws/trunk/target/surefire/surefire_1035462584538475242653tmp>
Running org.apache.hadoop.hbase.coprocessor.TestRegionServerCoprocessorExceptionWithAbort
Tests run: 1, Failures: 0, Errors: 0, Skipped: 0, Time elapsed: 13.651 sec
Forking command line: /bin/sh -c cd <https://builds.apache.org/job/HBase-0.94/ws/trunk>
&& /home/jenkins/tools/java/jdk1.6.0_27-32/jre/bin/java -enableassertions -Xmx1900m
-Djava.security.egd=file:/dev/./urandom -jar <https://builds.apache.org/job/HBase-0.94/ws/trunk/target/surefire/surefirebooter7062876088141202322.jar>
<https://builds.apache.org/job/HBase-0.94/ws/trunk/target/surefire/surefire7852275051181800827tmp>
<https://builds.apache.org/job/HBase-0.94/ws/trunk/target/surefire/surefire_1048308234653759629588tmp>
Running org.apache.hadoop.hbase.coprocessor.TestAggregateProtocol
Tests run: 45, Failures: 0, Errors: 0, Skipped: 0, Time elapsed: 16.481 sec
Forking command line: /bin/sh -c cd <https://builds.apache.org/job/HBase-0.94/ws/trunk>
&& /home/jenkins/tools/java/jdk1.6.0_27-32/jre/bin/java -enableassertions -Xmx1900m
-Djava.security.egd=file:/dev/./urandom -jar <https://builds.apache.org/job/HBase-0.94/ws/trunk/target/surefire/surefirebooter3429091165564195562.jar>
<https://builds.apache.org/job/HBase-0.94/ws/trunk/target/surefire/surefire1475486974529136024tmp>
<https://builds.apache.org/job/HBase-0.94/ws/trunk/target/surefire/surefire_1056126493898041552018tmp>
Running org.apache.hadoop.hbase.coprocessor.TestMasterCoprocessorExceptionWithRemove
Tests run: 1, Failures: 0, Errors: 0, Skipped: 0, Time elapsed: 14.242 sec
Forking command line: /bin/sh -c cd <https://builds.apache.org/job/HBase-0.94/ws/trunk>
&& /home/jenkins/tools/java/jdk1.6.0_27-32/jre/bin/java -enableassertions -Xmx1900m
-Djava.security.egd=file:/dev/./urandom -jar <https://builds.apache.org/job/HBase-0.94/ws/trunk/target/surefire/surefirebooter7704774282051340555.jar>
<https://builds.apache.org/job/HBase-0.94/ws/trunk/target/surefire/surefire5598436349904638104tmp>
<https://builds.apache.org/job/HBase-0.94/ws/trunk/target/surefire/surefire_1066812949064579289396tmp>
Running org.apache.hadoop.hbase.coprocessor.TestClassLoading
Tests run: 5, Failures: 0, Errors: 0, Skipped: 0, Time elapsed: 26.001 sec
Forking command line: /bin/sh -c cd <https://builds.apache.org/job/HBase-0.94/ws/trunk>
&& /home/jenkins/tools/java/jdk1.6.0_27-32/jre/bin/java -enableassertions -Xmx1900m
-Djava.security.egd=file:/dev/./urandom -jar <https://builds.apache.org/job/HBase-0.94/ws/trunk/target/surefire/surefirebooter8787670508240128123.jar>
<https://builds.apache.org/job/HBase-0.94/ws/trunk/target/surefire/surefire4032810763022878080tmp>
<https://builds.apache.org/job/HBase-0.94/ws/trunk/target/surefire/surefire_1077762932890450290505tmp>
Running org.apache.hadoop.hbase.constraint.TestConstraint
Tests run: 5, Failures: 0, Errors: 0, Skipped: 0, Time elapsed: 28.745 sec
Forking command line: /bin/sh -c cd <https://builds.apache.org/job/HBase-0.94/ws/trunk>
&& /home/jenkins/tools/java/jdk1.6.0_27-32/jre/bin/java -enableassertions -Xmx1900m
-Djava.security.egd=file:/dev/./urandom -jar <https://builds.apache.org/job/HBase-0.94/ws/trunk/target/surefire/surefirebooter6771916510329209211.jar>
<https://builds.apache.org/job/HBase-0.94/ws/trunk/target/surefire/surefire8824964363394487398tmp>
<https://builds.apache.org/job/HBase-0.94/ws/trunk/target/surefire/surefire_1083991516984623788281tmp>
Running org.apache.hadoop.hbase.master.TestActiveMasterManager
Tests run: 2, Failures: 0, Errors: 0, Skipped: 0, Time elapsed: 0.911 sec
Forking command line: /bin/sh -c cd <https://builds.apache.org/job/HBase-0.94/ws/trunk>
&& /home/jenkins/tools/java/jdk1.6.0_27-32/jre/bin/java -enableassertions -Xmx1900m
-Djava.security.egd=file:/dev/./urandom -jar <https://builds.apache.org/job/HBase-0.94/ws/trunk/target/surefire/surefirebooter6707043176059524597.jar>
<https://builds.apache.org/job/HBase-0.94/ws/trunk/target/surefire/surefire7632228834831838725tmp>
<https://builds.apache.org/job/HBase-0.94/ws/trunk/target/surefire/surefire_1096638326720524526539tmp>
Running org.apache.hadoop.hbase.master.TestMasterStatusServlet
Tests run: 5, Failures: 0, Errors: 0, Skipped: 0, Time elapsed: 0.949 sec
Forking command line: /bin/sh -c cd <https://builds.apache.org/job/HBase-0.94/ws/trunk>
&& /home/jenkins/tools/java/jdk1.6.0_27-32/jre/bin/java -enableassertions -Xmx1900m
-Djava.security.egd=file:/dev/./urandom -jar <https://builds.apache.org/job/HBase-0.94/ws/trunk/target/surefire/surefirebooter513254686966535891.jar>
<https://builds.apache.org/job/HBase-0.94/ws/trunk/target/surefire/surefire6208130306305315377tmp>
<https://builds.apache.org/job/HBase-0.94/ws/trunk/target/surefire/surefire_1108100318098648691699tmp>
Running org.apache.hadoop.hbase.master.TestClockSkewDetection
Tests run: 1, Failures: 0, Errors: 0, Skipped: 0, Time elapsed: 0.247 sec
Forking command line: /bin/sh -c cd <https://builds.apache.org/job/HBase-0.94/ws/trunk>
&& /home/jenkins/tools/java/jdk1.6.0_27-32/jre/bin/java -enableassertions -Xmx1900m
-Djava.security.egd=file:/dev/./urandom -jar <https://builds.apache.org/job/HBase-0.94/ws/trunk/target/surefire/surefirebooter5282026373937681547.jar>
<https://builds.apache.org/job/HBase-0.94/ws/trunk/target/surefire/surefire1353783644303451639tmp>
<https://builds.apache.org/job/HBase-0.94/ws/trunk/target/surefire/surefire_1115984482773218082538tmp>
Running org.apache.hadoop.hbase.master.TestDefaultLoadBalancer
Tests run: 4, Failures: 0, Errors: 0, Skipped: 0, Time elapsed: 1.433 sec
Forking command line: /bin/sh -c cd <https://builds.apache.org/job/HBase-0.94/ws/trunk>
&& /home/jenkins/tools/java/jdk1.6.0_27-32/jre/bin/java -enableassertions -Xmx1900m
-Djava.security.egd=file:/dev/./urandom -jar <https://builds.apache.org/job/HBase-0.94/ws/trunk/target/surefire/surefirebooter7032218271824049782.jar>
<https://builds.apache.org/job/HBase-0.94/ws/trunk/target/surefire/surefire8783008396231503882tmp>
<https://builds.apache.org/job/HBase-0.94/ws/trunk/target/surefire/surefire_1125965044433231068505tmp>
Running org.apache.hadoop.hbase.master.TestHMasterRPCException
Tests run: 1, Failures: 0, Errors: 0, Skipped: 0, Time elapsed: 1.354 sec
Forking command line: /bin/sh -c cd <https://builds.apache.org/job/HBase-0.94/ws/trunk>
&& /home/jenkins/tools/java/jdk1.6.0_27-32/jre/bin/java -enableassertions -Xmx1900m
-Djava.security.egd=file:/dev/./urandom -jar <https://builds.apache.org/job/HBase-0.94/ws/trunk/target/surefire/surefirebooter7982686609707479905.jar>
<https://builds.apache.org/job/HBase-0.94/ws/trunk/target/surefire/surefire984382928139443157tmp>
<https://builds.apache.org/job/HBase-0.94/ws/trunk/target/surefire/surefire_1134194251474085671157tmp>
Running org.apache.hadoop.hbase.master.TestOpenedRegionHandler
Tests run: 2, Failures: 0, Errors: 0, Skipped: 0, Time elapsed: 13.177 sec
Forking command line: /bin/sh -c cd <https://builds.apache.org/job/HBase-0.94/ws/trunk>
&& /home/jenkins/tools/java/jdk1.6.0_27-32/jre/bin/java -enableassertions -Xmx1900m
-Djava.security.egd=file:/dev/./urandom -jar <https://builds.apache.org/job/HBase-0.94/ws/trunk/target/surefire/surefirebooter1628796657394299920.jar>
<https://builds.apache.org/job/HBase-0.94/ws/trunk/target/surefire/surefire1398868020732249557tmp>
<https://builds.apache.org/job/HBase-0.94/ws/trunk/target/surefire/surefire_1145047571403728180428tmp>
Running org.apache.hadoop.hbase.master.TestMaster
Tests run: 1, Failures: 0, Errors: 0, Skipped: 0, Time elapsed: 15.172 sec
Forking command line: /bin/sh -c cd <https://builds.apache.org/job/HBase-0.94/ws/trunk>
&& /home/jenkins/tools/java/jdk1.6.0_27-32/jre/bin/java -enableassertions -Xmx1900m
-Djava.security.egd=file:/dev/./urandom -jar <https://builds.apache.org/job/HBase-0.94/ws/trunk/target/surefire/surefirebooter5888051920095773334.jar>
<https://builds.apache.org/job/HBase-0.94/ws/trunk/target/surefire/surefire7211770791205800552tmp>
<https://builds.apache.org/job/HBase-0.94/ws/trunk/target/surefire/surefire_1153002491360111531529tmp>
Running org.apache.hadoop.hbase.master.TestSplitLogManager
Tests run: 12, Failures: 0, Errors: 0, Skipped: 0, Time elapsed: 14.448 sec
Forking command line: /bin/sh -c cd <https://builds.apache.org/job/HBase-0.94/ws/trunk>
&& /home/jenkins/tools/java/jdk1.6.0_27-32/jre/bin/java -enableassertions -Xmx1900m
-Djava.security.egd=file:/dev/./urandom -jar <https://builds.apache.org/job/HBase-0.94/ws/trunk/target/surefire/surefirebooter3172610330446942195.jar>
<https://builds.apache.org/job/HBase-0.94/ws/trunk/target/surefire/surefire4166439309629915625tmp>
<https://builds.apache.org/job/HBase-0.94/ws/trunk/target/surefire/surefire_1162165024668767122210tmp>
Running org.apache.hadoop.hbase.master.TestDeadServer
Tests run: 1, Failures: 0, Errors: 0, Skipped: 0, Time elapsed: 0.199 sec
Forking command line: /bin/sh -c cd <https://builds.apache.org/job/HBase-0.94/ws/trunk>
&& /home/jenkins/tools/java/jdk1.6.0_27-32/jre/bin/java -enableassertions -Xmx1900m
-Djava.security.egd=file:/dev/./urandom -jar <https://builds.apache.org/job/HBase-0.94/ws/trunk/target/surefire/surefirebooter862732914085968227.jar>
<https://builds.apache.org/job/HBase-0.94/ws/trunk/target/surefire/surefire2745368513563140255tmp>
<https://builds.apache.org/job/HBase-0.94/ws/trunk/target/surefire/surefire_1175934493309758687738tmp>
Running org.apache.hadoop.hbase.master.TestLogsCleaner
Tests run: 1, Failures: 0, Errors: 0, Skipped: 0, Time elapsed: 3.145 sec
Forking command line: /bin/sh -c cd <https://builds.apache.org/job/HBase-0.94/ws/trunk>
&& /home/jenkins/tools/java/jdk1.6.0_27-32/jre/bin/java -enableassertions -Xmx1900m
-Djava.security.egd=file:/dev/./urandom -jar <https://builds.apache.org/job/HBase-0.94/ws/trunk/target/surefire/surefirebooter2627174346240184962.jar>
<https://builds.apache.org/job/HBase-0.94/ws/trunk/target/surefire/surefire7034738939603488084tmp>
<https://builds.apache.org/job/HBase-0.94/ws/trunk/target/surefire/surefire_1183730180996145623444tmp>
Running org.apache.hadoop.hbase.master.TestMasterZKSessionRecovery
Tests run: 2, Failures: 0, Errors: 0, Skipped: 0, Time elapsed: 17.122 sec
Running org.apache.hadoop.hbase.master.TestZKBasedOpenCloseRegion
Tests run: 3, Failures: 0, Errors: 0, Skipped: 0, Time elapsed: 17.773 sec

Results :

Tests in error: 
  testTableOperations(org.apache.hadoop.hbase.coprocessor.TestMasterObserver): org.apache.hadoop.hbase.InvalidFamilyOperationException:
Column family 'fam2' does not exist(..)
  testRegionTransitionOperations(org.apache.hadoop.hbase.coprocessor.TestMasterObserver):
org.apache.hadoop.hbase.TableExistsException: observed_table

Tests run: 616, Failures: 0, Errors: 2, Skipped: 2

[INFO] ------------------------------------------------------------------------
[INFO] BUILD FAILURE
[INFO] ------------------------------------------------------------------------
[INFO] Total time: 26:04.391s
[INFO] Finished at: Sat Mar 31 18:32:37 UTC 2012
[INFO] Final Memory: 47M/595M
[INFO] ------------------------------------------------------------------------
[ERROR] Failed to execute goal org.apache.maven.plugins:maven-surefire-plugin:2.12-TRUNK-HBASE-2:test
(secondPartTestsExecution) on project hbase: There are test failures.
[ERROR] 
[ERROR] Please refer to <https://builds.apache.org/job/HBase-0.94/ws/trunk/target/surefire-reports>
for the individual test results.
[ERROR] -> [Help 1]
org.apache.maven.lifecycle.LifecycleExecutionException: Failed to execute goal org.apache.maven.plugins:maven-surefire-plugin:2.12-TRUNK-HBASE-2:test
(secondPartTestsExecution) on project hbase: There are test failures.

Please refer to <https://builds.apache.org/job/HBase-0.94/ws/trunk/target/surefire-reports>
for the individual test results.
	at org.apache.maven.lifecycle.internal.MojoExecutor.execute(MojoExecutor.java:213)
	at org.apache.maven.lifecycle.internal.MojoExecutor.execute(MojoExecutor.java:153)
	at org.apache.maven.lifecycle.internal.MojoExecutor.execute(MojoExecutor.java:145)
	at org.apache.maven.lifecycle.internal.MojoExecutor.executeForkedExecutions(MojoExecutor.java:365)
	at org.apache.maven.lifecycle.internal.MojoExecutor.execute(MojoExecutor.java:199)
	at org.apache.maven.lifecycle.internal.MojoExecutor.execute(MojoExecutor.java:153)
	at org.apache.maven.lifecycle.internal.MojoExecutor.execute(MojoExecutor.java:145)
	at org.apache.maven.lifecycle.internal.LifecycleModuleBuilder.buildProject(LifecycleModuleBuilder.java:84)
	at org.apache.maven.lifecycle.internal.LifecycleModuleBuilder.buildProject(LifecycleModuleBuilder.java:59)
	at org.apache.maven.lifecycle.internal.LifecycleStarter.singleThreadedBuild(LifecycleStarter.java:183)
	at org.apache.maven.lifecycle.internal.LifecycleStarter.execute(LifecycleStarter.java:161)
	at org.apache.maven.DefaultMaven.doExecute(DefaultMaven.java:319)
	at org.apache.maven.DefaultMaven.execute(DefaultMaven.java:156)
	at org.apache.maven.cli.MavenCli.execute(MavenCli.java:537)
	at org.apache.maven.cli.MavenCli.doMain(MavenCli.java:196)
	at org.apache.maven.cli.MavenCli.main(MavenCli.java:141)
	at sun.reflect.NativeMethodAccessorImpl.invoke0(Native Method)
	at sun.reflect.NativeMethodAccessorImpl.invoke(NativeMethodAccessorImpl.java:39)
	at sun.reflect.DelegatingMethodAccessorImpl.invoke(DelegatingMethodAccessorImpl.java:25)
	at java.lang.reflect.Method.invoke(Method.java:597)
	at org.codehaus.plexus.classworlds.launcher.Launcher.launchEnhanced(Launcher.java:290)
	at org.codehaus.plexus.classworlds.launcher.Launcher.launch(Launcher.java:230)
	at org.codehaus.plexus.classworlds.launcher.Launcher.mainWithExitCode(Launcher.java:409)
	at org.codehaus.plexus.classworlds.launcher.Launcher.main(Launcher.java:352)
Caused by: org.apache.maven.plugin.MojoFailureException: There are test failures.

Please refer to <https://builds.apache.org/job/HBase-0.94/ws/trunk/target/surefire-reports>
for the individual test results.
	at org.apache.maven.plugin.surefire.SurefireHelper.reportExecution(SurefireHelper.java:87)
	at org.apache.maven.plugin.surefire.SurefirePlugin.writeSummary(SurefirePlugin.java:651)
	at org.apache.maven.plugin.surefire.SurefirePlugin.handleSummary(SurefirePlugin.java:625)
	at org.apache.maven.plugin.surefire.AbstractSurefireMojo.executeAfterPreconditionsChecked(AbstractSurefireMojo.java:137)
	at org.apache.maven.plugin.surefire.AbstractSurefireMojo.execute(AbstractSurefireMojo.java:98)
	at org.apache.maven.plugin.DefaultBuildPluginManager.executeMojo(DefaultBuildPluginManager.java:101)
	at org.apache.maven.lifecycle.internal.MojoExecutor.execute(MojoExecutor.java:209)
	... 23 more
[ERROR] 
[ERROR] 
[ERROR] For more information about the errors and possible solutions, please read the following
articles:
[ERROR] [Help 1] http://cwiki.apache.org/confluence/display/MAVEN/MojoFailureException
Build step 'Invoke top-level Maven targets' marked build as failure
Archiving artifacts
Recording test results

Mime
View raw message