hbase-dev mailing list archives

Site index · List index
Message view « Date » · « Thread »
Top « Date » · « Thread »
From Apache Jenkins Server <jenk...@builds.apache.org>
Subject Build failed in Jenkins: HBase-0.92 #319
Date Wed, 07 Mar 2012 21:18:02 GMT
See <https://builds.apache.org/job/HBase-0.92/319/changes>

Changes:

[stack] HBASE-5537 MXBean shouldn't have a dependence on InterfaceStability until 0.96

------------------------------------------
[...truncated 6981 lines...]
Forking command line: /bin/sh -c cd <https://builds.apache.org/job/HBase-0.92/ws/trunk>
&& /home/jenkins/tools/java/jdk1.6.0_27-32/jre/bin/java -enableassertions -Xmx1400m
-Djava.security.egd=file:/dev/./urandom -jar <https://builds.apache.org/job/HBase-0.92/ws/trunk/target/surefire/surefirebooter6210832419576752463.jar>
<https://builds.apache.org/job/HBase-0.92/ws/trunk/target/surefire/surefire8062426124240942166tmp>
<https://builds.apache.org/job/HBase-0.92/ws/trunk/target/surefire/surefire5115745438215582762tmp>
Running org.apache.hadoop.hbase.metrics.TestMetricsMBeanBase
Tests run: 2, Failures: 0, Errors: 0, Skipped: 0, Time elapsed: 1.13 sec
Forking command line: /bin/sh -c cd <https://builds.apache.org/job/HBase-0.92/ws/trunk>
&& /home/jenkins/tools/java/jdk1.6.0_27-32/jre/bin/java -enableassertions -Xmx1400m
-Djava.security.egd=file:/dev/./urandom -jar <https://builds.apache.org/job/HBase-0.92/ws/trunk/target/surefire/surefirebooter5212125048621418666.jar>
<https://builds.apache.org/job/HBase-0.92/ws/trunk/target/surefire/surefire3465271497357811310tmp>
<https://builds.apache.org/job/HBase-0.92/ws/trunk/target/surefire/surefire5231484739439321643tmp>
Running org.apache.hadoop.hbase.executor.TestExecutorService
Tests run: 1, Failures: 0, Errors: 0, Skipped: 0, Time elapsed: 2.458 sec
Forking command line: /bin/sh -c cd <https://builds.apache.org/job/HBase-0.92/ws/trunk>
&& /home/jenkins/tools/java/jdk1.6.0_27-32/jre/bin/java -enableassertions -Xmx1400m
-Djava.security.egd=file:/dev/./urandom -jar <https://builds.apache.org/job/HBase-0.92/ws/trunk/target/surefire/surefirebooter1310329150532515398.jar>
<https://builds.apache.org/job/HBase-0.92/ws/trunk/target/surefire/surefire8654567279199972389tmp>
<https://builds.apache.org/job/HBase-0.92/ws/trunk/target/surefire/surefire6859471903732258029tmp>
Running org.apache.hadoop.hbase.rest.TestGzipFilter
Tests run: 3, Failures: 0, Errors: 0, Skipped: 0, Time elapsed: 21.319 sec
Forking command line: /bin/sh -c cd <https://builds.apache.org/job/HBase-0.92/ws/trunk>
&& /home/jenkins/tools/java/jdk1.6.0_27-32/jre/bin/java -enableassertions -Xmx1400m
-Djava.security.egd=file:/dev/./urandom -jar <https://builds.apache.org/job/HBase-0.92/ws/trunk/target/surefire/surefirebooter7475264009280507521.jar>
<https://builds.apache.org/job/HBase-0.92/ws/trunk/target/surefire/surefire5906153431855712992tmp>
<https://builds.apache.org/job/HBase-0.92/ws/trunk/target/surefire/surefire4183977386250647792tmp>
Running org.apache.hadoop.hbase.rest.TestMultiRowResource
Tests run: 3, Failures: 0, Errors: 0, Skipped: 0, Time elapsed: 22.736 sec
Forking command line: /bin/sh -c cd <https://builds.apache.org/job/HBase-0.92/ws/trunk>
&& /home/jenkins/tools/java/jdk1.6.0_27-32/jre/bin/java -enableassertions -Xmx1400m
-Djava.security.egd=file:/dev/./urandom -jar <https://builds.apache.org/job/HBase-0.92/ws/trunk/target/surefire/surefirebooter7789040020304655076.jar>
<https://builds.apache.org/job/HBase-0.92/ws/trunk/target/surefire/surefire3845287617562870731tmp>
<https://builds.apache.org/job/HBase-0.92/ws/trunk/target/surefire/surefire1808476530784387419tmp>
Running org.apache.hadoop.hbase.rest.TestScannersWithFilters
Tests run: 10, Failures: 0, Errors: 0, Skipped: 0, Time elapsed: 25.86 sec
Forking command line: /bin/sh -c cd <https://builds.apache.org/job/HBase-0.92/ws/trunk>
&& /home/jenkins/tools/java/jdk1.6.0_27-32/jre/bin/java -enableassertions -Xmx1400m
-Djava.security.egd=file:/dev/./urandom -jar <https://builds.apache.org/job/HBase-0.92/ws/trunk/target/surefire/surefirebooter6557425936550742776.jar>
<https://builds.apache.org/job/HBase-0.92/ws/trunk/target/surefire/surefire2735565748577849363tmp>
<https://builds.apache.org/job/HBase-0.92/ws/trunk/target/surefire/surefire1252966272436194742tmp>
Running org.apache.hadoop.hbase.rest.TestRowResource
Tests run: 11, Failures: 0, Errors: 0, Skipped: 0, Time elapsed: 35.281 sec
Forking command line: /bin/sh -c cd <https://builds.apache.org/job/HBase-0.92/ws/trunk>
&& /home/jenkins/tools/java/jdk1.6.0_27-32/jre/bin/java -enableassertions -Xmx1400m
-Djava.security.egd=file:/dev/./urandom -jar <https://builds.apache.org/job/HBase-0.92/ws/trunk/target/surefire/surefirebooter2049078650542580072.jar>
<https://builds.apache.org/job/HBase-0.92/ws/trunk/target/surefire/surefire3588830376498399165tmp>
<https://builds.apache.org/job/HBase-0.92/ws/trunk/target/surefire/surefire6874953336513198662tmp>
Running org.apache.hadoop.hbase.rest.model.TestCellModel
Tests run: 3, Failures: 0, Errors: 0, Skipped: 0, Time elapsed: 0.372 sec
Forking command line: /bin/sh -c cd <https://builds.apache.org/job/HBase-0.92/ws/trunk>
&& /home/jenkins/tools/java/jdk1.6.0_27-32/jre/bin/java -enableassertions -Xmx1400m
-Djava.security.egd=file:/dev/./urandom -jar <https://builds.apache.org/job/HBase-0.92/ws/trunk/target/surefire/surefirebooter489282426583331186.jar>
<https://builds.apache.org/job/HBase-0.92/ws/trunk/target/surefire/surefire566559225853536984tmp>
<https://builds.apache.org/job/HBase-0.92/ws/trunk/target/surefire/surefire3501163619111911102tmp>
Running org.apache.hadoop.hbase.rest.model.TestCellSetModel
Tests run: 3, Failures: 0, Errors: 0, Skipped: 0, Time elapsed: 0.41 sec
Forking command line: /bin/sh -c cd <https://builds.apache.org/job/HBase-0.92/ws/trunk>
&& /home/jenkins/tools/java/jdk1.6.0_27-32/jre/bin/java -enableassertions -Xmx1400m
-Djava.security.egd=file:/dev/./urandom -jar <https://builds.apache.org/job/HBase-0.92/ws/trunk/target/surefire/surefirebooter7857702036830974102.jar>
<https://builds.apache.org/job/HBase-0.92/ws/trunk/target/surefire/surefire6791509802540684828tmp>
<https://builds.apache.org/job/HBase-0.92/ws/trunk/target/surefire/surefire6084371590668361740tmp>
Running org.apache.hadoop.hbase.rest.model.TestTableListModel
Tests run: 3, Failures: 0, Errors: 0, Skipped: 0, Time elapsed: 0.386 sec
Forking command line: /bin/sh -c cd <https://builds.apache.org/job/HBase-0.92/ws/trunk>
&& /home/jenkins/tools/java/jdk1.6.0_27-32/jre/bin/java -enableassertions -Xmx1400m
-Djava.security.egd=file:/dev/./urandom -jar <https://builds.apache.org/job/HBase-0.92/ws/trunk/target/surefire/surefirebooter3042640820165260318.jar>
<https://builds.apache.org/job/HBase-0.92/ws/trunk/target/surefire/surefire5498065285935587029tmp>
<https://builds.apache.org/job/HBase-0.92/ws/trunk/target/surefire/surefire8898218961615449408tmp>
Running org.apache.hadoop.hbase.rest.model.TestVersionModel
Tests run: 3, Failures: 0, Errors: 0, Skipped: 0, Time elapsed: 0.37 sec
Forking command line: /bin/sh -c cd <https://builds.apache.org/job/HBase-0.92/ws/trunk>
&& /home/jenkins/tools/java/jdk1.6.0_27-32/jre/bin/java -enableassertions -Xmx1400m
-Djava.security.egd=file:/dev/./urandom -jar <https://builds.apache.org/job/HBase-0.92/ws/trunk/target/surefire/surefirebooter658671333122826857.jar>
<https://builds.apache.org/job/HBase-0.92/ws/trunk/target/surefire/surefire5944130065692092425tmp>
<https://builds.apache.org/job/HBase-0.92/ws/trunk/target/surefire/surefire5771533248970514385tmp>
Running org.apache.hadoop.hbase.rest.model.TestColumnSchemaModel
Tests run: 2, Failures: 0, Errors: 0, Skipped: 0, Time elapsed: 0.277 sec
Forking command line: /bin/sh -c cd <https://builds.apache.org/job/HBase-0.92/ws/trunk>
&& /home/jenkins/tools/java/jdk1.6.0_27-32/jre/bin/java -enableassertions -Xmx1400m
-Djava.security.egd=file:/dev/./urandom -jar <https://builds.apache.org/job/HBase-0.92/ws/trunk/target/surefire/surefirebooter2009532526629268266.jar>
<https://builds.apache.org/job/HBase-0.92/ws/trunk/target/surefire/surefire274355954845885525tmp>
<https://builds.apache.org/job/HBase-0.92/ws/trunk/target/surefire/surefire5171403599191677951tmp>
Running org.apache.hadoop.hbase.rest.model.TestTableInfoModel
Tests run: 3, Failures: 0, Errors: 0, Skipped: 0, Time elapsed: 0.403 sec
Forking command line: /bin/sh -c cd <https://builds.apache.org/job/HBase-0.92/ws/trunk>
&& /home/jenkins/tools/java/jdk1.6.0_27-32/jre/bin/java -enableassertions -Xmx1400m
-Djava.security.egd=file:/dev/./urandom -jar <https://builds.apache.org/job/HBase-0.92/ws/trunk/target/surefire/surefirebooter6422242447718621149.jar>
<https://builds.apache.org/job/HBase-0.92/ws/trunk/target/surefire/surefire7607420470184786456tmp>
<https://builds.apache.org/job/HBase-0.92/ws/trunk/target/surefire/surefire8781178351388378064tmp>
Running org.apache.hadoop.hbase.rest.model.TestRowModel
Tests run: 2, Failures: 0, Errors: 0, Skipped: 0, Time elapsed: 0.372 sec
Forking command line: /bin/sh -c cd <https://builds.apache.org/job/HBase-0.92/ws/trunk>
&& /home/jenkins/tools/java/jdk1.6.0_27-32/jre/bin/java -enableassertions -Xmx1400m
-Djava.security.egd=file:/dev/./urandom -jar <https://builds.apache.org/job/HBase-0.92/ws/trunk/target/surefire/surefirebooter8852529322174674422.jar>
<https://builds.apache.org/job/HBase-0.92/ws/trunk/target/surefire/surefire5142087393270865459tmp>
<https://builds.apache.org/job/HBase-0.92/ws/trunk/target/surefire/surefire6763390172361351570tmp>
Running org.apache.hadoop.hbase.rest.model.TestTableSchemaModel
Tests run: 3, Failures: 0, Errors: 0, Skipped: 0, Time elapsed: 0.406 sec
Forking command line: /bin/sh -c cd <https://builds.apache.org/job/HBase-0.92/ws/trunk>
&& /home/jenkins/tools/java/jdk1.6.0_27-32/jre/bin/java -enableassertions -Xmx1400m
-Djava.security.egd=file:/dev/./urandom -jar <https://builds.apache.org/job/HBase-0.92/ws/trunk/target/surefire/surefirebooter6488802661130640884.jar>
<https://builds.apache.org/job/HBase-0.92/ws/trunk/target/surefire/surefire1420171050550444003tmp>
<https://builds.apache.org/job/HBase-0.92/ws/trunk/target/surefire/surefire6114551894249203127tmp>
Running org.apache.hadoop.hbase.rest.model.TestStorageClusterVersionModel
Tests run: 2, Failures: 0, Errors: 0, Skipped: 0, Time elapsed: 0.272 sec
Forking command line: /bin/sh -c cd <https://builds.apache.org/job/HBase-0.92/ws/trunk>
&& /home/jenkins/tools/java/jdk1.6.0_27-32/jre/bin/java -enableassertions -Xmx1400m
-Djava.security.egd=file:/dev/./urandom -jar <https://builds.apache.org/job/HBase-0.92/ws/trunk/target/surefire/surefirebooter752285296631309015.jar>
<https://builds.apache.org/job/HBase-0.92/ws/trunk/target/surefire/surefire5766599732653307417tmp>
<https://builds.apache.org/job/HBase-0.92/ws/trunk/target/surefire/surefire3775797676825371092tmp>
Running org.apache.hadoop.hbase.rest.model.TestTableRegionModel
Tests run: 4, Failures: 0, Errors: 0, Skipped: 0, Time elapsed: 0.463 sec
Forking command line: /bin/sh -c cd <https://builds.apache.org/job/HBase-0.92/ws/trunk>
&& /home/jenkins/tools/java/jdk1.6.0_27-32/jre/bin/java -enableassertions -Xmx1400m
-Djava.security.egd=file:/dev/./urandom -jar <https://builds.apache.org/job/HBase-0.92/ws/trunk/target/surefire/surefirebooter5759779550788760731.jar>
<https://builds.apache.org/job/HBase-0.92/ws/trunk/target/surefire/surefire4446711781314187138tmp>
<https://builds.apache.org/job/HBase-0.92/ws/trunk/target/surefire/surefire5156313869341829932tmp>
Running org.apache.hadoop.hbase.rest.model.TestStorageClusterStatusModel
Tests run: 3, Failures: 0, Errors: 0, Skipped: 0, Time elapsed: 0.451 sec
Forking command line: /bin/sh -c cd <https://builds.apache.org/job/HBase-0.92/ws/trunk>
&& /home/jenkins/tools/java/jdk1.6.0_27-32/jre/bin/java -enableassertions -Xmx1400m
-Djava.security.egd=file:/dev/./urandom -jar <https://builds.apache.org/job/HBase-0.92/ws/trunk/target/surefire/surefirebooter4648366103155896149.jar>
<https://builds.apache.org/job/HBase-0.92/ws/trunk/target/surefire/surefire4323687333588020139tmp>
<https://builds.apache.org/job/HBase-0.92/ws/trunk/target/surefire/surefire7388380979870774814tmp>
Running org.apache.hadoop.hbase.rest.model.TestScannerModel
Tests run: 3, Failures: 0, Errors: 0, Skipped: 0, Time elapsed: 0.407 sec
Forking command line: /bin/sh -c cd <https://builds.apache.org/job/HBase-0.92/ws/trunk>
&& /home/jenkins/tools/java/jdk1.6.0_27-32/jre/bin/java -enableassertions -Xmx1400m
-Djava.security.egd=file:/dev/./urandom -jar <https://builds.apache.org/job/HBase-0.92/ws/trunk/target/surefire/surefirebooter3893455717856297699.jar>
<https://builds.apache.org/job/HBase-0.92/ws/trunk/target/surefire/surefire6214898462155584397tmp>
<https://builds.apache.org/job/HBase-0.92/ws/trunk/target/surefire/surefire7955418021872557343tmp>
Running org.apache.hadoop.hbase.rest.client.TestRemoteAdmin
Tests run: 1, Failures: 0, Errors: 0, Skipped: 0, Time elapsed: 20.882 sec
Forking command line: /bin/sh -c cd <https://builds.apache.org/job/HBase-0.92/ws/trunk>
&& /home/jenkins/tools/java/jdk1.6.0_27-32/jre/bin/java -enableassertions -Xmx1400m
-Djava.security.egd=file:/dev/./urandom -jar <https://builds.apache.org/job/HBase-0.92/ws/trunk/target/surefire/surefirebooter6911441203459678828.jar>
<https://builds.apache.org/job/HBase-0.92/ws/trunk/target/surefire/surefire1870153742051670580tmp>
<https://builds.apache.org/job/HBase-0.92/ws/trunk/target/surefire/surefire5689521313132326774tmp>
Running org.apache.hadoop.hbase.rest.client.TestRemoteTable
Tests run: 3, Failures: 0, Errors: 0, Skipped: 0, Time elapsed: 20.537 sec
Forking command line: /bin/sh -c cd <https://builds.apache.org/job/HBase-0.92/ws/trunk>
&& /home/jenkins/tools/java/jdk1.6.0_27-32/jre/bin/java -enableassertions -Xmx1400m
-Djava.security.egd=file:/dev/./urandom -jar <https://builds.apache.org/job/HBase-0.92/ws/trunk/target/surefire/surefirebooter7636426183522087959.jar>
<https://builds.apache.org/job/HBase-0.92/ws/trunk/target/surefire/surefire9127914427204590328tmp>
<https://builds.apache.org/job/HBase-0.92/ws/trunk/target/surefire/surefire1648638185312803571tmp>
Running org.apache.hadoop.hbase.rest.TestVersionResource
Tests run: 7, Failures: 0, Errors: 0, Skipped: 0, Time elapsed: 18.482 sec
Forking command line: /bin/sh -c cd <https://builds.apache.org/job/HBase-0.92/ws/trunk>
&& /home/jenkins/tools/java/jdk1.6.0_27-32/jre/bin/java -enableassertions -Xmx1400m
-Djava.security.egd=file:/dev/./urandom -jar <https://builds.apache.org/job/HBase-0.92/ws/trunk/target/surefire/surefirebooter6549897931510587571.jar>
<https://builds.apache.org/job/HBase-0.92/ws/trunk/target/surefire/surefire610003909376251181tmp>
<https://builds.apache.org/job/HBase-0.92/ws/trunk/target/surefire/surefire3482190404973818318tmp>
Running org.apache.hadoop.hbase.rest.TestScannerResource
Tests run: 5, Failures: 0, Errors: 0, Skipped: 0, Time elapsed: 32.354 sec
Forking command line: /bin/sh -c cd <https://builds.apache.org/job/HBase-0.92/ws/trunk>
&& /home/jenkins/tools/java/jdk1.6.0_27-32/jre/bin/java -enableassertions -Xmx1400m
-Djava.security.egd=file:/dev/./urandom -jar <https://builds.apache.org/job/HBase-0.92/ws/trunk/target/surefire/surefirebooter8921968215136890697.jar>
<https://builds.apache.org/job/HBase-0.92/ws/trunk/target/surefire/surefire6344352152407695475tmp>
<https://builds.apache.org/job/HBase-0.92/ws/trunk/target/surefire/surefire2222149769170137825tmp>
Running org.apache.hadoop.hbase.rest.TestTableResource
Tests run: 8, Failures: 0, Errors: 0, Skipped: 0, Time elapsed: 27.534 sec
Forking command line: /bin/sh -c cd <https://builds.apache.org/job/HBase-0.92/ws/trunk>
&& /home/jenkins/tools/java/jdk1.6.0_27-32/jre/bin/java -enableassertions -Xmx1400m
-Djava.security.egd=file:/dev/./urandom -jar <https://builds.apache.org/job/HBase-0.92/ws/trunk/target/surefire/surefirebooter4650569875582464988.jar>
<https://builds.apache.org/job/HBase-0.92/ws/trunk/target/surefire/surefire3503101304506957482tmp>
<https://builds.apache.org/job/HBase-0.92/ws/trunk/target/surefire/surefire3598555489464771200tmp>
Running org.apache.hadoop.hbase.rest.TestStatusResource
Tests run: 2, Failures: 0, Errors: 0, Skipped: 0, Time elapsed: 19.23 sec
Forking command line: /bin/sh -c cd <https://builds.apache.org/job/HBase-0.92/ws/trunk>
&& /home/jenkins/tools/java/jdk1.6.0_27-32/jre/bin/java -enableassertions -Xmx1400m
-Djava.security.egd=file:/dev/./urandom -jar <https://builds.apache.org/job/HBase-0.92/ws/trunk/target/surefire/surefirebooter7058000142093969626.jar>
<https://builds.apache.org/job/HBase-0.92/ws/trunk/target/surefire/surefire327606824791914725tmp>
<https://builds.apache.org/job/HBase-0.92/ws/trunk/target/surefire/surefire3124706610472289121tmp>
Running org.apache.hadoop.hbase.rest.TestSchemaResource
Tests run: 2, Failures: 0, Errors: 0, Skipped: 0, Time elapsed: 25.822 sec
Forking command line: /bin/sh -c cd <https://builds.apache.org/job/HBase-0.92/ws/trunk>
&& /home/jenkins/tools/java/jdk1.6.0_27-32/jre/bin/java -enableassertions -Xmx1400m
-Djava.security.egd=file:/dev/./urandom -jar <https://builds.apache.org/job/HBase-0.92/ws/trunk/target/surefire/surefirebooter5464454080102377656.jar>
<https://builds.apache.org/job/HBase-0.92/ws/trunk/target/surefire/surefire7315051182986523248tmp>
<https://builds.apache.org/job/HBase-0.92/ws/trunk/target/surefire/surefire6471431369920983022tmp>
Running org.apache.hadoop.hbase.thrift.TestThriftServer
Tests run: 1, Failures: 0, Errors: 0, Skipped: 0, Time elapsed: 24.79 sec
Forking command line: /bin/sh -c cd <https://builds.apache.org/job/HBase-0.92/ws/trunk>
&& /home/jenkins/tools/java/jdk1.6.0_27-32/jre/bin/java -enableassertions -Xmx1400m
-Djava.security.egd=file:/dev/./urandom -jar <https://builds.apache.org/job/HBase-0.92/ws/trunk/target/surefire/surefirebooter2277638378502507252.jar>
<https://builds.apache.org/job/HBase-0.92/ws/trunk/target/surefire/surefire6233707381461686969tmp>
<https://builds.apache.org/job/HBase-0.92/ws/trunk/target/surefire/surefire6201443010766240188tmp>
Running org.apache.hadoop.hbase.io.TestHeapSize
Tests run: 2, Failures: 0, Errors: 0, Skipped: 0, Time elapsed: 0.158 sec
Forking command line: /bin/sh -c cd <https://builds.apache.org/job/HBase-0.92/ws/trunk>
&& /home/jenkins/tools/java/jdk1.6.0_27-32/jre/bin/java -enableassertions -Xmx1400m
-Djava.security.egd=file:/dev/./urandom -jar <https://builds.apache.org/job/HBase-0.92/ws/trunk/target/surefire/surefirebooter4474870724588927440.jar>
<https://builds.apache.org/job/HBase-0.92/ws/trunk/target/surefire/surefire907049549529753472tmp>
<https://builds.apache.org/job/HBase-0.92/ws/trunk/target/surefire/surefire6562717473295950769tmp>
Running org.apache.hadoop.hbase.io.hfile.TestHFileSeek
Tests run: 1, Failures: 0, Errors: 0, Skipped: 0, Time elapsed: 5.676 sec
Forking command line: /bin/sh -c cd <https://builds.apache.org/job/HBase-0.92/ws/trunk>
&& /home/jenkins/tools/java/jdk1.6.0_27-32/jre/bin/java -enableassertions -Xmx1400m
-Djava.security.egd=file:/dev/./urandom -jar <https://builds.apache.org/job/HBase-0.92/ws/trunk/target/surefire/surefirebooter5424281812910141964.jar>
<https://builds.apache.org/job/HBase-0.92/ws/trunk/target/surefire/surefire4349179396937025501tmp>
<https://builds.apache.org/job/HBase-0.92/ws/trunk/target/surefire/surefire4395396761966135285tmp>
Running org.apache.hadoop.hbase.io.hfile.slab.TestSlab
Tests run: 1, Failures: 0, Errors: 0, Skipped: 0, Time elapsed: 0.147 sec
Forking command line: /bin/sh -c cd <https://builds.apache.org/job/HBase-0.92/ws/trunk>
&& /home/jenkins/tools/java/jdk1.6.0_27-32/jre/bin/java -enableassertions -Xmx1400m
-Djava.security.egd=file:/dev/./urandom -jar <https://builds.apache.org/job/HBase-0.92/ws/trunk/target/surefire/surefirebooter7522511858301745190.jar>
<https://builds.apache.org/job/HBase-0.92/ws/trunk/target/surefire/surefire3981150557551089476tmp>
<https://builds.apache.org/job/HBase-0.92/ws/trunk/target/surefire/surefire8566809696643722054tmp>
Running org.apache.hadoop.hbase.io.hfile.slab.TestSlabCache
Tests run: 7, Failures: 0, Errors: 0, Skipped: 0, Time elapsed: 20.053 sec
Forking command line: /bin/sh -c cd <https://builds.apache.org/job/HBase-0.92/ws/trunk>
&& /home/jenkins/tools/java/jdk1.6.0_27-32/jre/bin/java -enableassertions -Xmx1400m
-Djava.security.egd=file:/dev/./urandom -jar <https://builds.apache.org/job/HBase-0.92/ws/trunk/target/surefire/surefirebooter5415697632963970817.jar>
<https://builds.apache.org/job/HBase-0.92/ws/trunk/target/surefire/surefire8406350648212937374tmp>
<https://builds.apache.org/job/HBase-0.92/ws/trunk/target/surefire/surefire530835891773747330tmp>
Running org.apache.hadoop.hbase.io.hfile.slab.TestSingleSizeCache
Tests run: 5, Failures: 0, Errors: 0, Skipped: 0, Time elapsed: 24.985 sec
Forking command line: /bin/sh -c cd <https://builds.apache.org/job/HBase-0.92/ws/trunk>
&& /home/jenkins/tools/java/jdk1.6.0_27-32/jre/bin/java -enableassertions -Xmx1400m
-Djava.security.egd=file:/dev/./urandom -jar <https://builds.apache.org/job/HBase-0.92/ws/trunk/target/surefire/surefirebooter8970578927758238972.jar>
<https://builds.apache.org/job/HBase-0.92/ws/trunk/target/surefire/surefire7704959454594418808tmp>
<https://builds.apache.org/job/HBase-0.92/ws/trunk/target/surefire/surefire2400426126392751727tmp>
Running org.apache.hadoop.hbase.io.hfile.TestCachedBlockQueue
Tests run: 2, Failures: 0, Errors: 0, Skipped: 0, Time elapsed: 0.105 sec
Forking command line: /bin/sh -c cd <https://builds.apache.org/job/HBase-0.92/ws/trunk>
&& /home/jenkins/tools/java/jdk1.6.0_27-32/jre/bin/java -enableassertions -Xmx1400m
-Djava.security.egd=file:/dev/./urandom -jar <https://builds.apache.org/job/HBase-0.92/ws/trunk/target/surefire/surefirebooter8802638282451894285.jar>
<https://builds.apache.org/job/HBase-0.92/ws/trunk/target/surefire/surefire3256551276018729503tmp>
<https://builds.apache.org/job/HBase-0.92/ws/trunk/target/surefire/surefire1373027777437097656tmp>
Running org.apache.hadoop.hbase.io.hfile.TestHFileBlockIndex
Tests run: 10, Failures: 0, Errors: 0, Skipped: 0, Time elapsed: 10.145 sec
Forking command line: /bin/sh -c cd <https://builds.apache.org/job/HBase-0.92/ws/trunk>
&& /home/jenkins/tools/java/jdk1.6.0_27-32/jre/bin/java -enableassertions -Xmx1400m
-Djava.security.egd=file:/dev/./urandom -jar <https://builds.apache.org/job/HBase-0.92/ws/trunk/target/surefire/surefirebooter6539172124473045261.jar>
<https://builds.apache.org/job/HBase-0.92/ws/trunk/target/surefire/surefire2879875880210790789tmp>
<https://builds.apache.org/job/HBase-0.92/ws/trunk/target/surefire/surefire7218735621280291631tmp>
Running org.apache.hadoop.hbase.io.hfile.TestLruBlockCache
Tests run: 7, Failures: 0, Errors: 0, Skipped: 0, Time elapsed: 0.343 sec
Forking command line: /bin/sh -c cd <https://builds.apache.org/job/HBase-0.92/ws/trunk>
&& /home/jenkins/tools/java/jdk1.6.0_27-32/jre/bin/java -enableassertions -Xmx1400m
-Djava.security.egd=file:/dev/./urandom -jar <https://builds.apache.org/job/HBase-0.92/ws/trunk/target/surefire/surefirebooter6518678376969939687.jar>
<https://builds.apache.org/job/HBase-0.92/ws/trunk/target/surefire/surefire8628169793248293958tmp>
<https://builds.apache.org/job/HBase-0.92/ws/trunk/target/surefire/surefire8410744083406408085tmp>
Running org.apache.hadoop.hbase.io.hfile.TestHFilePerformance
Tests run: 1, Failures: 0, Errors: 0, Skipped: 0, Time elapsed: 5.988 sec
Forking command line: /bin/sh -c cd <https://builds.apache.org/job/HBase-0.92/ws/trunk>
&& /home/jenkins/tools/java/jdk1.6.0_27-32/jre/bin/java -enableassertions -Xmx1400m
-Djava.security.egd=file:/dev/./urandom -jar <https://builds.apache.org/job/HBase-0.92/ws/trunk/target/surefire/surefirebooter1535828244584059758.jar>
<https://builds.apache.org/job/HBase-0.92/ws/trunk/target/surefire/surefire6395070027276744592tmp>
<https://builds.apache.org/job/HBase-0.92/ws/trunk/target/surefire/surefire4949215863424782682tmp>
Running org.apache.hadoop.hbase.io.hfile.TestFixedFileTrailer
Tests run: 2, Failures: 0, Errors: 0, Skipped: 0, Time elapsed: 0.688 sec
Forking command line: /bin/sh -c cd <https://builds.apache.org/job/HBase-0.92/ws/trunk>
&& /home/jenkins/tools/java/jdk1.6.0_27-32/jre/bin/java -enableassertions -Xmx1400m
-Djava.security.egd=file:/dev/./urandom -jar <https://builds.apache.org/job/HBase-0.92/ws/trunk/target/surefire/surefirebooter3580701631777643274.jar>
<https://builds.apache.org/job/HBase-0.92/ws/trunk/target/surefire/surefire5909967572586106519tmp>
<https://builds.apache.org/job/HBase-0.92/ws/trunk/target/surefire/surefire5218944152466887005tmp>
Running org.apache.hadoop.hbase.io.hfile.TestHFileWriterV2
Tests run: 1, Failures: 0, Errors: 0, Skipped: 0, Time elapsed: 1.069 sec
Forking command line: /bin/sh -c cd <https://builds.apache.org/job/HBase-0.92/ws/trunk>
&& /home/jenkins/tools/java/jdk1.6.0_27-32/jre/bin/java -enableassertions -Xmx1400m
-Djava.security.egd=file:/dev/./urandom -jar <https://builds.apache.org/job/HBase-0.92/ws/trunk/target/surefire/surefirebooter2366238795727889091.jar>
<https://builds.apache.org/job/HBase-0.92/ws/trunk/target/surefire/surefire4932251686936689620tmp>
<https://builds.apache.org/job/HBase-0.92/ws/trunk/target/surefire/surefire1640706609533048577tmp>
Running org.apache.hadoop.hbase.io.hfile.TestBlockCacheColumnFamilySummary
Tests run: 4, Failures: 0, Errors: 0, Skipped: 0, Time elapsed: 0.058 sec
Forking command line: /bin/sh -c cd <https://builds.apache.org/job/HBase-0.92/ws/trunk>
&& /home/jenkins/tools/java/jdk1.6.0_27-32/jre/bin/java -enableassertions -Xmx1400m
-Djava.security.egd=file:/dev/./urandom -jar <https://builds.apache.org/job/HBase-0.92/ws/trunk/target/surefire/surefirebooter4069003264082405201.jar>
<https://builds.apache.org/job/HBase-0.92/ws/trunk/target/surefire/surefire9114341200068243763tmp>
<https://builds.apache.org/job/HBase-0.92/ws/trunk/target/surefire/surefire6786161917619486176tmp>
Running org.apache.hadoop.hbase.io.hfile.TestHFileReaderV1
Tests run: 1, Failures: 0, Errors: 0, Skipped: 0, Time elapsed: 0.572 sec
Forking command line: /bin/sh -c cd <https://builds.apache.org/job/HBase-0.92/ws/trunk>
&& /home/jenkins/tools/java/jdk1.6.0_27-32/jre/bin/java -enableassertions -Xmx1400m
-Djava.security.egd=file:/dev/./urandom -jar <https://builds.apache.org/job/HBase-0.92/ws/trunk/target/surefire/surefirebooter7683352435652507505.jar>
<https://builds.apache.org/job/HBase-0.92/ws/trunk/target/surefire/surefire5687900247987806538tmp>
<https://builds.apache.org/job/HBase-0.92/ws/trunk/target/surefire/surefire975078010133202490tmp>
Running org.apache.hadoop.hbase.io.hfile.TestHFile
Tests run: 6, Failures: 0, Errors: 0, Skipped: 0, Time elapsed: 0.837 sec
Forking command line: /bin/sh -c cd <https://builds.apache.org/job/HBase-0.92/ws/trunk>
&& /home/jenkins/tools/java/jdk1.6.0_27-32/jre/bin/java -enableassertions -Xmx1400m
-Djava.security.egd=file:/dev/./urandom -jar <https://builds.apache.org/job/HBase-0.92/ws/trunk/target/surefire/surefirebooter4970579007581669410.jar>
<https://builds.apache.org/job/HBase-0.92/ws/trunk/target/surefire/surefire3929587663480865193tmp>
<https://builds.apache.org/job/HBase-0.92/ws/trunk/target/surefire/surefire7774385994568633913tmp>
Running org.apache.hadoop.hbase.io.hfile.TestReseekTo
Tests run: 1, Failures: 0, Errors: 0, Skipped: 0, Time elapsed: 0.767 sec
Forking command line: /bin/sh -c cd <https://builds.apache.org/job/HBase-0.92/ws/trunk>
&& /home/jenkins/tools/java/jdk1.6.0_27-32/jre/bin/java -enableassertions -Xmx1400m
-Djava.security.egd=file:/dev/./urandom -jar <https://builds.apache.org/job/HBase-0.92/ws/trunk/target/surefire/surefirebooter7305708498214618303.jar>
<https://builds.apache.org/job/HBase-0.92/ws/trunk/target/surefire/surefire2254381208727711314tmp>
<https://builds.apache.org/job/HBase-0.92/ws/trunk/target/surefire/surefire7504620406630091606tmp>
Running org.apache.hadoop.hbase.io.hfile.TestHFileBlock
Tests run: 7, Failures: 0, Errors: 0, Skipped: 0, Time elapsed: 25.367 sec
Forking command line: /bin/sh -c cd <https://builds.apache.org/job/HBase-0.92/ws/trunk>
&& /home/jenkins/tools/java/jdk1.6.0_27-32/jre/bin/java -enableassertions -Xmx1400m
-Djava.security.egd=file:/dev/./urandom -jar <https://builds.apache.org/job/HBase-0.92/ws/trunk/target/surefire/surefirebooter1697282746386655443.jar>
<https://builds.apache.org/job/HBase-0.92/ws/trunk/target/surefire/surefire3712421827024676658tmp>
<https://builds.apache.org/job/HBase-0.92/ws/trunk/target/surefire/surefire4673037164136449874tmp>
Running org.apache.hadoop.hbase.io.hfile.TestSeekTo
Tests run: 3, Failures: 0, Errors: 0, Skipped: 0, Time elapsed: 0.654 sec
Forking command line: /bin/sh -c cd <https://builds.apache.org/job/HBase-0.92/ws/trunk>
&& /home/jenkins/tools/java/jdk1.6.0_27-32/jre/bin/java -enableassertions -Xmx1400m
-Djava.security.egd=file:/dev/./urandom -jar <https://builds.apache.org/job/HBase-0.92/ws/trunk/target/surefire/surefirebooter5406203240758819470.jar>
<https://builds.apache.org/job/HBase-0.92/ws/trunk/target/surefire/surefire6210398896881893549tmp>
<https://builds.apache.org/job/HBase-0.92/ws/trunk/target/surefire/surefire4819050883192712087tmp>
Running org.apache.hadoop.hbase.io.hfile.TestCacheOnWrite
Tests run: 6, Failures: 0, Errors: 0, Skipped: 0, Time elapsed: 7.384 sec
Forking command line: /bin/sh -c cd <https://builds.apache.org/job/HBase-0.92/ws/trunk>
&& /home/jenkins/tools/java/jdk1.6.0_27-32/jre/bin/java -enableassertions -Xmx1400m
-Djava.security.egd=file:/dev/./urandom -jar <https://builds.apache.org/job/HBase-0.92/ws/trunk/target/surefire/surefirebooter3410434626050708915.jar>
<https://builds.apache.org/job/HBase-0.92/ws/trunk/target/surefire/surefire1117786963201425877tmp>
<https://builds.apache.org/job/HBase-0.92/ws/trunk/target/surefire/surefire4148091779183071605tmp>
Running org.apache.hadoop.hbase.io.TestHbaseObjectWritable
Tests run: 5, Failures: 0, Errors: 0, Skipped: 0, Time elapsed: 0.508 sec
Forking command line: /bin/sh -c cd <https://builds.apache.org/job/HBase-0.92/ws/trunk>
&& /home/jenkins/tools/java/jdk1.6.0_27-32/jre/bin/java -enableassertions -Xmx1400m
-Djava.security.egd=file:/dev/./urandom -jar <https://builds.apache.org/job/HBase-0.92/ws/trunk/target/surefire/surefirebooter4073971015074890741.jar>
<https://builds.apache.org/job/HBase-0.92/ws/trunk/target/surefire/surefire5234269915318921700tmp>
<https://builds.apache.org/job/HBase-0.92/ws/trunk/target/surefire/surefire4946440336437904750tmp>
Running org.apache.hadoop.hbase.io.TestImmutableBytesWritable
Tests run: 3, Failures: 0, Errors: 0, Skipped: 0, Time elapsed: 0.111 sec
Forking command line: /bin/sh -c cd <https://builds.apache.org/job/HBase-0.92/ws/trunk>
&& /home/jenkins/tools/java/jdk1.6.0_27-32/jre/bin/java -enableassertions -Xmx1400m
-Djava.security.egd=file:/dev/./urandom -jar <https://builds.apache.org/job/HBase-0.92/ws/trunk/target/surefire/surefirebooter4993755611423297197.jar>
<https://builds.apache.org/job/HBase-0.92/ws/trunk/target/surefire/surefire7043264706293595445tmp>
<https://builds.apache.org/job/HBase-0.92/ws/trunk/target/surefire/surefire3940493468755148251tmp>
Running org.apache.hadoop.hbase.io.TestHalfStoreFileReader
Tests run: 1, Failures: 0, Errors: 0, Skipped: 0, Time elapsed: 0.798 sec
Forking command line: /bin/sh -c cd <https://builds.apache.org/job/HBase-0.92/ws/trunk>
&& /home/jenkins/tools/java/jdk1.6.0_27-32/jre/bin/java -enableassertions -Xmx1400m
-Djava.security.egd=file:/dev/./urandom -jar <https://builds.apache.org/job/HBase-0.92/ws/trunk/target/surefire/surefirebooter2848996729560867155.jar>
<https://builds.apache.org/job/HBase-0.92/ws/trunk/target/surefire/surefire5327069341920748136tmp>
<https://builds.apache.org/job/HBase-0.92/ws/trunk/target/surefire/surefire3000935160816102179tmp>
Running org.apache.hadoop.hbase.migration.TestMigrationFrom090To092
Tests run: 1, Failures: 0, Errors: 0, Skipped: 0, Time elapsed: 0.274 sec
Forking command line: /bin/sh -c cd <https://builds.apache.org/job/HBase-0.92/ws/trunk>
&& /home/jenkins/tools/java/jdk1.6.0_27-32/jre/bin/java -enableassertions -Xmx1400m
-Djava.security.egd=file:/dev/./urandom -jar <https://builds.apache.org/job/HBase-0.92/ws/trunk/target/surefire/surefirebooter7499983917772553652.jar>
<https://builds.apache.org/job/HBase-0.92/ws/trunk/target/surefire/surefire1007997046430260627tmp>
<https://builds.apache.org/job/HBase-0.92/ws/trunk/target/surefire/surefire335378639851673270tmp>
Running org.apache.hadoop.hbase.TestFSTableDescriptorForceCreation
Tests run: 3, Failures: 0, Errors: 0, Skipped: 0, Time elapsed: 0.687 sec
Forking command line: /bin/sh -c cd <https://builds.apache.org/job/HBase-0.92/ws/trunk>
&& /home/jenkins/tools/java/jdk1.6.0_27-32/jre/bin/java -enableassertions -Xmx1400m
-Djava.security.egd=file:/dev/./urandom -jar <https://builds.apache.org/job/HBase-0.92/ws/trunk/target/surefire/surefirebooter4055589977171454992.jar>
<https://builds.apache.org/job/HBase-0.92/ws/trunk/target/surefire/surefire8669065974977709067tmp>
<https://builds.apache.org/job/HBase-0.92/ws/trunk/target/surefire/surefire2848906279276213944tmp>
Running org.apache.hadoop.hbase.avro.TestAvroUtil
Tests run: 1, Failures: 0, Errors: 0, Skipped: 0, Time elapsed: 0.641 sec
Forking command line: /bin/sh -c cd <https://builds.apache.org/job/HBase-0.92/ws/trunk>
&& /home/jenkins/tools/java/jdk1.6.0_27-32/jre/bin/java -enableassertions -Xmx1400m
-Djava.security.egd=file:/dev/./urandom -jar <https://builds.apache.org/job/HBase-0.92/ws/trunk/target/surefire/surefirebooter4951663237762750146.jar>
<https://builds.apache.org/job/HBase-0.92/ws/trunk/target/surefire/surefire1973166005642908556tmp>
<https://builds.apache.org/job/HBase-0.92/ws/trunk/target/surefire/surefire6838638939685363932tmp>
Running org.apache.hadoop.hbase.avro.TestAvroServer
Tests run: 3, Failures: 0, Errors: 0, Skipped: 0, Time elapsed: 32.214 sec
Forking command line: /bin/sh -c cd <https://builds.apache.org/job/HBase-0.92/ws/trunk>
&& /home/jenkins/tools/java/jdk1.6.0_27-32/jre/bin/java -enableassertions -Xmx1400m
-Djava.security.egd=file:/dev/./urandom -jar <https://builds.apache.org/job/HBase-0.92/ws/trunk/target/surefire/surefirebooter9023456262691055016.jar>
<https://builds.apache.org/job/HBase-0.92/ws/trunk/target/surefire/surefire6967150720859052232tmp>
<https://builds.apache.org/job/HBase-0.92/ws/trunk/target/surefire/surefire7619146157621284706tmp>
Running org.apache.hadoop.hbase.TestKeyValue
Tests run: 12, Failures: 0, Errors: 0, Skipped: 0, Time elapsed: 0.134 sec
Forking command line: /bin/sh -c cd <https://builds.apache.org/job/HBase-0.92/ws/trunk>
&& /home/jenkins/tools/java/jdk1.6.0_27-32/jre/bin/java -enableassertions -Xmx1400m
-Djava.security.egd=file:/dev/./urandom -jar <https://builds.apache.org/job/HBase-0.92/ws/trunk/target/surefire/surefirebooter253739671759321822.jar>
<https://builds.apache.org/job/HBase-0.92/ws/trunk/target/surefire/surefire6219762946020352093tmp>
<https://builds.apache.org/job/HBase-0.92/ws/trunk/target/surefire/surefire2822028289725314592tmp>
Running org.apache.hadoop.hbase.replication.TestMultiSlaveReplication
Tests run: 1, Failures: 0, Errors: 0, Skipped: 0, Time elapsed: 60.472 sec
Forking command line: /bin/sh -c cd <https://builds.apache.org/job/HBase-0.92/ws/trunk>
&& /home/jenkins/tools/java/jdk1.6.0_27-32/jre/bin/java -enableassertions -Xmx1400m
-Djava.security.egd=file:/dev/./urandom -jar <https://builds.apache.org/job/HBase-0.92/ws/trunk/target/surefire/surefirebooter2837040264236202985.jar>
<https://builds.apache.org/job/HBase-0.92/ws/trunk/target/surefire/surefire6060897516480953577tmp>
<https://builds.apache.org/job/HBase-0.92/ws/trunk/target/surefire/surefire2114101897165240647tmp>
Running org.apache.hadoop.hbase.replication.regionserver.TestReplicationSourceManager
Tests run: 1, Failures: 0, Errors: 0, Skipped: 0, Time elapsed: 2.922 sec
Forking command line: /bin/sh -c cd <https://builds.apache.org/job/HBase-0.92/ws/trunk>
&& /home/jenkins/tools/java/jdk1.6.0_27-32/jre/bin/java -enableassertions -Xmx1400m
-Djava.security.egd=file:/dev/./urandom -jar <https://builds.apache.org/job/HBase-0.92/ws/trunk/target/surefire/surefirebooter3849426679379421469.jar>
<https://builds.apache.org/job/HBase-0.92/ws/trunk/target/surefire/surefire4595458874159407488tmp>
<https://builds.apache.org/job/HBase-0.92/ws/trunk/target/surefire/surefire480708560806045237tmp>
Running org.apache.hadoop.hbase.replication.regionserver.TestReplicationSink
Tests run: 5, Failures: 0, Errors: 0, Skipped: 0, Time elapsed: 29.756 sec
Forking command line: /bin/sh -c cd <https://builds.apache.org/job/HBase-0.92/ws/trunk>
&& /home/jenkins/tools/java/jdk1.6.0_27-32/jre/bin/java -enableassertions -Xmx1400m
-Djava.security.egd=file:/dev/./urandom -jar <https://builds.apache.org/job/HBase-0.92/ws/trunk/target/surefire/surefirebooter329415220827836884.jar>
<https://builds.apache.org/job/HBase-0.92/ws/trunk/target/surefire/surefire1851084877318020713tmp>
<https://builds.apache.org/job/HBase-0.92/ws/trunk/target/surefire/surefire7734426111459622488tmp>
Running org.apache.hadoop.hbase.replication.TestMasterReplication
Tests run: 2, Failures: 0, Errors: 0, Skipped: 0, Time elapsed: 99.892 sec
Forking command line: /bin/sh -c cd <https://builds.apache.org/job/HBase-0.92/ws/trunk>
&& /home/jenkins/tools/java/jdk1.6.0_27-32/jre/bin/java -enableassertions -Xmx1400m
-Djava.security.egd=file:/dev/./urandom -jar <https://builds.apache.org/job/HBase-0.92/ws/trunk/target/surefire/surefirebooter7304373361403286227.jar>
<https://builds.apache.org/job/HBase-0.92/ws/trunk/target/surefire/surefire5600823381718483154tmp>
<https://builds.apache.org/job/HBase-0.92/ws/trunk/target/surefire/surefire5020446129062552999tmp>
Running org.apache.hadoop.hbase.replication.TestReplicationSource
Tests run: 1, Failures: 0, Errors: 0, Skipped: 0, Time elapsed: 2.723 sec
Forking command line: /bin/sh -c cd <https://builds.apache.org/job/HBase-0.92/ws/trunk>
&& /home/jenkins/tools/java/jdk1.6.0_27-32/jre/bin/java -enableassertions -Xmx1400m
-Djava.security.egd=file:/dev/./urandom -jar <https://builds.apache.org/job/HBase-0.92/ws/trunk/target/surefire/surefirebooter8261743855660195304.jar>
<https://builds.apache.org/job/HBase-0.92/ws/trunk/target/surefire/surefire1428868048327383179tmp>
<https://builds.apache.org/job/HBase-0.92/ws/trunk/target/surefire/surefire5543400213516149760tmp>
Running org.apache.hadoop.hbase.replication.TestReplicationPeer
Tests run: 1, Failures: 0, Errors: 0, Skipped: 0, Time elapsed: 25.687 sec
Forking command line: /bin/sh -c cd <https://builds.apache.org/job/HBase-0.92/ws/trunk>
&& /home/jenkins/tools/java/jdk1.6.0_27-32/jre/bin/java -enableassertions -Xmx1400m
-Djava.security.egd=file:/dev/./urandom -jar <https://builds.apache.org/job/HBase-0.92/ws/trunk/target/surefire/surefirebooter6119094836034383706.jar>
<https://builds.apache.org/job/HBase-0.92/ws/trunk/target/surefire/surefire7378857416633568444tmp>
<https://builds.apache.org/job/HBase-0.92/ws/trunk/target/surefire/surefire8183351030095523525tmp>
Running org.apache.hadoop.hbase.replication.TestReplication
Tests run: 8, Failures: 1, Errors: 0, Skipped: 0, Time elapsed: 156.844 sec <<< FAILURE!
Forking command line: /bin/sh -c cd <https://builds.apache.org/job/HBase-0.92/ws/trunk>
&& /home/jenkins/tools/java/jdk1.6.0_27-32/jre/bin/java -enableassertions -Xmx1400m
-Djava.security.egd=file:/dev/./urandom -jar <https://builds.apache.org/job/HBase-0.92/ws/trunk/target/surefire/surefirebooter6997179302838629789.jar>
<https://builds.apache.org/job/HBase-0.92/ws/trunk/target/surefire/surefire1457210224628435414tmp>
<https://builds.apache.org/job/HBase-0.92/ws/trunk/target/surefire/surefire2178787054640910312tmp>
Running org.apache.hadoop.hbase.ipc.TestDelayedRpc
Tests run: 4, Failures: 0, Errors: 0, Skipped: 0, Time elapsed: 2.599 sec
Forking command line: /bin/sh -c cd <https://builds.apache.org/job/HBase-0.92/ws/trunk>
&& /home/jenkins/tools/java/jdk1.6.0_27-32/jre/bin/java -enableassertions -Xmx1400m
-Djava.security.egd=file:/dev/./urandom -jar <https://builds.apache.org/job/HBase-0.92/ws/trunk/target/surefire/surefirebooter7697404486443957217.jar>
<https://builds.apache.org/job/HBase-0.92/ws/trunk/target/surefire/surefire4635112697610252712tmp>
<https://builds.apache.org/job/HBase-0.92/ws/trunk/target/surefire/surefire9036993354137377919tmp>
Running org.apache.hadoop.hbase.TestCompare
Tests run: 1, Failures: 0, Errors: 0, Skipped: 0, Time elapsed: 0.233 sec
Forking command line: /bin/sh -c cd <https://builds.apache.org/job/HBase-0.92/ws/trunk>
&& /home/jenkins/tools/java/jdk1.6.0_27-32/jre/bin/java -enableassertions -Xmx1400m
-Djava.security.egd=file:/dev/./urandom -jar <https://builds.apache.org/job/HBase-0.92/ws/trunk/target/surefire/surefirebooter2481570723768054520.jar>
<https://builds.apache.org/job/HBase-0.92/ws/trunk/target/surefire/surefire1839053455353140878tmp>
<https://builds.apache.org/job/HBase-0.92/ws/trunk/target/surefire/surefire3825366216499372745tmp>
Running org.apache.hadoop.hbase.TestZooKeeper
Tests run: 7, Failures: 0, Errors: 0, Skipped: 0, Time elapsed: 86.443 sec
Forking command line: /bin/sh -c cd <https://builds.apache.org/job/HBase-0.92/ws/trunk>
&& /home/jenkins/tools/java/jdk1.6.0_27-32/jre/bin/java -enableassertions -Xmx1400m
-Djava.security.egd=file:/dev/./urandom -jar <https://builds.apache.org/job/HBase-0.92/ws/trunk/target/surefire/surefirebooter5842692604495148274.jar>
<https://builds.apache.org/job/HBase-0.92/ws/trunk/target/surefire/surefire5933684455845775847tmp>
<https://builds.apache.org/job/HBase-0.92/ws/trunk/target/surefire/surefire6973881014652497147tmp>
Running org.apache.hadoop.hbase.TestHBaseTestingUtility
Tests run: 7, Failures: 0, Errors: 0, Skipped: 0, Time elapsed: 98.01 sec

Results :

Failed tests:   queueFailover(org.apache.hadoop.hbase.replication.TestReplication): Waited
too much time for queueFailover replication

Tests run: 1087, Failures: 1, Errors: 0, Skipped: 8

[INFO] ------------------------------------------------------------------------
[INFO] BUILD FAILURE
[INFO] ------------------------------------------------------------------------
[INFO] Total time: 1:59:13.798s
[INFO] Finished at: Wed Mar 07 21:17:34 UTC 2012
[INFO] Final Memory: 38M/877M
[INFO] ------------------------------------------------------------------------
[ERROR] Failed to execute goal org.apache.maven.plugins:maven-surefire-plugin:2.10:test (default-test)
on project hbase: There are test failures.
[ERROR] 
[ERROR] Please refer to <https://builds.apache.org/job/HBase-0.92/ws/trunk/target/surefire-reports>
for the individual test results.
[ERROR] -> [Help 1]
org.apache.maven.lifecycle.LifecycleExecutionException: Failed to execute goal org.apache.maven.plugins:maven-surefire-plugin:2.10:test
(default-test) on project hbase: There are test failures.

Please refer to <https://builds.apache.org/job/HBase-0.92/ws/trunk/target/surefire-reports>
for the individual test results.
	at org.apache.maven.lifecycle.internal.MojoExecutor.execute(MojoExecutor.java:213)
	at org.apache.maven.lifecycle.internal.MojoExecutor.execute(MojoExecutor.java:153)
	at org.apache.maven.lifecycle.internal.MojoExecutor.execute(MojoExecutor.java:145)
	at org.apache.maven.lifecycle.internal.LifecycleModuleBuilder.buildProject(LifecycleModuleBuilder.java:84)
	at org.apache.maven.lifecycle.internal.LifecycleModuleBuilder.buildProject(LifecycleModuleBuilder.java:59)
	at org.apache.maven.lifecycle.internal.LifecycleStarter.singleThreadedBuild(LifecycleStarter.java:183)
	at org.apache.maven.lifecycle.internal.LifecycleStarter.execute(LifecycleStarter.java:161)
	at org.apache.maven.DefaultMaven.doExecute(DefaultMaven.java:319)
	at org.apache.maven.DefaultMaven.execute(DefaultMaven.java:156)
	at org.apache.maven.cli.MavenCli.execute(MavenCli.java:537)
	at org.apache.maven.cli.MavenCli.doMain(MavenCli.java:196)
	at org.apache.maven.cli.MavenCli.main(MavenCli.java:141)
	at sun.reflect.NativeMethodAccessorImpl.invoke0(Native Method)
	at sun.reflect.NativeMethodAccessorImpl.invoke(NativeMethodAccessorImpl.java:39)
	at sun.reflect.DelegatingMethodAccessorImpl.invoke(DelegatingMethodAccessorImpl.java:25)
	at java.lang.reflect.Method.invoke(Method.java:597)
	at org.codehaus.plexus.classworlds.launcher.Launcher.launchEnhanced(Launcher.java:290)
	at org.codehaus.plexus.classworlds.launcher.Launcher.launch(Launcher.java:230)
	at org.codehaus.plexus.classworlds.launcher.Launcher.mainWithExitCode(Launcher.java:409)
	at org.codehaus.plexus.classworlds.launcher.Launcher.main(Launcher.java:352)
Caused by: org.apache.maven.plugin.MojoFailureException: There are test failures.

Please refer to <https://builds.apache.org/job/HBase-0.92/ws/trunk/target/surefire-reports>
for the individual test results.
	at org.apache.maven.plugin.surefire.SurefireHelper.reportExecution(SurefireHelper.java:87)
	at org.apache.maven.plugin.surefire.SurefirePlugin.writeSummary(SurefirePlugin.java:641)
	at org.apache.maven.plugin.surefire.SurefirePlugin.handleSummary(SurefirePlugin.java:615)
	at org.apache.maven.plugin.surefire.AbstractSurefireMojo.executeAfterPreconditionsChecked(AbstractSurefireMojo.java:137)
	at org.apache.maven.plugin.surefire.AbstractSurefireMojo.execute(AbstractSurefireMojo.java:98)
	at org.apache.maven.plugin.DefaultBuildPluginManager.executeMojo(DefaultBuildPluginManager.java:101)
	at org.apache.maven.lifecycle.internal.MojoExecutor.execute(MojoExecutor.java:209)
	... 19 more
[ERROR] 
[ERROR] 
[ERROR] For more information about the errors and possible solutions, please read the following
articles:
[ERROR] [Help 1] http://cwiki.apache.org/confluence/display/MAVEN/MojoFailureException
Build step 'Invoke top-level Maven targets' marked build as failure
Archiving artifacts
Updating HBASE-5537
Recording test results


Mime
View raw message