hbase-dev mailing list archives

Site index · List index
Message view « Date » · « Thread »
Top « Date » · « Thread »
From Apache Jenkins Server <jenk...@builds.apache.org>
Subject Build failed in Jenkins: hbase-0.90 #447
Date Sat, 24 Mar 2012 00:39:46 GMT
See <https://builds.apache.org/job/hbase-0.90/447/changes>

Changes:

[jmhsieh] HBASE-5128 [uber hbck] Online automated repair of table integrity and region consistency
problems

[jmhsieh] HBASE-5563 Add comparison of regionId to HRegionInfo#compareTo (chunhui and jmhsieh)

------------------------------------------
[...truncated 946 lines...]
A         src/examples/mapreduce/index-builder-setup.rb
A         src/examples/README.txt
A         bin
AU        bin/hbase-daemons.sh
A         bin/rename_table.rb
AU        bin/hbase
A         bin/copy_table.rb
A         bin/check_meta.rb
AU        bin/start-hbase.sh
A         bin/hirb.rb
A         bin/set_meta_block_caching.rb
A         bin/loadtable.rb
AU        bin/hbase-daemon.sh
A         bin/region_mover.rb
A         bin/hbase-config.sh
A         bin/local-regionservers.sh
AU        bin/zookeepers.sh
A         bin/local-master-backup.sh
A         bin/add_table.rb
AU        bin/rolling-restart.sh
AU        bin/regionservers.sh
A         bin/graceful_stop.sh
AU        bin/master-backup.sh
A         bin/set_meta_memstore_size.rb
A         bin/replication
A         bin/replication/copy_tables_desc.rb
AU        bin/stop-hbase.sh
A         pom.xml
A         README.txt
 U        .
At revision 1304686
[locks-and-latches] Checking to see if we really have the locks
[locks-and-latches] Have all the locks, build can start
[hbase-0.90] $ /bin/bash -xe /tmp/hudson8304998880476968394.sh
+ hostname
janus
+ ulimit -a
core file size          (blocks, -c) 0
data seg size           (kbytes, -d) unlimited
scheduling priority             (-e) 0
file size               (blocks, -f) unlimited
pending signals                 (-i) 128588
max locked memory       (kbytes, -l) 64
max memory size         (kbytes, -m) unlimited
open files                      (-n) 40000
pipe size            (512 bytes, -p) 8
POSIX message queues     (bytes, -q) 819200
real-time priority              (-r) 0
stack size              (kbytes, -s) 10240
cpu time               (seconds, -t) unlimited
max user processes              (-u) 128588
virtual memory          (kbytes, -v) unlimited
file locks                      (-x) unlimited
+ jps
28677 Maven3Main
15527 Main
8091 jar
15503 Jps
[trunk] $ /home/hudson/tools/maven/latest3/bin/mvn clean -Dmaven.test.redirectTestOutputToFile=true
site assembly:assembly
[INFO] Scanning for projects...
[INFO]                                                                         
[INFO] ------------------------------------------------------------------------
[INFO] Building HBase 0.90.7-SNAPSHOT
[INFO] ------------------------------------------------------------------------
[INFO] 
[INFO] --- maven-clean-plugin:2.4.1:clean (default-clean) @ hbase ---
[INFO] 
[INFO] --- xml-maven-plugin:1.0-beta-3:transform (default) @ hbase ---
[INFO] Transforming file: <https://builds.apache.org/job/hbase-0.90/ws/trunk/src/main/resources/hbase-default.xml>
[INFO] Transformed 1 file(s).
[INFO] 
[INFO] --- docbkx-maven-plugin:2.0.11:generate-html (default) @ hbase ---
[INFO] Processing input file: build.xml
[INFO] <https://builds.apache.org/job/hbase-0.90/447/artifact/trunk/target/site/build.html>
has been generated.
[INFO] Processing input file: developer.xml
[INFO] <https://builds.apache.org/job/hbase-0.90/447/artifact/trunk/target/site/developer.html>
has been generated.
[INFO] Processing input file: preface.xml
[INFO] <https://builds.apache.org/job/hbase-0.90/447/artifact/trunk/target/site/preface.html>
has been generated.
[INFO] Processing input file: performance.xml
[INFO] <https://builds.apache.org/job/hbase-0.90/447/artifact/trunk/target/site/performance.html>
has been generated.
[INFO] Processing input file: upgrading.xml
[INFO] <https://builds.apache.org/job/hbase-0.90/447/artifact/trunk/target/site/upgrading.html>
has been generated.
[INFO] Processing input file: configuration.xml
[INFO] <https://builds.apache.org/job/hbase-0.90/447/artifact/trunk/target/site/configuration.html>
has been generated.
[INFO] Processing input file: getting_started.xml
[INFO] <https://builds.apache.org/job/hbase-0.90/447/artifact/trunk/target/site/getting_started.html>
has been generated.
[INFO] Processing input file: shell.xml
[INFO] <https://builds.apache.org/job/hbase-0.90/447/artifact/trunk/target/site/shell.html>
has been generated.
[INFO] Processing input file: book.xml
[INFO] <https://builds.apache.org/job/hbase-0.90/447/artifact/trunk/target/site/book.html>
has been generated.
[INFO] Processing input file: troubleshooting.xml
[INFO] <https://builds.apache.org/job/hbase-0.90/447/artifact/trunk/target/site/troubleshooting.html>
has been generated.
[INFO] 
[INFO] --- maven-site-plugin:2.0.1:site (default-site) @ hbase ---
[INFO] Unable to load parent project from a relative path: 1 problem was encountered while
building the effective model
[FATAL] Non-readable POM <https://builds.apache.org/job/hbase-0.90/ws/pom.xml>: <https://builds.apache.org/job/hbase-0.90/ws/pom.xml>
(No such file or directory) @ 
 for project  at <https://builds.apache.org/job/hbase-0.90/ws/pom.xml> for project 
at <https://builds.apache.org/job/hbase-0.90/ws/pom.xml>
[INFO] Parent project loaded from repository.
[INFO] Unable to load parent project from a relative path: 1 problem was encountered while
building the effective model
[FATAL] Non-readable POM <https://builds.apache.org/job/hbase-0.90/ws/pom.xml>: <https://builds.apache.org/job/hbase-0.90/ws/pom.xml>
(No such file or directory) @ 
 for project  at <https://builds.apache.org/job/hbase-0.90/ws/pom.xml> for project 
at <https://builds.apache.org/job/hbase-0.90/ws/pom.xml>
[INFO] Parent project loaded from repository.
Downloading: http://repo1.maven.org/maven2/org/apache/maven/skins/maven-stylus-skin/maven-metadata.xml
Downloading: http://people.apache.org/~rawson/repo/org/apache/maven/skins/maven-stylus-skin/maven-metadata.xml
Downloading: http://repository.codehaus.org/org/apache/maven/skins/maven-stylus-skin/maven-metadata.xml
Downloading: http://download.java.net/maven/2/org/apache/maven/skins/maven-stylus-skin/maven-metadata.xml

487 B   
        
        
Downloaded: http://repo1.maven.org/maven2/org/apache/maven/skins/maven-stylus-skin/maven-metadata.xml
(487 B at 1.2 KB/sec)
        
[INFO]                                                                         
[INFO] ------------------------------------------------------------------------
[INFO] Building HBase 0.90.7-SNAPSHOT
[INFO] ------------------------------------------------------------------------
[INFO] 
[INFO] >>> maven-assembly-plugin:2.2-beta-5:assembly (default-cli) @ hbase >>>
[INFO] 
[INFO] --- maven-antrun-plugin:1.3:run (generate) @ hbase ---
[INFO] Executing tasks
    [mkdir] Created dir: <https://builds.apache.org/job/hbase-0.90/ws/trunk/target/hbase-webapps>
     [copy] Copying 4 files to <https://builds.apache.org/job/hbase-0.90/ws/trunk/target/hbase-webapps>
SLF4J: Failed to load class "org.slf4j.impl.StaticLoggerBinder".
SLF4J: See http://www.slf4j.org/codes.html#StaticLoggerBinder for further details.
2012-03-24 00:39:36.050:INFO::Logging to STDERR via org.mortbay.log.StdErrLog
    [mkdir] Created dir: <https://builds.apache.org/job/hbase-0.90/ws/trunk/target/hbase-webapps/master/WEB-INF>
    [mkdir] Created dir: <https://builds.apache.org/job/hbase-0.90/ws/trunk/target/hbase-webapps/regionserver/WEB-INF>
[INFO] Executed tasks
[INFO] 
[INFO] --- build-helper-maven-plugin:1.5:add-source (add-jspc-source) @ hbase ---
[INFO] Source directory: <https://builds.apache.org/job/hbase-0.90/ws/trunk/target/jspc>
added.
[INFO] 
[INFO] --- build-helper-maven-plugin:1.5:add-source (add-package-info) @ hbase ---
[INFO] Source directory: <https://builds.apache.org/job/hbase-0.90/ws/trunk/target/generated-sources>
added.
[INFO] 
[INFO] --- maven-remote-resources-plugin:1.1:process (default) @ hbase ---
[INFO] Setting property: classpath.resource.loader.class => 'org.codehaus.plexus.velocity.ContextClassLoaderResourceLoader'.
[INFO] Setting property: velocimacro.messages.on => 'false'.
[INFO] Setting property: resource.loader => 'classpath'.
[INFO] Setting property: resource.manager.logwhenfound => 'false'.
[INFO] 
[INFO] --- maven-resources-plugin:2.4:resources (default-resources) @ hbase ---
[INFO] Using 'UTF-8' encoding to copy filtered resources.
[INFO] Copying 1 resource
[INFO] Copying 6 resources
[INFO] Copying 3 resources
[INFO] 
[INFO] --- maven-antrun-plugin:1.3:run (default) @ hbase ---
[INFO] Executing tasks
[INFO] Executed tasks
[INFO] 
[INFO] --- maven-compiler-plugin:2.0.2:compile (default-compile) @ hbase ---
[INFO] Compiling 466 source files to <https://builds.apache.org/job/hbase-0.90/ws/trunk/target/classes>
[INFO] ------------------------------------------------------------------------
[INFO] BUILD FAILURE
[INFO] ------------------------------------------------------------------------
[INFO] Total time: 32.552s
[INFO] Finished at: Sat Mar 24 00:39:44 UTC 2012
[INFO] Final Memory: 33M/546M
[INFO] ------------------------------------------------------------------------
[ERROR] Failed to execute goal org.apache.maven.plugins:maven-compiler-plugin:2.0.2:compile
(default-compile) on project hbase: Compilation failure: Compilation failure:
[ERROR] <https://builds.apache.org/job/hbase-0.90/ws/trunk/src/main/java/org/apache/hadoop/hbase/util/HBaseFsck.java>:[72,40]
cannot find symbol
[ERROR] symbol  : class TableIntegrityErrorHandler
[ERROR] location: package org.apache.hadoop.hbase.util.hbck
[ERROR] 
[ERROR] <https://builds.apache.org/job/hbase-0.90/ws/trunk/src/main/java/org/apache/hadoop/hbase/util/HBaseFsck.java>:[73,40]
cannot find symbol
[ERROR] symbol  : class TableIntegrityErrorHandlerImpl
[ERROR] location: package org.apache.hadoop.hbase.util.hbck
[ERROR] 
[ERROR] <https://builds.apache.org/job/hbase-0.90/ws/trunk/src/main/java/org/apache/hadoop/hbase/util/HBaseFsck.java>:[1778,36]
cannot find symbol
[ERROR] symbol  : class TableIntegrityErrorHandler
[ERROR] location: class org.apache.hadoop.hbase.util.HBaseFsck.TableInfo
[ERROR] 
[ERROR] <https://builds.apache.org/job/hbase-0.90/ws/trunk/src/main/java/org/apache/hadoop/hbase/util/HBaseFsck.java>:[1562,48]
cannot find symbol
[ERROR] symbol  : class TableIntegrityErrorHandlerImpl
[ERROR] location: class org.apache.hadoop.hbase.util.HBaseFsck.TableInfo
[ERROR] 
[ERROR] <https://builds.apache.org/job/hbase-0.90/ws/trunk/src/main/java/org/apache/hadoop/hbase/util/HBaseFsck.java>:[701,6]
cannot find symbol
[ERROR] symbol  : class TableIntegrityErrorHandler
[ERROR] location: class org.apache.hadoop.hbase.util.HBaseFsck
[ERROR] 
[ERROR] <https://builds.apache.org/job/hbase-0.90/ws/trunk/src/main/java/org/apache/hadoop/hbase/util/HBaseFsck.java>:[774,6]
cannot find symbol
[ERROR] symbol  : class TableIntegrityErrorHandler
[ERROR] location: class org.apache.hadoop.hbase.util.HBaseFsck
[ERROR] 
[ERROR] <https://builds.apache.org/job/hbase-0.90/ws/trunk/src/main/java/org/apache/hadoop/hbase/util/HBaseFsck.java>:[1399,6]
cannot find symbol
[ERROR] symbol  : class TableIntegrityErrorHandler
[ERROR] location: class org.apache.hadoop.hbase.util.HBaseFsck
[ERROR] 
[ERROR] <https://builds.apache.org/job/hbase-0.90/ws/trunk/src/main/java/org/apache/hadoop/hbase/util/HBaseFsck.java>:[1575,12]
cannot find symbol
[ERROR] symbol  : method getTableInfo()
[ERROR] location: class org.apache.hadoop.hbase.util.HBaseFsck.TableInfo.IntegrityFixSuggester
[ERROR] 
[ERROR] <https://builds.apache.org/job/hbase-0.90/ws/trunk/src/main/java/org/apache/hadoop/hbase/util/HBaseFsck.java>:[1570,6]
method does not override or implement a method from a supertype
[ERROR] 
[ERROR] <https://builds.apache.org/job/hbase-0.90/ws/trunk/src/main/java/org/apache/hadoop/hbase/util/HBaseFsck.java>:[1581,54]
cannot find symbol
[ERROR] symbol  : method getTableInfo()
[ERROR] location: class org.apache.hadoop.hbase.util.HBaseFsck.TableInfo.IntegrityFixSuggester
[ERROR] 
[ERROR] <https://builds.apache.org/job/hbase-0.90/ws/trunk/src/main/java/org/apache/hadoop/hbase/util/HBaseFsck.java>:[1578,6]
method does not override or implement a method from a supertype
[ERROR] 
[ERROR] <https://builds.apache.org/job/hbase-0.90/ws/trunk/src/main/java/org/apache/hadoop/hbase/util/HBaseFsck.java>:[1590,41]
cannot find symbol
[ERROR] symbol  : method getTableInfo()
[ERROR] location: class org.apache.hadoop.hbase.util.HBaseFsck.TableInfo.IntegrityFixSuggester
[ERROR] 
[ERROR] <https://builds.apache.org/job/hbase-0.90/ws/trunk/src/main/java/org/apache/hadoop/hbase/util/HBaseFsck.java>:[1593,41]
cannot find symbol
[ERROR] symbol  : method getTableInfo()
[ERROR] location: class org.apache.hadoop.hbase.util.HBaseFsck.TableInfo.IntegrityFixSuggester
[ERROR] 
[ERROR] <https://builds.apache.org/job/hbase-0.90/ws/trunk/src/main/java/org/apache/hadoop/hbase/util/HBaseFsck.java>:[1584,6]
method does not override or implement a method from a supertype
[ERROR] 
[ERROR] <https://builds.apache.org/job/hbase-0.90/ws/trunk/src/main/java/org/apache/hadoop/hbase/util/HBaseFsck.java>:[1600,12]
cannot find symbol
[ERROR] symbol  : method getTableInfo()
[ERROR] location: class org.apache.hadoop.hbase.util.HBaseFsck.TableInfo.IntegrityFixSuggester
[ERROR] 
[ERROR] <https://builds.apache.org/job/hbase-0.90/ws/trunk/src/main/java/org/apache/hadoop/hbase/util/HBaseFsck.java>:[1596,6]
method does not override or implement a method from a supertype
[ERROR] 
[ERROR] <https://builds.apache.org/job/hbase-0.90/ws/trunk/src/main/java/org/apache/hadoop/hbase/util/HBaseFsck.java>:[1603,6]
method does not override or implement a method from a supertype
[ERROR] 
[ERROR] <https://builds.apache.org/job/hbase-0.90/ws/trunk/src/main/java/org/apache/hadoop/hbase/util/HBaseFsck.java>:[1649,12]
cannot find symbol
[ERROR] symbol  : method getTableInfo()
[ERROR] location: class org.apache.hadoop.hbase.util.HBaseFsck.TableInfo.HDFSIntegrityFixer
[ERROR] 
[ERROR] <https://builds.apache.org/job/hbase-0.90/ws/trunk/src/main/java/org/apache/hadoop/hbase/util/HBaseFsck.java>:[1650,31]
cannot find symbol
[ERROR] symbol  : method getTableInfo()
[ERROR] location: class org.apache.hadoop.hbase.util.HBaseFsck.TableInfo.HDFSIntegrityFixer
[ERROR] 
[ERROR] <https://builds.apache.org/job/hbase-0.90/ws/trunk/src/main/java/org/apache/hadoop/hbase/util/HBaseFsck.java>:[1672,31]
cannot find symbol
[ERROR] symbol  : method getTableInfo()
[ERROR] location: class org.apache.hadoop.hbase.util.HBaseFsck.TableInfo.HDFSIntegrityFixer
[ERROR] 
[ERROR] <https://builds.apache.org/job/hbase-0.90/ws/trunk/src/main/java/org/apache/hadoop/hbase/util/HBaseFsck.java>:[1748,31]
cannot find symbol
[ERROR] symbol  : method getTableInfo()
[ERROR] location: class org.apache.hadoop.hbase.util.HBaseFsck.TableInfo.HDFSIntegrityFixer
[ERROR] 
[ERROR] <https://builds.apache.org/job/hbase-0.90/ws/trunk/src/main/java/org/apache/hadoop/hbase/util/HBaseFsck.java>:[1688,6]
method does not override or implement a method from a supertype
[ERROR] -> [Help 1]
[ERROR] 
[ERROR] To see the full stack trace of the errors, re-run Maven with the -e switch.
[ERROR] Re-run Maven using the -X switch to enable full debug logging.
[ERROR] 
[ERROR] For more information about the errors and possible solutions, please read the following
articles:
[ERROR] [Help 1] http://cwiki.apache.org/confluence/display/MAVEN/MojoFailureException
Build step 'Invoke top-level Maven targets' marked build as failure
[locks-and-latches] Releasing all the locks
[locks-and-latches] All the locks released
Archiving artifacts
Recording test results

Mime
View raw message