hbase-dev mailing list archives

Site index · List index
Message view « Date » · « Thread »
Top « Date » · « Thread »
From Apache Jenkins Server <jenk...@builds.apache.org>
Subject Build failed in Jenkins: HBase-0.92 #329
Date Mon, 19 Mar 2012 07:17:34 GMT
See <https://builds.apache.org/job/HBase-0.92/329/changes>

Changes:

[tedyu] HBASE-5568 Multi concurrent flushcache() for one region could cause data loss (Chunhui)

------------------------------------------
[...truncated 6972 lines...]
Tests run: 1, Failures: 0, Errors: 0, Skipped: 0, Time elapsed: 22.331 sec
Forking command line: /bin/sh -c cd <https://builds.apache.org/job/HBase-0.92/ws/trunk>
&& /home/jenkins/tools/java/jdk1.6.0_27-32/jre/bin/java -enableassertions -Xmx1400m
-Djava.security.egd=file:/dev/./urandom -jar <https://builds.apache.org/job/HBase-0.92/ws/trunk/target/surefire/surefirebooter2986136599773169881.jar>
<https://builds.apache.org/job/HBase-0.92/ws/trunk/target/surefire/surefire4296347245753107973tmp>
<https://builds.apache.org/job/HBase-0.92/ws/trunk/target/surefire/surefire5854220956766721228tmp>
Running org.apache.hadoop.hbase.filter.TestColumnPaginationFilter
Tests run: 1, Failures: 0, Errors: 0, Skipped: 0, Time elapsed: 0.122 sec
Forking command line: /bin/sh -c cd <https://builds.apache.org/job/HBase-0.92/ws/trunk>
&& /home/jenkins/tools/java/jdk1.6.0_27-32/jre/bin/java -enableassertions -Xmx1400m
-Djava.security.egd=file:/dev/./urandom -jar <https://builds.apache.org/job/HBase-0.92/ws/trunk/target/surefire/surefirebooter3989221986208350808.jar>
<https://builds.apache.org/job/HBase-0.92/ws/trunk/target/surefire/surefire9141207021568221471tmp>
<https://builds.apache.org/job/HBase-0.92/ws/trunk/target/surefire/surefire3669323425353956529tmp>
Running org.apache.hadoop.hbase.filter.TestPageFilter
Tests run: 2, Failures: 0, Errors: 0, Skipped: 0, Time elapsed: 0.03 sec
Forking command line: /bin/sh -c cd <https://builds.apache.org/job/HBase-0.92/ws/trunk>
&& /home/jenkins/tools/java/jdk1.6.0_27-32/jre/bin/java -enableassertions -Xmx1400m
-Djava.security.egd=file:/dev/./urandom -jar <https://builds.apache.org/job/HBase-0.92/ws/trunk/target/surefire/surefirebooter1222079329774185020.jar>
<https://builds.apache.org/job/HBase-0.92/ws/trunk/target/surefire/surefire3417139316363719275tmp>
<https://builds.apache.org/job/HBase-0.92/ws/trunk/target/surefire/surefire9201022780609780828tmp>
Running org.apache.hadoop.hbase.filter.TestParseFilter
Tests run: 33, Failures: 0, Errors: 0, Skipped: 0, Time elapsed: 0.35 sec
Forking command line: /bin/sh -c cd <https://builds.apache.org/job/HBase-0.92/ws/trunk>
&& /home/jenkins/tools/java/jdk1.6.0_27-32/jre/bin/java -enableassertions -Xmx1400m
-Djava.security.egd=file:/dev/./urandom -jar <https://builds.apache.org/job/HBase-0.92/ws/trunk/target/surefire/surefirebooter8271789738599152131.jar>
<https://builds.apache.org/job/HBase-0.92/ws/trunk/target/surefire/surefire6363450827859209494tmp>
<https://builds.apache.org/job/HBase-0.92/ws/trunk/target/surefire/surefire3886444381986924704tmp>
Running org.apache.hadoop.hbase.filter.TestRandomRowFilter
Tests run: 2, Failures: 0, Errors: 0, Skipped: 0, Time elapsed: 0.56 sec
Forking command line: /bin/sh -c cd <https://builds.apache.org/job/HBase-0.92/ws/trunk>
&& /home/jenkins/tools/java/jdk1.6.0_27-32/jre/bin/java -enableassertions -Xmx1400m
-Djava.security.egd=file:/dev/./urandom -jar <https://builds.apache.org/job/HBase-0.92/ws/trunk/target/surefire/surefirebooter8971440368145107706.jar>
<https://builds.apache.org/job/HBase-0.92/ws/trunk/target/surefire/surefire8596654665699808865tmp>
<https://builds.apache.org/job/HBase-0.92/ws/trunk/target/surefire/surefire8394352317937589070tmp>
Running org.apache.hadoop.hbase.filter.TestPrefixFilter
Tests run: 3, Failures: 0, Errors: 0, Skipped: 0, Time elapsed: 0.11 sec
Forking command line: /bin/sh -c cd <https://builds.apache.org/job/HBase-0.92/ws/trunk>
&& /home/jenkins/tools/java/jdk1.6.0_27-32/jre/bin/java -enableassertions -Xmx1400m
-Djava.security.egd=file:/dev/./urandom -jar <https://builds.apache.org/job/HBase-0.92/ws/trunk/target/surefire/surefirebooter7336129187427018762.jar>
<https://builds.apache.org/job/HBase-0.92/ws/trunk/target/surefire/surefire447066857684853901tmp>
<https://builds.apache.org/job/HBase-0.92/ws/trunk/target/surefire/surefire4399829269933738251tmp>
Running org.apache.hadoop.hbase.filter.TestBitComparator
Tests run: 3, Failures: 0, Errors: 0, Skipped: 0, Time elapsed: 0.034 sec
Forking command line: /bin/sh -c cd <https://builds.apache.org/job/HBase-0.92/ws/trunk>
&& /home/jenkins/tools/java/jdk1.6.0_27-32/jre/bin/java -enableassertions -Xmx1400m
-Djava.security.egd=file:/dev/./urandom -jar <https://builds.apache.org/job/HBase-0.92/ws/trunk/target/surefire/surefirebooter7406431053934635345.jar>
<https://builds.apache.org/job/HBase-0.92/ws/trunk/target/surefire/surefire6782919569178155681tmp>
<https://builds.apache.org/job/HBase-0.92/ws/trunk/target/surefire/surefire1416121331466290446tmp>
Running org.apache.hadoop.hbase.filter.TestDependentColumnFilter
Tests run: 2, Failures: 0, Errors: 0, Skipped: 0, Time elapsed: 0.955 sec
Forking command line: /bin/sh -c cd <https://builds.apache.org/job/HBase-0.92/ws/trunk>
&& /home/jenkins/tools/java/jdk1.6.0_27-32/jre/bin/java -enableassertions -Xmx1400m
-Djava.security.egd=file:/dev/./urandom -jar <https://builds.apache.org/job/HBase-0.92/ws/trunk/target/surefire/surefirebooter906340316634391931.jar>
<https://builds.apache.org/job/HBase-0.92/ws/trunk/target/surefire/surefire8846690483761713495tmp>
<https://builds.apache.org/job/HBase-0.92/ws/trunk/target/surefire/surefire6043005341695635417tmp>
Running org.apache.hadoop.hbase.filter.TestSingleColumnValueFilter
Tests run: 2, Failures: 0, Errors: 0, Skipped: 0, Time elapsed: 0.162 sec
Forking command line: /bin/sh -c cd <https://builds.apache.org/job/HBase-0.92/ws/trunk>
&& /home/jenkins/tools/java/jdk1.6.0_27-32/jre/bin/java -enableassertions -Xmx1400m
-Djava.security.egd=file:/dev/./urandom -jar <https://builds.apache.org/job/HBase-0.92/ws/trunk/target/surefire/surefirebooter3888881158008574973.jar>
<https://builds.apache.org/job/HBase-0.92/ws/trunk/target/surefire/surefire3529210779906307485tmp>
<https://builds.apache.org/job/HBase-0.92/ws/trunk/target/surefire/surefire450827971129357713tmp>
Running org.apache.hadoop.hbase.filter.TestInclusiveStopFilter
Tests run: 2, Failures: 0, Errors: 0, Skipped: 0, Time elapsed: 0.109 sec
Forking command line: /bin/sh -c cd <https://builds.apache.org/job/HBase-0.92/ws/trunk>
&& /home/jenkins/tools/java/jdk1.6.0_27-32/jre/bin/java -enableassertions -Xmx1400m
-Djava.security.egd=file:/dev/./urandom -jar <https://builds.apache.org/job/HBase-0.92/ws/trunk/target/surefire/surefirebooter3297681661780306076.jar>
<https://builds.apache.org/job/HBase-0.92/ws/trunk/target/surefire/surefire4481499517532336873tmp>
<https://builds.apache.org/job/HBase-0.92/ws/trunk/target/surefire/surefire5386625557386156082tmp>
Running org.apache.hadoop.hbase.filter.TestFilterList
Tests run: 5, Failures: 0, Errors: 0, Skipped: 0, Time elapsed: 0.267 sec
Forking command line: /bin/sh -c cd <https://builds.apache.org/job/HBase-0.92/ws/trunk>
&& /home/jenkins/tools/java/jdk1.6.0_27-32/jre/bin/java -enableassertions -Xmx1400m
-Djava.security.egd=file:/dev/./urandom -jar <https://builds.apache.org/job/HBase-0.92/ws/trunk/target/surefire/surefirebooter656517019145194962.jar>
<https://builds.apache.org/job/HBase-0.92/ws/trunk/target/surefire/surefire685973771735797130tmp>
<https://builds.apache.org/job/HBase-0.92/ws/trunk/target/surefire/surefire4499124803090827893tmp>
Running org.apache.hadoop.hbase.filter.TestFilter
Tests run: 18, Failures: 0, Errors: 0, Skipped: 0, Time elapsed: 2.437 sec
Forking command line: /bin/sh -c cd <https://builds.apache.org/job/HBase-0.92/ws/trunk>
&& /home/jenkins/tools/java/jdk1.6.0_27-32/jre/bin/java -enableassertions -Xmx1400m
-Djava.security.egd=file:/dev/./urandom -jar <https://builds.apache.org/job/HBase-0.92/ws/trunk/target/surefire/surefirebooter4254128860904262970.jar>
<https://builds.apache.org/job/HBase-0.92/ws/trunk/target/surefire/surefire3866766729534254157tmp>
<https://builds.apache.org/job/HBase-0.92/ws/trunk/target/surefire/surefire6928339960283254583tmp>
Running org.apache.hadoop.hbase.filter.TestMultipleColumnPrefixFilter
Tests run: 3, Failures: 0, Errors: 0, Skipped: 0, Time elapsed: 3.096 sec
Forking command line: /bin/sh -c cd <https://builds.apache.org/job/HBase-0.92/ws/trunk>
&& /home/jenkins/tools/java/jdk1.6.0_27-32/jre/bin/java -enableassertions -Xmx1400m
-Djava.security.egd=file:/dev/./urandom -jar <https://builds.apache.org/job/HBase-0.92/ws/trunk/target/surefire/surefirebooter6311861177536900980.jar>
<https://builds.apache.org/job/HBase-0.92/ws/trunk/target/surefire/surefire8894542242244624637tmp>
<https://builds.apache.org/job/HBase-0.92/ws/trunk/target/surefire/surefire1304051593989598166tmp>
Running org.apache.hadoop.hbase.filter.TestColumnPrefixFilter
Tests run: 2, Failures: 0, Errors: 0, Skipped: 0, Time elapsed: 2.629 sec
Forking command line: /bin/sh -c cd <https://builds.apache.org/job/HBase-0.92/ws/trunk>
&& /home/jenkins/tools/java/jdk1.6.0_27-32/jre/bin/java -enableassertions -Xmx1400m
-Djava.security.egd=file:/dev/./urandom -jar <https://builds.apache.org/job/HBase-0.92/ws/trunk/target/surefire/surefirebooter3213748032380340030.jar>
<https://builds.apache.org/job/HBase-0.92/ws/trunk/target/surefire/surefire4350440892010589858tmp>
<https://builds.apache.org/job/HBase-0.92/ws/trunk/target/surefire/surefire3186141331654280200tmp>
Running org.apache.hadoop.hbase.filter.TestSingleColumnValueExcludeFilter
Tests run: 1, Failures: 0, Errors: 0, Skipped: 0, Time elapsed: 0.119 sec
Forking command line: /bin/sh -c cd <https://builds.apache.org/job/HBase-0.92/ws/trunk>
&& /home/jenkins/tools/java/jdk1.6.0_27-32/jre/bin/java -enableassertions -Xmx1400m
-Djava.security.egd=file:/dev/./urandom -jar <https://builds.apache.org/job/HBase-0.92/ws/trunk/target/surefire/surefirebooter7456399260521297254.jar>
<https://builds.apache.org/job/HBase-0.92/ws/trunk/target/surefire/surefire4154360201261237229tmp>
<https://builds.apache.org/job/HBase-0.92/ws/trunk/target/surefire/surefire278704862993951178tmp>
Running org.apache.hadoop.hbase.TestGlobalMemStoreSize
Tests run: 1, Failures: 0, Errors: 0, Skipped: 0, Time elapsed: 21.145 sec
Forking command line: /bin/sh -c cd <https://builds.apache.org/job/HBase-0.92/ws/trunk>
&& /home/jenkins/tools/java/jdk1.6.0_27-32/jre/bin/java -enableassertions -Xmx1400m
-Djava.security.egd=file:/dev/./urandom -jar <https://builds.apache.org/job/HBase-0.92/ws/trunk/target/surefire/surefirebooter3368997028680730004.jar>
<https://builds.apache.org/job/HBase-0.92/ws/trunk/target/surefire/surefire106926075470501362tmp>
<https://builds.apache.org/job/HBase-0.92/ws/trunk/target/surefire/surefire6679026055717845293tmp>
Running org.apache.hadoop.hbase.TestHBaseTestingUtility
Tests run: 7, Failures: 0, Errors: 0, Skipped: 0, Time elapsed: 92.795 sec
Forking command line: /bin/sh -c cd <https://builds.apache.org/job/HBase-0.92/ws/trunk>
&& /home/jenkins/tools/java/jdk1.6.0_27-32/jre/bin/java -enableassertions -Xmx1400m
-Djava.security.egd=file:/dev/./urandom -jar <https://builds.apache.org/job/HBase-0.92/ws/trunk/target/surefire/surefirebooter3167048466446420578.jar>
<https://builds.apache.org/job/HBase-0.92/ws/trunk/target/surefire/surefire2983744298081692984tmp>
<https://builds.apache.org/job/HBase-0.92/ws/trunk/target/surefire/surefire709426673196737055tmp>
Running org.apache.hadoop.hbase.security.TestUser
Tests run: 3, Failures: 0, Errors: 0, Skipped: 0, Time elapsed: 0.468 sec
Forking command line: /bin/sh -c cd <https://builds.apache.org/job/HBase-0.92/ws/trunk>
&& /home/jenkins/tools/java/jdk1.6.0_27-32/jre/bin/java -enableassertions -Xmx1400m
-Djava.security.egd=file:/dev/./urandom -jar <https://builds.apache.org/job/HBase-0.92/ws/trunk/target/surefire/surefirebooter3426619675149971348.jar>
<https://builds.apache.org/job/HBase-0.92/ws/trunk/target/surefire/surefire7682315613667482039tmp>
<https://builds.apache.org/job/HBase-0.92/ws/trunk/target/surefire/surefire6809027196856080711tmp>
Running org.apache.hadoop.hbase.TestMultiVersions
Tests run: 3, Failures: 0, Errors: 0, Skipped: 0, Time elapsed: 34.164 sec
Forking command line: /bin/sh -c cd <https://builds.apache.org/job/HBase-0.92/ws/trunk>
&& /home/jenkins/tools/java/jdk1.6.0_27-32/jre/bin/java -enableassertions -Xmx1400m
-Djava.security.egd=file:/dev/./urandom -jar <https://builds.apache.org/job/HBase-0.92/ws/trunk/target/surefire/surefirebooter770363487436086766.jar>
<https://builds.apache.org/job/HBase-0.92/ws/trunk/target/surefire/surefire3057383957516546409tmp>
<https://builds.apache.org/job/HBase-0.92/ws/trunk/target/surefire/surefire6277248194771753125tmp>
Running org.apache.hadoop.hbase.TestRegionRebalancing
Tests run: 1, Failures: 0, Errors: 0, Skipped: 0, Time elapsed: 46.031 sec
Forking command line: /bin/sh -c cd <https://builds.apache.org/job/HBase-0.92/ws/trunk>
&& /home/jenkins/tools/java/jdk1.6.0_27-32/jre/bin/java -enableassertions -Xmx1400m
-Djava.security.egd=file:/dev/./urandom -jar <https://builds.apache.org/job/HBase-0.92/ws/trunk/target/surefire/surefirebooter480718652265338885.jar>
<https://builds.apache.org/job/HBase-0.92/ws/trunk/target/surefire/surefire5959538795023064944tmp>
<https://builds.apache.org/job/HBase-0.92/ws/trunk/target/surefire/surefire9103852999939945807tmp>
Running org.apache.hadoop.hbase.replication.TestReplication
Tests run: 8, Failures: 0, Errors: 0, Skipped: 0, Time elapsed: 111.672 sec
Forking command line: /bin/sh -c cd <https://builds.apache.org/job/HBase-0.92/ws/trunk>
&& /home/jenkins/tools/java/jdk1.6.0_27-32/jre/bin/java -enableassertions -Xmx1400m
-Djava.security.egd=file:/dev/./urandom -jar <https://builds.apache.org/job/HBase-0.92/ws/trunk/target/surefire/surefirebooter8359463984556611764.jar>
<https://builds.apache.org/job/HBase-0.92/ws/trunk/target/surefire/surefire4398103035512412250tmp>
<https://builds.apache.org/job/HBase-0.92/ws/trunk/target/surefire/surefire2598031622306453108tmp>
Running org.apache.hadoop.hbase.replication.TestMasterReplication
Tests run: 2, Failures: 0, Errors: 0, Skipped: 0, Time elapsed: 93.55 sec
Forking command line: /bin/sh -c cd <https://builds.apache.org/job/HBase-0.92/ws/trunk>
&& /home/jenkins/tools/java/jdk1.6.0_27-32/jre/bin/java -enableassertions -Xmx1400m
-Djava.security.egd=file:/dev/./urandom -jar <https://builds.apache.org/job/HBase-0.92/ws/trunk/target/surefire/surefirebooter8283978140998464356.jar>
<https://builds.apache.org/job/HBase-0.92/ws/trunk/target/surefire/surefire5630592614215489425tmp>
<https://builds.apache.org/job/HBase-0.92/ws/trunk/target/surefire/surefire7460314941174355701tmp>
Running org.apache.hadoop.hbase.replication.regionserver.TestReplicationSourceManager
Tests run: 1, Failures: 0, Errors: 0, Skipped: 0, Time elapsed: 1.066 sec
Forking command line: /bin/sh -c cd <https://builds.apache.org/job/HBase-0.92/ws/trunk>
&& /home/jenkins/tools/java/jdk1.6.0_27-32/jre/bin/java -enableassertions -Xmx1400m
-Djava.security.egd=file:/dev/./urandom -jar <https://builds.apache.org/job/HBase-0.92/ws/trunk/target/surefire/surefirebooter1701809671341509730.jar>
<https://builds.apache.org/job/HBase-0.92/ws/trunk/target/surefire/surefire4351938523912105769tmp>
<https://builds.apache.org/job/HBase-0.92/ws/trunk/target/surefire/surefire5276211634178136883tmp>
Running org.apache.hadoop.hbase.replication.regionserver.TestReplicationSink
Tests run: 5, Failures: 0, Errors: 0, Skipped: 0, Time elapsed: 20.729 sec
Forking command line: /bin/sh -c cd <https://builds.apache.org/job/HBase-0.92/ws/trunk>
&& /home/jenkins/tools/java/jdk1.6.0_27-32/jre/bin/java -enableassertions -Xmx1400m
-Djava.security.egd=file:/dev/./urandom -jar <https://builds.apache.org/job/HBase-0.92/ws/trunk/target/surefire/surefirebooter6796499490119189469.jar>
<https://builds.apache.org/job/HBase-0.92/ws/trunk/target/surefire/surefire7064247623818843382tmp>
<https://builds.apache.org/job/HBase-0.92/ws/trunk/target/surefire/surefire1259482126675883493tmp>
Running org.apache.hadoop.hbase.replication.TestReplicationPeer
Tests run: 1, Failures: 0, Errors: 0, Skipped: 0, Time elapsed: 25.704 sec
Forking command line: /bin/sh -c cd <https://builds.apache.org/job/HBase-0.92/ws/trunk>
&& /home/jenkins/tools/java/jdk1.6.0_27-32/jre/bin/java -enableassertions -Xmx1400m
-Djava.security.egd=file:/dev/./urandom -jar <https://builds.apache.org/job/HBase-0.92/ws/trunk/target/surefire/surefirebooter5511065296036507164.jar>
<https://builds.apache.org/job/HBase-0.92/ws/trunk/target/surefire/surefire8588553451464931384tmp>
<https://builds.apache.org/job/HBase-0.92/ws/trunk/target/surefire/surefire5093848727160679668tmp>
Running org.apache.hadoop.hbase.replication.TestMultiSlaveReplication
Tests run: 1, Failures: 0, Errors: 0, Skipped: 0, Time elapsed: 57.182 sec
Forking command line: /bin/sh -c cd <https://builds.apache.org/job/HBase-0.92/ws/trunk>
&& /home/jenkins/tools/java/jdk1.6.0_27-32/jre/bin/java -enableassertions -Xmx1400m
-Djava.security.egd=file:/dev/./urandom -jar <https://builds.apache.org/job/HBase-0.92/ws/trunk/target/surefire/surefirebooter8208477895400147005.jar>
<https://builds.apache.org/job/HBase-0.92/ws/trunk/target/surefire/surefire7292377412351527401tmp>
<https://builds.apache.org/job/HBase-0.92/ws/trunk/target/surefire/surefire2589095574977242046tmp>
Running org.apache.hadoop.hbase.replication.TestReplicationSource
Tests run: 1, Failures: 0, Errors: 0, Skipped: 0, Time elapsed: 2.646 sec
Forking command line: /bin/sh -c cd <https://builds.apache.org/job/HBase-0.92/ws/trunk>
&& /home/jenkins/tools/java/jdk1.6.0_27-32/jre/bin/java -enableassertions -Xmx1400m
-Djava.security.egd=file:/dev/./urandom -jar <https://builds.apache.org/job/HBase-0.92/ws/trunk/target/surefire/surefirebooter7258998024887180847.jar>
<https://builds.apache.org/job/HBase-0.92/ws/trunk/target/surefire/surefire802931428025726348tmp>
<https://builds.apache.org/job/HBase-0.92/ws/trunk/target/surefire/surefire5430586207585884233tmp>
Running org.apache.hadoop.hbase.avro.TestAvroServer
Tests run: 3, Failures: 0, Errors: 0, Skipped: 0, Time elapsed: 32.979 sec
Forking command line: /bin/sh -c cd <https://builds.apache.org/job/HBase-0.92/ws/trunk>
&& /home/jenkins/tools/java/jdk1.6.0_27-32/jre/bin/java -enableassertions -Xmx1400m
-Djava.security.egd=file:/dev/./urandom -jar <https://builds.apache.org/job/HBase-0.92/ws/trunk/target/surefire/surefirebooter3215728730784409907.jar>
<https://builds.apache.org/job/HBase-0.92/ws/trunk/target/surefire/surefire451840146742012327tmp>
<https://builds.apache.org/job/HBase-0.92/ws/trunk/target/surefire/surefire6028888306714386361tmp>
Running org.apache.hadoop.hbase.avro.TestAvroUtil
Tests run: 1, Failures: 0, Errors: 0, Skipped: 0, Time elapsed: 0.657 sec
Forking command line: /bin/sh -c cd <https://builds.apache.org/job/HBase-0.92/ws/trunk>
&& /home/jenkins/tools/java/jdk1.6.0_27-32/jre/bin/java -enableassertions -Xmx1400m
-Djava.security.egd=file:/dev/./urandom -jar <https://builds.apache.org/job/HBase-0.92/ws/trunk/target/surefire/surefirebooter5704829315565340048.jar>
<https://builds.apache.org/job/HBase-0.92/ws/trunk/target/surefire/surefire5316229053353116732tmp>
<https://builds.apache.org/job/HBase-0.92/ws/trunk/target/surefire/surefire6468550932507718573tmp>
Running org.apache.hadoop.hbase.TestAcidGuarantees
Tests run: 3, Failures: 0, Errors: 0, Skipped: 0, Time elapsed: 117.137 sec
Forking command line: /bin/sh -c cd <https://builds.apache.org/job/HBase-0.92/ws/trunk>
&& /home/jenkins/tools/java/jdk1.6.0_27-32/jre/bin/java -enableassertions -Xmx1400m
-Djava.security.egd=file:/dev/./urandom -jar <https://builds.apache.org/job/HBase-0.92/ws/trunk/target/surefire/surefirebooter9133529888563498303.jar>
<https://builds.apache.org/job/HBase-0.92/ws/trunk/target/surefire/surefire1617320540537225394tmp>
<https://builds.apache.org/job/HBase-0.92/ws/trunk/target/surefire/surefire7586214360148643353tmp>
Running org.apache.hadoop.hbase.TestKeyValue
Tests run: 12, Failures: 0, Errors: 0, Skipped: 0, Time elapsed: 0.132 sec
Forking command line: /bin/sh -c cd <https://builds.apache.org/job/HBase-0.92/ws/trunk>
&& /home/jenkins/tools/java/jdk1.6.0_27-32/jre/bin/java -enableassertions -Xmx1400m
-Djava.security.egd=file:/dev/./urandom -jar <https://builds.apache.org/job/HBase-0.92/ws/trunk/target/surefire/surefirebooter1632623243378458111.jar>
<https://builds.apache.org/job/HBase-0.92/ws/trunk/target/surefire/surefire1958048102805180982tmp>
<https://builds.apache.org/job/HBase-0.92/ws/trunk/target/surefire/surefire6748696419305849498tmp>
Running org.apache.hadoop.hbase.coprocessor.TestRegionServerCoprocessorExceptionWithRemove
Tests run: 1, Failures: 0, Errors: 0, Skipped: 0, Time elapsed: 22.048 sec
Forking command line: /bin/sh -c cd <https://builds.apache.org/job/HBase-0.92/ws/trunk>
&& /home/jenkins/tools/java/jdk1.6.0_27-32/jre/bin/java -enableassertions -Xmx1400m
-Djava.security.egd=file:/dev/./urandom -jar <https://builds.apache.org/job/HBase-0.92/ws/trunk/target/surefire/surefirebooter7296565995225950267.jar>
<https://builds.apache.org/job/HBase-0.92/ws/trunk/target/surefire/surefire3728730553195751726tmp>
<https://builds.apache.org/job/HBase-0.92/ws/trunk/target/surefire/surefire1057157103921675523tmp>
Running org.apache.hadoop.hbase.coprocessor.TestRegionObserverInterface
Tests run: 5, Failures: 0, Errors: 0, Skipped: 0, Time elapsed: 37.225 sec
Forking command line: /bin/sh -c cd <https://builds.apache.org/job/HBase-0.92/ws/trunk>
&& /home/jenkins/tools/java/jdk1.6.0_27-32/jre/bin/java -enableassertions -Xmx1400m
-Djava.security.egd=file:/dev/./urandom -jar <https://builds.apache.org/job/HBase-0.92/ws/trunk/target/surefire/surefirebooter4412399631362583392.jar>
<https://builds.apache.org/job/HBase-0.92/ws/trunk/target/surefire/surefire5175280114481526783tmp>
<https://builds.apache.org/job/HBase-0.92/ws/trunk/target/surefire/surefire3727156871224260029tmp>
Running org.apache.hadoop.hbase.coprocessor.TestCoprocessorInterface
Tests run: 1, Failures: 0, Errors: 0, Skipped: 0, Time elapsed: 4.167 sec
Forking command line: /bin/sh -c cd <https://builds.apache.org/job/HBase-0.92/ws/trunk>
&& /home/jenkins/tools/java/jdk1.6.0_27-32/jre/bin/java -enableassertions -Xmx1400m
-Djava.security.egd=file:/dev/./urandom -jar <https://builds.apache.org/job/HBase-0.92/ws/trunk/target/surefire/surefirebooter3851446376110527394.jar>
<https://builds.apache.org/job/HBase-0.92/ws/trunk/target/surefire/surefire3158951814014025625tmp>
<https://builds.apache.org/job/HBase-0.92/ws/trunk/target/surefire/surefire3218032670005490502tmp>
Running org.apache.hadoop.hbase.coprocessor.TestMasterObserver
Tests run: 3, Failures: 0, Errors: 0, Skipped: 0, Time elapsed: 32.938 sec
Forking command line: /bin/sh -c cd <https://builds.apache.org/job/HBase-0.92/ws/trunk>
&& /home/jenkins/tools/java/jdk1.6.0_27-32/jre/bin/java -enableassertions -Xmx1400m
-Djava.security.egd=file:/dev/./urandom -jar <https://builds.apache.org/job/HBase-0.92/ws/trunk/target/surefire/surefirebooter5932852031884493982.jar>
<https://builds.apache.org/job/HBase-0.92/ws/trunk/target/surefire/surefire7472875357983054883tmp>
<https://builds.apache.org/job/HBase-0.92/ws/trunk/target/surefire/surefire6880628485277293674tmp>
Running org.apache.hadoop.hbase.coprocessor.TestCoprocessorEndpoint
Tests run: 3, Failures: 0, Errors: 0, Skipped: 0, Time elapsed: 36.494 sec
Forking command line: /bin/sh -c cd <https://builds.apache.org/job/HBase-0.92/ws/trunk>
&& /home/jenkins/tools/java/jdk1.6.0_27-32/jre/bin/java -enableassertions -Xmx1400m
-Djava.security.egd=file:/dev/./urandom -jar <https://builds.apache.org/job/HBase-0.92/ws/trunk/target/surefire/surefirebooter83607369736811089.jar>
<https://builds.apache.org/job/HBase-0.92/ws/trunk/target/surefire/surefire2110518149347079632tmp>
<https://builds.apache.org/job/HBase-0.92/ws/trunk/target/surefire/surefire2989128983771411526tmp>
Running org.apache.hadoop.hbase.coprocessor.TestWALObserver
Tests run: 3, Failures: 0, Errors: 0, Skipped: 0, Time elapsed: 20.943 sec
Forking command line: /bin/sh -c cd <https://builds.apache.org/job/HBase-0.92/ws/trunk>
&& /home/jenkins/tools/java/jdk1.6.0_27-32/jre/bin/java -enableassertions -Xmx1400m
-Djava.security.egd=file:/dev/./urandom -jar <https://builds.apache.org/job/HBase-0.92/ws/trunk/target/surefire/surefirebooter1127635638510924334.jar>
<https://builds.apache.org/job/HBase-0.92/ws/trunk/target/surefire/surefire8640476424617370870tmp>
<https://builds.apache.org/job/HBase-0.92/ws/trunk/target/surefire/surefire774499774336598438tmp>
Running org.apache.hadoop.hbase.coprocessor.TestRegionObserverBypass
Tests run: 2, Failures: 0, Errors: 0, Skipped: 0, Time elapsed: 18.972 sec
Forking command line: /bin/sh -c cd <https://builds.apache.org/job/HBase-0.92/ws/trunk>
&& /home/jenkins/tools/java/jdk1.6.0_27-32/jre/bin/java -enableassertions -Xmx1400m
-Djava.security.egd=file:/dev/./urandom -jar <https://builds.apache.org/job/HBase-0.92/ws/trunk/target/surefire/surefirebooter4508537595159434925.jar>
<https://builds.apache.org/job/HBase-0.92/ws/trunk/target/surefire/surefire2458422922993655863tmp>
<https://builds.apache.org/job/HBase-0.92/ws/trunk/target/surefire/surefire6662176290283556239tmp>
Running org.apache.hadoop.hbase.coprocessor.TestMasterCoprocessorExceptionWithAbort
Tests run: 1, Failures: 0, Errors: 0, Skipped: 0, Time elapsed: 17.385 sec
Forking command line: /bin/sh -c cd <https://builds.apache.org/job/HBase-0.92/ws/trunk>
&& /home/jenkins/tools/java/jdk1.6.0_27-32/jre/bin/java -enableassertions -Xmx1400m
-Djava.security.egd=file:/dev/./urandom -jar <https://builds.apache.org/job/HBase-0.92/ws/trunk/target/surefire/surefirebooter8162260304117197918.jar>
<https://builds.apache.org/job/HBase-0.92/ws/trunk/target/surefire/surefire3018558142177776139tmp>
<https://builds.apache.org/job/HBase-0.92/ws/trunk/target/surefire/surefire4920158139897087568tmp>
Running org.apache.hadoop.hbase.coprocessor.TestRegionServerCoprocessorExceptionWithAbort
Tests run: 1, Failures: 0, Errors: 0, Skipped: 0, Time elapsed: 23.423 sec
Forking command line: /bin/sh -c cd <https://builds.apache.org/job/HBase-0.92/ws/trunk>
&& /home/jenkins/tools/java/jdk1.6.0_27-32/jre/bin/java -enableassertions -Xmx1400m
-Djava.security.egd=file:/dev/./urandom -jar <https://builds.apache.org/job/HBase-0.92/ws/trunk/target/surefire/surefirebooter754742624073955475.jar>
<https://builds.apache.org/job/HBase-0.92/ws/trunk/target/surefire/surefire8461740962831047119tmp>
<https://builds.apache.org/job/HBase-0.92/ws/trunk/target/surefire/surefire7989096222005653196tmp>
Running org.apache.hadoop.hbase.coprocessor.TestAggregateProtocol
Tests run: 44, Failures: 0, Errors: 0, Skipped: 0, Time elapsed: 20.798 sec
Forking command line: /bin/sh -c cd <https://builds.apache.org/job/HBase-0.92/ws/trunk>
&& /home/jenkins/tools/java/jdk1.6.0_27-32/jre/bin/java -enableassertions -Xmx1400m
-Djava.security.egd=file:/dev/./urandom -jar <https://builds.apache.org/job/HBase-0.92/ws/trunk/target/surefire/surefirebooter313557940992039766.jar>
<https://builds.apache.org/job/HBase-0.92/ws/trunk/target/surefire/surefire475951240661256197tmp>
<https://builds.apache.org/job/HBase-0.92/ws/trunk/target/surefire/surefire737684986677510791tmp>
Running org.apache.hadoop.hbase.coprocessor.TestMasterCoprocessorExceptionWithRemove
Tests run: 1, Failures: 0, Errors: 0, Skipped: 0, Time elapsed: 22.056 sec
Forking command line: /bin/sh -c cd <https://builds.apache.org/job/HBase-0.92/ws/trunk>
&& /home/jenkins/tools/java/jdk1.6.0_27-32/jre/bin/java -enableassertions -Xmx1400m
-Djava.security.egd=file:/dev/./urandom -jar <https://builds.apache.org/job/HBase-0.92/ws/trunk/target/surefire/surefirebooter7001959594795201017.jar>
<https://builds.apache.org/job/HBase-0.92/ws/trunk/target/surefire/surefire2044477674471623564tmp>
<https://builds.apache.org/job/HBase-0.92/ws/trunk/target/surefire/surefire5677061520167294105tmp>
Running org.apache.hadoop.hbase.coprocessor.TestRegionObserverStacking
Tests run: 1, Failures: 0, Errors: 0, Skipped: 0, Time elapsed: 0.845 sec
Forking command line: /bin/sh -c cd <https://builds.apache.org/job/HBase-0.92/ws/trunk>
&& /home/jenkins/tools/java/jdk1.6.0_27-32/jre/bin/java -enableassertions -Xmx1400m
-Djava.security.egd=file:/dev/./urandom -jar <https://builds.apache.org/job/HBase-0.92/ws/trunk/target/surefire/surefirebooter1074053365610388758.jar>
<https://builds.apache.org/job/HBase-0.92/ws/trunk/target/surefire/surefire6625030846739296567tmp>
<https://builds.apache.org/job/HBase-0.92/ws/trunk/target/surefire/surefire9106667549689462730tmp>
Running org.apache.hadoop.hbase.coprocessor.TestClassLoading
Tests run: 5, Failures: 0, Errors: 0, Skipped: 0, Time elapsed: 33.506 sec
Forking command line: /bin/sh -c cd <https://builds.apache.org/job/HBase-0.92/ws/trunk>
&& /home/jenkins/tools/java/jdk1.6.0_27-32/jre/bin/java -enableassertions -Xmx1400m
-Djava.security.egd=file:/dev/./urandom -jar <https://builds.apache.org/job/HBase-0.92/ws/trunk/target/surefire/surefirebooter9001135065679202737.jar>
<https://builds.apache.org/job/HBase-0.92/ws/trunk/target/surefire/surefire3102327012628565548tmp>
<https://builds.apache.org/job/HBase-0.92/ws/trunk/target/surefire/surefire2330219269944265593tmp>
Running org.apache.hadoop.hbase.mapred.TestTableMapReduce
Tests run: 1, Failures: 0, Errors: 0, Skipped: 0, Time elapsed: 67.639 sec
Forking command line: /bin/sh -c cd <https://builds.apache.org/job/HBase-0.92/ws/trunk>
&& /home/jenkins/tools/java/jdk1.6.0_27-32/jre/bin/java -enableassertions -Xmx1400m
-Djava.security.egd=file:/dev/./urandom -jar <https://builds.apache.org/job/HBase-0.92/ws/trunk/target/surefire/surefirebooter8850213320625831946.jar>
<https://builds.apache.org/job/HBase-0.92/ws/trunk/target/surefire/surefire8648713944916224766tmp>
<https://builds.apache.org/job/HBase-0.92/ws/trunk/target/surefire/surefire1531191733215488242tmp>
Running org.apache.hadoop.hbase.mapred.TestTableInputFormat
Tests run: 6, Failures: 0, Errors: 0, Skipped: 0, Time elapsed: 29.383 sec
Forking command line: /bin/sh -c cd <https://builds.apache.org/job/HBase-0.92/ws/trunk>
&& /home/jenkins/tools/java/jdk1.6.0_27-32/jre/bin/java -enableassertions -Xmx1400m
-Djava.security.egd=file:/dev/./urandom -jar <https://builds.apache.org/job/HBase-0.92/ws/trunk/target/surefire/surefirebooter4072945053075602990.jar>
<https://builds.apache.org/job/HBase-0.92/ws/trunk/target/surefire/surefire6990411906457609310tmp>
<https://builds.apache.org/job/HBase-0.92/ws/trunk/target/surefire/surefire20755542174166705tmp>
Running org.apache.hadoop.hbase.TestServerName
Tests run: 4, Failures: 0, Errors: 0, Skipped: 0, Time elapsed: 0.14 sec
Forking command line: /bin/sh -c cd <https://builds.apache.org/job/HBase-0.92/ws/trunk>
&& /home/jenkins/tools/java/jdk1.6.0_27-32/jre/bin/java -enableassertions -Xmx1400m
-Djava.security.egd=file:/dev/./urandom -jar <https://builds.apache.org/job/HBase-0.92/ws/trunk/target/surefire/surefirebooter2766029243997032175.jar>
<https://builds.apache.org/job/HBase-0.92/ws/trunk/target/surefire/surefire8567642924520207946tmp>
<https://builds.apache.org/job/HBase-0.92/ws/trunk/target/surefire/surefire327405979780767104tmp>
Running org.apache.hadoop.hbase.master.TestOpenedRegionHandler
Tests run: 2, Failures: 0, Errors: 0, Skipped: 0, Time elapsed: 23.997 sec
Forking command line: /bin/sh -c cd <https://builds.apache.org/job/HBase-0.92/ws/trunk>
&& /home/jenkins/tools/java/jdk1.6.0_27-32/jre/bin/java -enableassertions -Xmx1400m
-Djava.security.egd=file:/dev/./urandom -jar <https://builds.apache.org/job/HBase-0.92/ws/trunk/target/surefire/surefirebooter5260399196418396329.jar>
<https://builds.apache.org/job/HBase-0.92/ws/trunk/target/surefire/surefire2771667501374236474tmp>
<https://builds.apache.org/job/HBase-0.92/ws/trunk/target/surefire/surefire6083456361591695834tmp>
Running org.apache.hadoop.hbase.master.TestActiveMasterManager
Tests run: 2, Failures: 0, Errors: 0, Skipped: 0, Time elapsed: 0.931 sec
Forking command line: /bin/sh -c cd <https://builds.apache.org/job/HBase-0.92/ws/trunk>
&& /home/jenkins/tools/java/jdk1.6.0_27-32/jre/bin/java -enableassertions -Xmx1400m
-Djava.security.egd=file:/dev/./urandom -jar <https://builds.apache.org/job/HBase-0.92/ws/trunk/target/surefire/surefirebooter9039038075487106295.jar>
<https://builds.apache.org/job/HBase-0.92/ws/trunk/target/surefire/surefire606856698672149750tmp>
<https://builds.apache.org/job/HBase-0.92/ws/trunk/target/surefire/surefire819104786797739572tmp>
Running org.apache.hadoop.hbase.master.TestMasterFailover
Tests run: 4, Failures: 0, Errors: 0, Skipped: 0, Time elapsed: 81.831 sec
Forking command line: /bin/sh -c cd <https://builds.apache.org/job/HBase-0.92/ws/trunk>
&& /home/jenkins/tools/java/jdk1.6.0_27-32/jre/bin/java -enableassertions -Xmx1400m
-Djava.security.egd=file:/dev/./urandom -jar <https://builds.apache.org/job/HBase-0.92/ws/trunk/target/surefire/surefirebooter1687689993118983649.jar>
<https://builds.apache.org/job/HBase-0.92/ws/trunk/target/surefire/surefire7953988414265449204tmp>
<https://builds.apache.org/job/HBase-0.92/ws/trunk/target/surefire/surefire5470783973650744323tmp>
Running org.apache.hadoop.hbase.master.TestMasterRestartAfterDisablingTable
Tests run: 1, Failures: 0, Errors: 0, Skipped: 0, Time elapsed: 27.556 sec
Forking command line: /bin/sh -c cd <https://builds.apache.org/job/HBase-0.92/ws/trunk>
&& /home/jenkins/tools/java/jdk1.6.0_27-32/jre/bin/java -enableassertions -Xmx1400m
-Djava.security.egd=file:/dev/./urandom -jar <https://builds.apache.org/job/HBase-0.92/ws/trunk/target/surefire/surefirebooter3528772037287706782.jar>
<https://builds.apache.org/job/HBase-0.92/ws/trunk/target/surefire/surefire1531357004978855832tmp>
<https://builds.apache.org/job/HBase-0.92/ws/trunk/target/surefire/surefire8912367476538424998tmp>
Running org.apache.hadoop.hbase.master.TestCatalogJanitor
Tests run: 4, Failures: 0, Errors: 0, Skipped: 0, Time elapsed: 7.445 sec
Forking command line: /bin/sh -c cd <https://builds.apache.org/job/HBase-0.92/ws/trunk>
&& /home/jenkins/tools/java/jdk1.6.0_27-32/jre/bin/java -enableassertions -Xmx1400m
-Djava.security.egd=file:/dev/./urandom -jar <https://builds.apache.org/job/HBase-0.92/ws/trunk/target/surefire/surefirebooter3636131663800045662.jar>
<https://builds.apache.org/job/HBase-0.92/ws/trunk/target/surefire/surefire255899825129714974tmp>
<https://builds.apache.org/job/HBase-0.92/ws/trunk/target/surefire/surefire7085780827439228979tmp>
Running org.apache.hadoop.hbase.master.TestRollingRestart
Tests run: 1, Failures: 0, Errors: 0, Skipped: 0, Time elapsed: 69.45 sec
Forking command line: /bin/sh -c cd <https://builds.apache.org/job/HBase-0.92/ws/trunk>
&& /home/jenkins/tools/java/jdk1.6.0_27-32/jre/bin/java -enableassertions -Xmx1400m
-Djava.security.egd=file:/dev/./urandom -jar <https://builds.apache.org/job/HBase-0.92/ws/trunk/target/surefire/surefirebooter2122227574138749776.jar>
<https://builds.apache.org/job/HBase-0.92/ws/trunk/target/surefire/surefire2063414931720668869tmp>
<https://builds.apache.org/job/HBase-0.92/ws/trunk/target/surefire/surefire3626790754485101338tmp>
Running org.apache.hadoop.hbase.master.TestMasterTransitions
Tests run: 3, Failures: 0, Errors: 0, Skipped: 3, Time elapsed: 23.795 sec
Forking command line: /bin/sh -c cd <https://builds.apache.org/job/HBase-0.92/ws/trunk>
&& /home/jenkins/tools/java/jdk1.6.0_27-32/jre/bin/java -enableassertions -Xmx1400m
-Djava.security.egd=file:/dev/./urandom -jar <https://builds.apache.org/job/HBase-0.92/ws/trunk/target/surefire/surefirebooter7388774811722383504.jar>
<https://builds.apache.org/job/HBase-0.92/ws/trunk/target/surefire/surefire8742897640693460283tmp>
<https://builds.apache.org/job/HBase-0.92/ws/trunk/target/surefire/surefire4713599561657010776tmp>
Running org.apache.hadoop.hbase.master.TestRestartCluster
Tests run: 2, Failures: 0, Errors: 0, Skipped: 0, Time elapsed: 47.457 sec
Forking command line: /bin/sh -c cd <https://builds.apache.org/job/HBase-0.92/ws/trunk>
&& /home/jenkins/tools/java/jdk1.6.0_27-32/jre/bin/java -enableassertions -Xmx1400m
-Djava.security.egd=file:/dev/./urandom -jar <https://builds.apache.org/job/HBase-0.92/ws/trunk/target/surefire/surefirebooter3182337147510727212.jar>
<https://builds.apache.org/job/HBase-0.92/ws/trunk/target/surefire/surefire6370277797362211380tmp>
<https://builds.apache.org/job/HBase-0.92/ws/trunk/target/surefire/surefire1129378447753739413tmp>
Running org.apache.hadoop.hbase.master.TestMasterStatusServlet
Tests run: 5, Failures: 0, Errors: 0, Skipped: 0, Time elapsed: 1.04 sec
Forking command line: /bin/sh -c cd <https://builds.apache.org/job/HBase-0.92/ws/trunk>
&& /home/jenkins/tools/java/jdk1.6.0_27-32/jre/bin/java -enableassertions -Xmx1400m
-Djava.security.egd=file:/dev/./urandom -jar <https://builds.apache.org/job/HBase-0.92/ws/trunk/target/surefire/surefirebooter3473093808794447993.jar>
<https://builds.apache.org/job/HBase-0.92/ws/trunk/target/surefire/surefire7443112181292798619tmp>
<https://builds.apache.org/job/HBase-0.92/ws/trunk/target/surefire/surefire2408015275920194065tmp>
Running org.apache.hadoop.hbase.master.TestClockSkewDetection
Tests run: 1, Failures: 0, Errors: 0, Skipped: 0, Time elapsed: 0.248 sec
Forking command line: /bin/sh -c cd <https://builds.apache.org/job/HBase-0.92/ws/trunk>
&& /home/jenkins/tools/java/jdk1.6.0_27-32/jre/bin/java -enableassertions -Xmx1400m
-Djava.security.egd=file:/dev/./urandom -jar <https://builds.apache.org/job/HBase-0.92/ws/trunk/target/surefire/surefirebooter3003004561435058040.jar>
<https://builds.apache.org/job/HBase-0.92/ws/trunk/target/surefire/surefire2486926448477419357tmp>
<https://builds.apache.org/job/HBase-0.92/ws/trunk/target/surefire/surefire2016193046089836675tmp>
Running org.apache.hadoop.hbase.master.TestDefaultLoadBalancer
Tests run: 4, Failures: 0, Errors: 0, Skipped: 0, Time elapsed: 1.455 sec
Forking command line: /bin/sh -c cd <https://builds.apache.org/job/HBase-0.92/ws/trunk>
&& /home/jenkins/tools/java/jdk1.6.0_27-32/jre/bin/java -enableassertions -Xmx1400m
-Djava.security.egd=file:/dev/./urandom -jar <https://builds.apache.org/job/HBase-0.92/ws/trunk/target/surefire/surefirebooter4150147886011934468.jar>
<https://builds.apache.org/job/HBase-0.92/ws/trunk/target/surefire/surefire4485140660444900686tmp>
<https://builds.apache.org/job/HBase-0.92/ws/trunk/target/surefire/surefire4231213896146796025tmp>
Running org.apache.hadoop.hbase.master.TestHMasterRPCException
Tests run: 1, Failures: 0, Errors: 0, Skipped: 0, Time elapsed: 1.377 sec
Forking command line: /bin/sh -c cd <https://builds.apache.org/job/HBase-0.92/ws/trunk>
&& /home/jenkins/tools/java/jdk1.6.0_27-32/jre/bin/java -enableassertions -Xmx1400m
-Djava.security.egd=file:/dev/./urandom -jar <https://builds.apache.org/job/HBase-0.92/ws/trunk/target/surefire/surefirebooter3579176133114409085.jar>
<https://builds.apache.org/job/HBase-0.92/ws/trunk/target/surefire/surefire8776716219085231998tmp>
<https://builds.apache.org/job/HBase-0.92/ws/trunk/target/surefire/surefire3173343093169546850tmp>
Running org.apache.hadoop.hbase.master.TestDistributedLogSplitting
Tests run: 4, Failures: 0, Errors: 0, Skipped: 0, Time elapsed: 114.384 sec
Forking command line: /bin/sh -c cd <https://builds.apache.org/job/HBase-0.92/ws/trunk>
&& /home/jenkins/tools/java/jdk1.6.0_27-32/jre/bin/java -enableassertions -Xmx1400m
-Djava.security.egd=file:/dev/./urandom -jar <https://builds.apache.org/job/HBase-0.92/ws/trunk/target/surefire/surefirebooter5244594616502840722.jar>
<https://builds.apache.org/job/HBase-0.92/ws/trunk/target/surefire/surefire8123173045290438928tmp>
<https://builds.apache.org/job/HBase-0.92/ws/trunk/target/surefire/surefire5890422745067455740tmp>
Running org.apache.hadoop.hbase.master.TestMXBean
Tests run: 1, Failures: 0, Errors: 0, Skipped: 0, Time elapsed: 20.703 sec
Forking command line: /bin/sh -c cd <https://builds.apache.org/job/HBase-0.92/ws/trunk>
&& /home/jenkins/tools/java/jdk1.6.0_27-32/jre/bin/java -enableassertions -Xmx1400m
-Djava.security.egd=file:/dev/./urandom -jar <https://builds.apache.org/job/HBase-0.92/ws/trunk/target/surefire/surefirebooter8963313514843630241.jar>
<https://builds.apache.org/job/HBase-0.92/ws/trunk/target/surefire/surefire3715529994296639624tmp>
<https://builds.apache.org/job/HBase-0.92/ws/trunk/target/surefire/surefire5344702465955665752tmp>
Running org.apache.hadoop.hbase.master.TestMaster
Tests run: 1, Failures: 0, Errors: 0, Skipped: 0, Time elapsed: 18.713 sec
Forking command line: /bin/sh -c cd <https://builds.apache.org/job/HBase-0.92/ws/trunk>
&& /home/jenkins/tools/java/jdk1.6.0_27-32/jre/bin/java -enableassertions -Xmx1400m
-Djava.security.egd=file:/dev/./urandom -jar <https://builds.apache.org/job/HBase-0.92/ws/trunk/target/surefire/surefirebooter6956652448737952018.jar>
<https://builds.apache.org/job/HBase-0.92/ws/trunk/target/surefire/surefire1185622798515784437tmp>
<https://builds.apache.org/job/HBase-0.92/ws/trunk/target/surefire/surefire8342318860413011726tmp>
Running org.apache.hadoop.hbase.master.TestSplitLogManager
Tests run: 12, Failures: 0, Errors: 0, Skipped: 0, Time elapsed: 14.359 sec
Forking command line: /bin/sh -c cd <https://builds.apache.org/job/HBase-0.92/ws/trunk>
&& /home/jenkins/tools/java/jdk1.6.0_27-32/jre/bin/java -enableassertions -Xmx1400m
-Djava.security.egd=file:/dev/./urandom -jar <https://builds.apache.org/job/HBase-0.92/ws/trunk/target/surefire/surefirebooter6339768882913969740.jar>
<https://builds.apache.org/job/HBase-0.92/ws/trunk/target/surefire/surefire5038074927184265482tmp>
<https://builds.apache.org/job/HBase-0.92/ws/trunk/target/surefire/surefire8047285447992459707tmp>
Running org.apache.hadoop.hbase.master.TestDeadServer
Tests run: 1, Failures: 0, Errors: 0, Skipped: 0, Time elapsed: 0.136 sec
Forking command line: /bin/sh -c cd <https://builds.apache.org/job/HBase-0.92/ws/trunk>
&& /home/jenkins/tools/java/jdk1.6.0_27-32/jre/bin/java -enableassertions -Xmx1400m
-Djava.security.egd=file:/dev/./urandom -jar <https://builds.apache.org/job/HBase-0.92/ws/trunk/target/surefire/surefirebooter1777894516575332223.jar>
<https://builds.apache.org/job/HBase-0.92/ws/trunk/target/surefire/surefire5139169641209738799tmp>
<https://builds.apache.org/job/HBase-0.92/ws/trunk/target/surefire/surefire6490552851349998186tmp>
Running org.apache.hadoop.hbase.master.TestLogsCleaner
Tests run: 1, Failures: 0, Errors: 0, Skipped: 0, Time elapsed: 3.176 sec
Forking command line: /bin/sh -c cd <https://builds.apache.org/job/HBase-0.92/ws/trunk>
&& /home/jenkins/tools/java/jdk1.6.0_27-32/jre/bin/java -enableassertions -Xmx1400m
-Djava.security.egd=file:/dev/./urandom -jar <https://builds.apache.org/job/HBase-0.92/ws/trunk/target/surefire/surefirebooter7478684523356080404.jar>
<https://builds.apache.org/job/HBase-0.92/ws/trunk/target/surefire/surefire371694736786147724tmp>
<https://builds.apache.org/job/HBase-0.92/ws/trunk/target/surefire/surefire6772373767377057474tmp>
Running org.apache.hadoop.hbase.master.TestMasterZKSessionRecovery
Tests run: 2, Failures: 0, Errors: 0, Skipped: 0, Time elapsed: 29.57 sec
Forking command line: /bin/sh -c cd <https://builds.apache.org/job/HBase-0.92/ws/trunk>
&& /home/jenkins/tools/java/jdk1.6.0_27-32/jre/bin/java -enableassertions -Xmx1400m
-Djava.security.egd=file:/dev/./urandom -jar <https://builds.apache.org/job/HBase-0.92/ws/trunk/target/surefire/surefirebooter3636452875441595389.jar>
<https://builds.apache.org/job/HBase-0.92/ws/trunk/target/surefire/surefire9207838816024214510tmp>
<https://builds.apache.org/job/HBase-0.92/ws/trunk/target/surefire/surefire8557590172284070455tmp>
Running org.apache.hadoop.hbase.master.TestZKBasedOpenCloseRegion
Tests run: 3, Failures: 0, Errors: 0, Skipped: 0, Time elapsed: 26.123 sec

Results :

Tests run: 1083, Failures: 0, Errors: 0, Skipped: 8

[INFO] ------------------------------------------------------------------------
[INFO] BUILD FAILURE
[INFO] ------------------------------------------------------------------------
[INFO] Total time: 2:09:07.347s
[INFO] Finished at: Mon Mar 19 07:17:12 UTC 2012
[INFO] Final Memory: 52M/730M
[INFO] ------------------------------------------------------------------------
[ERROR] Failed to execute goal org.apache.maven.plugins:maven-surefire-plugin:2.10:test (default-test)
on project hbase: Failure or timeout -> [Help 1]
org.apache.maven.lifecycle.LifecycleExecutionException: Failed to execute goal org.apache.maven.plugins:maven-surefire-plugin:2.10:test
(default-test) on project hbase: Failure or timeout
	at org.apache.maven.lifecycle.internal.MojoExecutor.execute(MojoExecutor.java:217)
	at org.apache.maven.lifecycle.internal.MojoExecutor.execute(MojoExecutor.java:153)
	at org.apache.maven.lifecycle.internal.MojoExecutor.execute(MojoExecutor.java:145)
	at org.apache.maven.lifecycle.internal.LifecycleModuleBuilder.buildProject(LifecycleModuleBuilder.java:84)
	at org.apache.maven.lifecycle.internal.LifecycleModuleBuilder.buildProject(LifecycleModuleBuilder.java:59)
	at org.apache.maven.lifecycle.internal.LifecycleStarter.singleThreadedBuild(LifecycleStarter.java:183)
	at org.apache.maven.lifecycle.internal.LifecycleStarter.execute(LifecycleStarter.java:161)
	at org.apache.maven.DefaultMaven.doExecute(DefaultMaven.java:319)
	at org.apache.maven.DefaultMaven.execute(DefaultMaven.java:156)
	at org.apache.maven.cli.MavenCli.execute(MavenCli.java:537)
	at org.apache.maven.cli.MavenCli.doMain(MavenCli.java:196)
	at org.apache.maven.cli.MavenCli.main(MavenCli.java:141)
	at sun.reflect.NativeMethodAccessorImpl.invoke0(Native Method)
	at sun.reflect.NativeMethodAccessorImpl.invoke(NativeMethodAccessorImpl.java:39)
	at sun.reflect.DelegatingMethodAccessorImpl.invoke(DelegatingMethodAccessorImpl.java:25)
	at java.lang.reflect.Method.invoke(Method.java:597)
	at org.codehaus.plexus.classworlds.launcher.Launcher.launchEnhanced(Launcher.java:290)
	at org.codehaus.plexus.classworlds.launcher.Launcher.launch(Launcher.java:230)
	at org.codehaus.plexus.classworlds.launcher.Launcher.mainWithExitCode(Launcher.java:409)
	at org.codehaus.plexus.classworlds.launcher.Launcher.main(Launcher.java:352)
Caused by: org.apache.maven.plugin.MojoExecutionException: Failure or timeout
	at org.apache.maven.plugin.surefire.SurefirePlugin.assertNoFailureOrTimeout(SurefirePlugin.java:633)
	at org.apache.maven.plugin.surefire.SurefirePlugin.handleSummary(SurefirePlugin.java:614)
	at org.apache.maven.plugin.surefire.AbstractSurefireMojo.executeAfterPreconditionsChecked(AbstractSurefireMojo.java:137)
	at org.apache.maven.plugin.surefire.AbstractSurefireMojo.execute(AbstractSurefireMojo.java:98)
	at org.apache.maven.plugin.DefaultBuildPluginManager.executeMojo(DefaultBuildPluginManager.java:101)
	at org.apache.maven.lifecycle.internal.MojoExecutor.execute(MojoExecutor.java:209)
	... 19 more
[ERROR] 
[ERROR] 
[ERROR] For more information about the errors and possible solutions, please read the following
articles:
[ERROR] [Help 1] http://cwiki.apache.org/confluence/display/MAVEN/MojoExecutionException
Build step 'Invoke top-level Maven targets' marked build as failure
Archiving artifacts
Updating HBASE-5568
Recording test results

Mime
View raw message