hbase-dev mailing list archives

Site index · List index
Message view « Date » · « Thread »
Top « Date » · « Thread »
From Apache Jenkins Server <jenk...@builds.apache.org>
Subject Build failed in Jenkins: HBase-0.94 #26
Date Mon, 12 Mar 2012 21:40:10 GMT
See <https://builds.apache.org/job/HBase-0.94/26/changes>

Changes:

[larsh] Fixups to MultithreadedTableMapper for Hadoop 0.23.2+ (Andrew)

[stack] HBASE-5562 test-patch.sh reports a javadoc warning when there are no new javadoc warnings

------------------------------------------
[...truncated 7085 lines...]
Tests run: 5, Failures: 0, Errors: 0, Skipped: 0, Time elapsed: 16.227 sec
Forking command line: /bin/sh -c cd /x1/jenkins/jenkins-slave/workspace/HBase-0.94/trunk &&
/x1/jenkins/tools/java/jdk1.6.0_27-32/jre/bin/java -enableassertions -Xmx1900m -Djava.security.egd=file:/dev/./urandom
-jar /x1/jenkins/jenkins-slave/workspace/HBase-0.94/trunk/target/surefire/surefirebooter1994426993656333681.jar
/x1/jenkins/jenkins-slave/workspace/HBase-0.94/trunk/target/surefire/surefire3149990694296744498tmp
/x1/jenkins/jenkins-slave/workspace/HBase-0.94/trunk/target/surefire/surefire_562227167874620883817tmp
Running org.apache.hadoop.hbase.regionserver.TestFSErrorsExposed
Tests run: 3, Failures: 0, Errors: 0, Skipped: 0, Time elapsed: 26.199 sec
Forking command line: /bin/sh -c cd /x1/jenkins/jenkins-slave/workspace/HBase-0.94/trunk &&
/x1/jenkins/tools/java/jdk1.6.0_27-32/jre/bin/java -enableassertions -Xmx1900m -Djava.security.egd=file:/dev/./urandom
-jar /x1/jenkins/jenkins-slave/workspace/HBase-0.94/trunk/target/surefire/surefirebooter6919408257752299734.jar
/x1/jenkins/jenkins-slave/workspace/HBase-0.94/trunk/target/surefire/surefire2542745836486645621tmp
/x1/jenkins/jenkins-slave/workspace/HBase-0.94/trunk/target/surefire/surefire_573835677995819156146tmp
Running org.apache.hadoop.hbase.regionserver.TestServerCustomProtocol
Tests run: 7, Failures: 0, Errors: 0, Skipped: 0, Time elapsed: 14.04 sec
Forking command line: /bin/sh -c cd /x1/jenkins/jenkins-slave/workspace/HBase-0.94/trunk &&
/x1/jenkins/tools/java/jdk1.6.0_27-32/jre/bin/java -enableassertions -Xmx1900m -Djava.security.egd=file:/dev/./urandom
-jar /x1/jenkins/jenkins-slave/workspace/HBase-0.94/trunk/target/surefire/surefirebooter3891639913633006728.jar
/x1/jenkins/jenkins-slave/workspace/HBase-0.94/trunk/target/surefire/surefire3567097758865163932tmp
/x1/jenkins/jenkins-slave/workspace/HBase-0.94/trunk/target/surefire/surefire_582778558902750682078tmp
Running org.apache.hadoop.hbase.regionserver.TestParallelPut
Tests run: 2, Failures: 0, Errors: 0, Skipped: 0, Time elapsed: 2.851 sec
Forking command line: /bin/sh -c cd /x1/jenkins/jenkins-slave/workspace/HBase-0.94/trunk &&
/x1/jenkins/tools/java/jdk1.6.0_27-32/jre/bin/java -enableassertions -Xmx1900m -Djava.security.egd=file:/dev/./urandom
-jar /x1/jenkins/jenkins-slave/workspace/HBase-0.94/trunk/target/surefire/surefirebooter4676283982811383587.jar
/x1/jenkins/jenkins-slave/workspace/HBase-0.94/trunk/target/surefire/surefire1577203349550369311tmp
/x1/jenkins/jenkins-slave/workspace/HBase-0.94/trunk/target/surefire/surefire_592930788776396547901tmp
Running org.apache.hadoop.hbase.regionserver.TestRpcMetrics
Tests run: 1, Failures: 0, Errors: 0, Skipped: 0, Time elapsed: 2.153 sec
Forking command line: /bin/sh -c cd /x1/jenkins/jenkins-slave/workspace/HBase-0.94/trunk &&
/x1/jenkins/tools/java/jdk1.6.0_27-32/jre/bin/java -enableassertions -Xmx1900m -Djava.security.egd=file:/dev/./urandom
-jar /x1/jenkins/jenkins-slave/workspace/HBase-0.94/trunk/target/surefire/surefirebooter5978569909480794548.jar
/x1/jenkins/jenkins-slave/workspace/HBase-0.94/trunk/target/surefire/surefire7402237340025680965tmp
/x1/jenkins/jenkins-slave/workspace/HBase-0.94/trunk/target/surefire/surefire_60562334727782463270tmp
Running org.apache.hadoop.hbase.regionserver.TestSeekOptimizations
Tests run: 6, Failures: 0, Errors: 0, Skipped: 0, Time elapsed: 2.316 sec
Forking command line: /bin/sh -c cd /x1/jenkins/jenkins-slave/workspace/HBase-0.94/trunk &&
/x1/jenkins/tools/java/jdk1.6.0_27-32/jre/bin/java -enableassertions -Xmx1900m -Djava.security.egd=file:/dev/./urandom
-jar /x1/jenkins/jenkins-slave/workspace/HBase-0.94/trunk/target/surefire/surefirebooter7777085442419223035.jar
/x1/jenkins/jenkins-slave/workspace/HBase-0.94/trunk/target/surefire/surefire5063018348274201068tmp
/x1/jenkins/jenkins-slave/workspace/HBase-0.94/trunk/target/surefire/surefire_618788281725569854009tmp
Running org.apache.hadoop.hbase.regionserver.handler.TestCloseRegionHandler
Tests run: 3, Failures: 0, Errors: 0, Skipped: 0, Time elapsed: 1.164 sec
Forking command line: /bin/sh -c cd /x1/jenkins/jenkins-slave/workspace/HBase-0.94/trunk &&
/x1/jenkins/tools/java/jdk1.6.0_27-32/jre/bin/java -enableassertions -Xmx1900m -Djava.security.egd=file:/dev/./urandom
-jar /x1/jenkins/jenkins-slave/workspace/HBase-0.94/trunk/target/surefire/surefirebooter8099375932492219299.jar
/x1/jenkins/jenkins-slave/workspace/HBase-0.94/trunk/target/surefire/surefire4279664770411973936tmp
/x1/jenkins/jenkins-slave/workspace/HBase-0.94/trunk/target/surefire/surefire_627237630471630906594tmp
Running org.apache.hadoop.hbase.regionserver.handler.TestOpenRegionHandler
Tests run: 3, Failures: 0, Errors: 0, Skipped: 0, Time elapsed: 0.941 sec
Forking command line: /bin/sh -c cd /x1/jenkins/jenkins-slave/workspace/HBase-0.94/trunk &&
/x1/jenkins/tools/java/jdk1.6.0_27-32/jre/bin/java -enableassertions -Xmx1900m -Djava.security.egd=file:/dev/./urandom
-jar /x1/jenkins/jenkins-slave/workspace/HBase-0.94/trunk/target/surefire/surefirebooter9014731670157962357.jar
/x1/jenkins/jenkins-slave/workspace/HBase-0.94/trunk/target/surefire/surefire2947930854909604035tmp
/x1/jenkins/jenkins-slave/workspace/HBase-0.94/trunk/target/surefire/surefire_632752837093338364037tmp
Running org.apache.hadoop.hbase.regionserver.TestBlocksRead
Tests run: 4, Failures: 0, Errors: 0, Skipped: 0, Time elapsed: 0.716 sec
Forking command line: /bin/sh -c cd /x1/jenkins/jenkins-slave/workspace/HBase-0.94/trunk &&
/x1/jenkins/tools/java/jdk1.6.0_27-32/jre/bin/java -enableassertions -Xmx1900m -Djava.security.egd=file:/dev/./urandom
-jar /x1/jenkins/jenkins-slave/workspace/HBase-0.94/trunk/target/surefire/surefirebooter267999621819713042.jar
/x1/jenkins/jenkins-slave/workspace/HBase-0.94/trunk/target/surefire/surefire6584818884450940885tmp
/x1/jenkins/jenkins-slave/workspace/HBase-0.94/trunk/target/surefire/surefire_644358972628477597677tmp
Running org.apache.hadoop.hbase.regionserver.TestSplitLogWorker
Tests run: 5, Failures: 0, Errors: 0, Skipped: 0, Time elapsed: 2.145 sec
Forking command line: /bin/sh -c cd /x1/jenkins/jenkins-slave/workspace/HBase-0.94/trunk &&
/x1/jenkins/tools/java/jdk1.6.0_27-32/jre/bin/java -enableassertions -Xmx1900m -Djava.security.egd=file:/dev/./urandom
-jar /x1/jenkins/jenkins-slave/workspace/HBase-0.94/trunk/target/surefire/surefirebooter6894895225880662129.jar
/x1/jenkins/jenkins-slave/workspace/HBase-0.94/trunk/target/surefire/surefire1220570403042297475tmp
/x1/jenkins/jenkins-slave/workspace/HBase-0.94/trunk/target/surefire/surefire_651936807028795955666tmp
Running org.apache.hadoop.hbase.regionserver.TestStoreScanner
Tests run: 16, Failures: 0, Errors: 0, Skipped: 0, Time elapsed: 0.081 sec
Forking command line: /bin/sh -c cd /x1/jenkins/jenkins-slave/workspace/HBase-0.94/trunk &&
/x1/jenkins/tools/java/jdk1.6.0_27-32/jre/bin/java -enableassertions -Xmx1900m -Djava.security.egd=file:/dev/./urandom
-jar /x1/jenkins/jenkins-slave/workspace/HBase-0.94/trunk/target/surefire/surefirebooter4043766087720135672.jar
/x1/jenkins/jenkins-slave/workspace/HBase-0.94/trunk/target/surefire/surefire5675989701117836493tmp
/x1/jenkins/jenkins-slave/workspace/HBase-0.94/trunk/target/surefire/surefire_668372473371064347881tmp
Running org.apache.hadoop.hbase.regionserver.metrics.TestSchemaMetrics
Tests run: 6, Failures: 0, Errors: 0, Skipped: 0, Time elapsed: 10.998 sec
Forking command line: /bin/sh -c cd /x1/jenkins/jenkins-slave/workspace/HBase-0.94/trunk &&
/x1/jenkins/tools/java/jdk1.6.0_27-32/jre/bin/java -enableassertions -Xmx1900m -Djava.security.egd=file:/dev/./urandom
-jar /x1/jenkins/jenkins-slave/workspace/HBase-0.94/trunk/target/surefire/surefirebooter5943872007945241942.jar
/x1/jenkins/jenkins-slave/workspace/HBase-0.94/trunk/target/surefire/surefire3967028114788513145tmp
/x1/jenkins/jenkins-slave/workspace/HBase-0.94/trunk/target/surefire/surefire_672141343962774978298tmp
Running org.apache.hadoop.hbase.regionserver.TestStoreFileBlockCacheSummary
Tests run: 1, Failures: 0, Errors: 0, Skipped: 0, Time elapsed: 13.422 sec
Forking command line: /bin/sh -c cd /x1/jenkins/jenkins-slave/workspace/HBase-0.94/trunk &&
/x1/jenkins/tools/java/jdk1.6.0_27-32/jre/bin/java -enableassertions -Xmx1900m -Djava.security.egd=file:/dev/./urandom
-jar /x1/jenkins/jenkins-slave/workspace/HBase-0.94/trunk/target/surefire/surefirebooter6167936188446679957.jar
/x1/jenkins/jenkins-slave/workspace/HBase-0.94/trunk/target/surefire/surefire254633339492106008tmp
/x1/jenkins/jenkins-slave/workspace/HBase-0.94/trunk/target/surefire/surefire_682170146105790422290tmp
Running org.apache.hadoop.hbase.regionserver.TestMultiColumnScanner
Tests run: 12, Failures: 0, Errors: 0, Skipped: 0, Time elapsed: 27.808 sec
Forking command line: /bin/sh -c cd /x1/jenkins/jenkins-slave/workspace/HBase-0.94/trunk &&
/x1/jenkins/tools/java/jdk1.6.0_27-32/jre/bin/java -enableassertions -Xmx1900m -Djava.security.egd=file:/dev/./urandom
-jar /x1/jenkins/jenkins-slave/workspace/HBase-0.94/trunk/target/surefire/surefirebooter7151825169365703145.jar
/x1/jenkins/jenkins-slave/workspace/HBase-0.94/trunk/target/surefire/surefire8379930354266245947tmp
/x1/jenkins/jenkins-slave/workspace/HBase-0.94/trunk/target/surefire/surefire_692246538044758415729tmp
Running org.apache.hadoop.hbase.regionserver.TestMasterAddressManager
Tests run: 1, Failures: 0, Errors: 0, Skipped: 0, Time elapsed: 0.54 sec
Forking command line: /bin/sh -c cd /x1/jenkins/jenkins-slave/workspace/HBase-0.94/trunk &&
/x1/jenkins/tools/java/jdk1.6.0_27-32/jre/bin/java -enableassertions -Xmx1900m -Djava.security.egd=file:/dev/./urandom
-jar /x1/jenkins/jenkins-slave/workspace/HBase-0.94/trunk/target/surefire/surefirebooter923889315269664185.jar
/x1/jenkins/jenkins-slave/workspace/HBase-0.94/trunk/target/surefire/surefire9011879145693039667tmp
/x1/jenkins/jenkins-slave/workspace/HBase-0.94/trunk/target/surefire/surefire_707096593282719681968tmp
Running org.apache.hadoop.hbase.regionserver.TestHRegion
Tests run: 61, Failures: 0, Errors: 0, Skipped: 0, Time elapsed: 21.452 sec
Forking command line: /bin/sh -c cd /x1/jenkins/jenkins-slave/workspace/HBase-0.94/trunk &&
/x1/jenkins/tools/java/jdk1.6.0_27-32/jre/bin/java -enableassertions -Xmx1900m -Djava.security.egd=file:/dev/./urandom
-jar /x1/jenkins/jenkins-slave/workspace/HBase-0.94/trunk/target/surefire/surefirebooter1813298806614854268.jar
/x1/jenkins/jenkins-slave/workspace/HBase-0.94/trunk/target/surefire/surefire741379976669132607tmp
/x1/jenkins/jenkins-slave/workspace/HBase-0.94/trunk/target/surefire/surefire_71975097311425723956tmp
Forking command line: /bin/sh -c cd /x1/jenkins/jenkins-slave/workspace/HBase-0.94/trunk &&
/x1/jenkins/tools/java/jdk1.6.0_27-32/jre/bin/java -enableassertions -Xmx1900m -Djava.security.egd=file:/dev/./urandom
-jar /x1/jenkins/jenkins-slave/workspace/HBase-0.94/trunk/target/surefire/surefirebooter3378415190740086567.jar
/x1/jenkins/jenkins-slave/workspace/HBase-0.94/trunk/target/surefire/surefire5071613862987097300tmp
/x1/jenkins/jenkins-slave/workspace/HBase-0.94/trunk/target/surefire/surefire_72945985480134162790tmp
Running org.apache.hadoop.hbase.ipc.TestDelayedRpc
Tests run: 4, Failures: 0, Errors: 0, Skipped: 0, Time elapsed: 2.388 sec
Forking command line: /bin/sh -c cd /x1/jenkins/jenkins-slave/workspace/HBase-0.94/trunk &&
/x1/jenkins/tools/java/jdk1.6.0_27-32/jre/bin/java -enableassertions -Xmx1900m -Djava.security.egd=file:/dev/./urandom
-jar /x1/jenkins/jenkins-slave/workspace/HBase-0.94/trunk/target/surefire/surefirebooter2487127143540276502.jar
/x1/jenkins/jenkins-slave/workspace/HBase-0.94/trunk/target/surefire/surefire2322531085617009706tmp
/x1/jenkins/jenkins-slave/workspace/HBase-0.94/trunk/target/surefire/surefire_736267295213123263309tmp
Running org.apache.hadoop.hbase.TestGlobalMemStoreSize
Tests run: 1, Failures: 0, Errors: 0, Skipped: 0, Time elapsed: 14.694 sec
Forking command line: /bin/sh -c cd /x1/jenkins/jenkins-slave/workspace/HBase-0.94/trunk &&
/x1/jenkins/tools/java/jdk1.6.0_27-32/jre/bin/java -enableassertions -Xmx1900m -Djava.security.egd=file:/dev/./urandom
-jar /x1/jenkins/jenkins-slave/workspace/HBase-0.94/trunk/target/surefire/surefirebooter3130583926819769394.jar
/x1/jenkins/jenkins-slave/workspace/HBase-0.94/trunk/target/surefire/surefire4889405984455933287tmp
/x1/jenkins/jenkins-slave/workspace/HBase-0.94/trunk/target/surefire/surefire_7424917538193785943tmp
Running org.apache.hadoop.hbase.constraint.TestConstraint
Tests run: 5, Failures: 0, Errors: 0, Skipped: 0, Time elapsed: 26.064 sec
Forking command line: /bin/sh -c cd /x1/jenkins/jenkins-slave/workspace/HBase-0.94/trunk &&
/x1/jenkins/tools/java/jdk1.6.0_27-32/jre/bin/java -enableassertions -Xmx1900m -Djava.security.egd=file:/dev/./urandom
-jar /x1/jenkins/jenkins-slave/workspace/HBase-0.94/trunk/target/surefire/surefirebooter595386109108053611.jar
/x1/jenkins/jenkins-slave/workspace/HBase-0.94/trunk/target/surefire/surefire6979966614525537314tmp
/x1/jenkins/jenkins-slave/workspace/HBase-0.94/trunk/target/surefire/surefire_754121905404861313500tmp
Running org.apache.hadoop.hbase.rest.TestSchemaResource
Tests run: 2, Failures: 0, Errors: 0, Skipped: 0, Time elapsed: 18.139 sec
Forking command line: /bin/sh -c cd /x1/jenkins/jenkins-slave/workspace/HBase-0.94/trunk &&
/x1/jenkins/tools/java/jdk1.6.0_27-32/jre/bin/java -enableassertions -Xmx1900m -Djava.security.egd=file:/dev/./urandom
-jar /x1/jenkins/jenkins-slave/workspace/HBase-0.94/trunk/target/surefire/surefirebooter2339516204430001093.jar
/x1/jenkins/jenkins-slave/workspace/HBase-0.94/trunk/target/surefire/surefire3184381439919651430tmp
/x1/jenkins/jenkins-slave/workspace/HBase-0.94/trunk/target/surefire/surefire_768412984492632350149tmp
Running org.apache.hadoop.hbase.rest.client.TestRemoteAdmin
Tests run: 1, Failures: 0, Errors: 0, Skipped: 0, Time elapsed: 15.435 sec
Forking command line: /bin/sh -c cd /x1/jenkins/jenkins-slave/workspace/HBase-0.94/trunk &&
/x1/jenkins/tools/java/jdk1.6.0_27-32/jre/bin/java -enableassertions -Xmx1900m -Djava.security.egd=file:/dev/./urandom
-jar /x1/jenkins/jenkins-slave/workspace/HBase-0.94/trunk/target/surefire/surefirebooter1059133560971559510.jar
/x1/jenkins/jenkins-slave/workspace/HBase-0.94/trunk/target/surefire/surefire9150346514715177034tmp
/x1/jenkins/jenkins-slave/workspace/HBase-0.94/trunk/target/surefire/surefire_778440618078156300124tmp
Running org.apache.hadoop.hbase.rest.client.TestRemoteTable
Tests run: 3, Failures: 0, Errors: 0, Skipped: 0, Time elapsed: 14.247 sec
Forking command line: /bin/sh -c cd /x1/jenkins/jenkins-slave/workspace/HBase-0.94/trunk &&
/x1/jenkins/tools/java/jdk1.6.0_27-32/jre/bin/java -enableassertions -Xmx1900m -Djava.security.egd=file:/dev/./urandom
-jar /x1/jenkins/jenkins-slave/workspace/HBase-0.94/trunk/target/surefire/surefirebooter1525131135825259185.jar
/x1/jenkins/jenkins-slave/workspace/HBase-0.94/trunk/target/surefire/surefire8928914750430166858tmp
/x1/jenkins/jenkins-slave/workspace/HBase-0.94/trunk/target/surefire/surefire_783476181554882794704tmp
Running org.apache.hadoop.hbase.rest.TestMultiRowResource
Tests run: 3, Failures: 0, Errors: 0, Skipped: 0, Time elapsed: 12.323 sec
Forking command line: /bin/sh -c cd /x1/jenkins/jenkins-slave/workspace/HBase-0.94/trunk &&
/x1/jenkins/tools/java/jdk1.6.0_27-32/jre/bin/java -enableassertions -Xmx1900m -Djava.security.egd=file:/dev/./urandom
-jar /x1/jenkins/jenkins-slave/workspace/HBase-0.94/trunk/target/surefire/surefirebooter623205424762329604.jar
/x1/jenkins/jenkins-slave/workspace/HBase-0.94/trunk/target/surefire/surefire8387244303053658159tmp
/x1/jenkins/jenkins-slave/workspace/HBase-0.94/trunk/target/surefire/surefire_793190450319769813600tmp
Running org.apache.hadoop.hbase.rest.TestTableResource
Tests run: 8, Failures: 0, Errors: 0, Skipped: 0, Time elapsed: 20.291 sec
Forking command line: /bin/sh -c cd /x1/jenkins/jenkins-slave/workspace/HBase-0.94/trunk &&
/x1/jenkins/tools/java/jdk1.6.0_27-32/jre/bin/java -enableassertions -Xmx1900m -Djava.security.egd=file:/dev/./urandom
-jar /x1/jenkins/jenkins-slave/workspace/HBase-0.94/trunk/target/surefire/surefirebooter3853802211488381233.jar
/x1/jenkins/jenkins-slave/workspace/HBase-0.94/trunk/target/surefire/surefire8948922797897977079tmp
/x1/jenkins/jenkins-slave/workspace/HBase-0.94/trunk/target/surefire/surefire_806608439614034106028tmp
Running org.apache.hadoop.hbase.rest.TestGzipFilter
Tests run: 3, Failures: 0, Errors: 0, Skipped: 0, Time elapsed: 12.941 sec
Forking command line: /bin/sh -c cd /x1/jenkins/jenkins-slave/workspace/HBase-0.94/trunk &&
/x1/jenkins/tools/java/jdk1.6.0_27-32/jre/bin/java -enableassertions -Xmx1900m -Djava.security.egd=file:/dev/./urandom
-jar /x1/jenkins/jenkins-slave/workspace/HBase-0.94/trunk/target/surefire/surefirebooter732511111016809643.jar
/x1/jenkins/jenkins-slave/workspace/HBase-0.94/trunk/target/surefire/surefire8814987911125906792tmp
/x1/jenkins/jenkins-slave/workspace/HBase-0.94/trunk/target/surefire/surefire_81490124497782681741tmp
Running org.apache.hadoop.hbase.rest.TestRowResource
Tests run: 11, Failures: 0, Errors: 0, Skipped: 0, Time elapsed: 14.328 sec
Forking command line: /bin/sh -c cd /x1/jenkins/jenkins-slave/workspace/HBase-0.94/trunk &&
/x1/jenkins/tools/java/jdk1.6.0_27-32/jre/bin/java -enableassertions -Xmx1900m -Djava.security.egd=file:/dev/./urandom
-jar /x1/jenkins/jenkins-slave/workspace/HBase-0.94/trunk/target/surefire/surefirebooter4038492811152442806.jar
/x1/jenkins/jenkins-slave/workspace/HBase-0.94/trunk/target/surefire/surefire2864489916937178672tmp
/x1/jenkins/jenkins-slave/workspace/HBase-0.94/trunk/target/surefire/surefire_822894594466130659887tmp
Running org.apache.hadoop.hbase.rest.TestVersionResource
Tests run: 7, Failures: 0, Errors: 0, Skipped: 0, Time elapsed: 10.119 sec
Forking command line: /bin/sh -c cd /x1/jenkins/jenkins-slave/workspace/HBase-0.94/trunk &&
/x1/jenkins/tools/java/jdk1.6.0_27-32/jre/bin/java -enableassertions -Xmx1900m -Djava.security.egd=file:/dev/./urandom
-jar /x1/jenkins/jenkins-slave/workspace/HBase-0.94/trunk/target/surefire/surefirebooter2663303869039930249.jar
/x1/jenkins/jenkins-slave/workspace/HBase-0.94/trunk/target/surefire/surefire3774717173056547567tmp
/x1/jenkins/jenkins-slave/workspace/HBase-0.94/trunk/target/surefire/surefire_835597279504849502880tmp
Running org.apache.hadoop.hbase.rest.TestStatusResource
Tests run: 2, Failures: 0, Errors: 0, Skipped: 0, Time elapsed: 11.299 sec
Forking command line: /bin/sh -c cd /x1/jenkins/jenkins-slave/workspace/HBase-0.94/trunk &&
/x1/jenkins/tools/java/jdk1.6.0_27-32/jre/bin/java -enableassertions -Xmx1900m -Djava.security.egd=file:/dev/./urandom
-jar /x1/jenkins/jenkins-slave/workspace/HBase-0.94/trunk/target/surefire/surefirebooter8464260682443336449.jar
/x1/jenkins/jenkins-slave/workspace/HBase-0.94/trunk/target/surefire/surefire6280957016126661703tmp
/x1/jenkins/jenkins-slave/workspace/HBase-0.94/trunk/target/surefire/surefire_842271432049794701836tmp
Running org.apache.hadoop.hbase.rest.TestScannerResource
Tests run: 5, Failures: 0, Errors: 0, Skipped: 0, Time elapsed: 27.254 sec
Forking command line: /bin/sh -c cd /x1/jenkins/jenkins-slave/workspace/HBase-0.94/trunk &&
/x1/jenkins/tools/java/jdk1.6.0_27-32/jre/bin/java -enableassertions -Xmx1900m -Djava.security.egd=file:/dev/./urandom
-jar /x1/jenkins/jenkins-slave/workspace/HBase-0.94/trunk/target/surefire/surefirebooter3068458214273027927.jar
/x1/jenkins/jenkins-slave/workspace/HBase-0.94/trunk/target/surefire/surefire9134070697537682997tmp
/x1/jenkins/jenkins-slave/workspace/HBase-0.94/trunk/target/surefire/surefire_855819297889291076199tmp
Running org.apache.hadoop.hbase.metrics.TestMetricsMBeanBase
Tests run: 2, Failures: 0, Errors: 0, Skipped: 0, Time elapsed: 1.113 sec
Forking command line: /bin/sh -c cd /x1/jenkins/jenkins-slave/workspace/HBase-0.94/trunk &&
/x1/jenkins/tools/java/jdk1.6.0_27-32/jre/bin/java -enableassertions -Xmx1900m -Djava.security.egd=file:/dev/./urandom
-jar /x1/jenkins/jenkins-slave/workspace/HBase-0.94/trunk/target/surefire/surefirebooter871040146898584802.jar
/x1/jenkins/jenkins-slave/workspace/HBase-0.94/trunk/target/surefire/surefire367683761091599527tmp
/x1/jenkins/jenkins-slave/workspace/HBase-0.94/trunk/target/surefire/surefire_86681364795655332029tmp
Running org.apache.hadoop.hbase.io.hfile.TestHFileBlockIndex
Tests run: 10, Failures: 0, Errors: 0, Skipped: 0, Time elapsed: 7.111 sec
Forking command line: /bin/sh -c cd /x1/jenkins/jenkins-slave/workspace/HBase-0.94/trunk &&
/x1/jenkins/tools/java/jdk1.6.0_27-32/jre/bin/java -enableassertions -Xmx1900m -Djava.security.egd=file:/dev/./urandom
-jar /x1/jenkins/jenkins-slave/workspace/HBase-0.94/trunk/target/surefire/surefirebooter6990105139382031639.jar
/x1/jenkins/jenkins-slave/workspace/HBase-0.94/trunk/target/surefire/surefire6816525594080191832tmp
/x1/jenkins/jenkins-slave/workspace/HBase-0.94/trunk/target/surefire/surefire_878470326078259057070tmp
Running org.apache.hadoop.hbase.rest.TestScannersWithFilters
Tests run: 10, Failures: 0, Errors: 0, Skipped: 0, Time elapsed: 15.483 sec
Forking command line: /bin/sh -c cd /x1/jenkins/jenkins-slave/workspace/HBase-0.94/trunk &&
/x1/jenkins/tools/java/jdk1.6.0_27-32/jre/bin/java -enableassertions -Xmx1900m -Djava.security.egd=file:/dev/./urandom
-jar /x1/jenkins/jenkins-slave/workspace/HBase-0.94/trunk/target/surefire/surefirebooter6606726808516704285.jar
/x1/jenkins/jenkins-slave/workspace/HBase-0.94/trunk/target/surefire/surefire3484665214861072922tmp
/x1/jenkins/jenkins-slave/workspace/HBase-0.94/trunk/target/surefire/surefire_887917612418315179899tmp
Running org.apache.hadoop.hbase.io.hfile.TestHFileSeek
Tests run: 1, Failures: 0, Errors: 0, Skipped: 0, Time elapsed: 6.564 sec
Forking command line: /bin/sh -c cd /x1/jenkins/jenkins-slave/workspace/HBase-0.94/trunk &&
/x1/jenkins/tools/java/jdk1.6.0_27-32/jre/bin/java -enableassertions -Xmx1900m -Djava.security.egd=file:/dev/./urandom
-jar /x1/jenkins/jenkins-slave/workspace/HBase-0.94/trunk/target/surefire/surefirebooter3694667647428065679.jar
/x1/jenkins/jenkins-slave/workspace/HBase-0.94/trunk/target/surefire/surefire5989975943739945658tmp
/x1/jenkins/jenkins-slave/workspace/HBase-0.94/trunk/target/surefire/surefire_891562925331523580929tmp
Running org.apache.hadoop.hbase.io.hfile.TestLruBlockCache
Tests run: 16, Failures: 0, Errors: 0, Skipped: 0, Time elapsed: 0.79 sec
Forking command line: /bin/sh -c cd /x1/jenkins/jenkins-slave/workspace/HBase-0.94/trunk &&
/x1/jenkins/tools/java/jdk1.6.0_27-32/jre/bin/java -enableassertions -Xmx1900m -Djava.security.egd=file:/dev/./urandom
-jar /x1/jenkins/jenkins-slave/workspace/HBase-0.94/trunk/target/surefire/surefirebooter4828411992700742271.jar
/x1/jenkins/jenkins-slave/workspace/HBase-0.94/trunk/target/surefire/surefire352229663865193299tmp
/x1/jenkins/jenkins-slave/workspace/HBase-0.94/trunk/target/surefire/surefire_904571262553107699670tmp
Running org.apache.hadoop.hbase.io.hfile.TestFixedFileTrailer
Tests run: 2, Failures: 0, Errors: 0, Skipped: 0, Time elapsed: 0.584 sec
Forking command line: /bin/sh -c cd /x1/jenkins/jenkins-slave/workspace/HBase-0.94/trunk &&
/x1/jenkins/tools/java/jdk1.6.0_27-32/jre/bin/java -enableassertions -Xmx1900m -Djava.security.egd=file:/dev/./urandom
-jar /x1/jenkins/jenkins-slave/workspace/HBase-0.94/trunk/target/surefire/surefirebooter5733189262414040800.jar
/x1/jenkins/jenkins-slave/workspace/HBase-0.94/trunk/target/surefire/surefire2749933240141202517tmp
/x1/jenkins/jenkins-slave/workspace/HBase-0.94/trunk/target/surefire/surefire_918340334063556976422tmp
Running org.apache.hadoop.hbase.io.hfile.TestHFilePerformance
Tests run: 1, Failures: 0, Errors: 0, Skipped: 0, Time elapsed: 4.672 sec
Forking command line: /bin/sh -c cd /x1/jenkins/jenkins-slave/workspace/HBase-0.94/trunk &&
/x1/jenkins/tools/java/jdk1.6.0_27-32/jre/bin/java -enableassertions -Xmx1900m -Djava.security.egd=file:/dev/./urandom
-jar /x1/jenkins/jenkins-slave/workspace/HBase-0.94/trunk/target/surefire/surefirebooter5624851087937371933.jar
/x1/jenkins/jenkins-slave/workspace/HBase-0.94/trunk/target/surefire/surefire6501000037451372686tmp
/x1/jenkins/jenkins-slave/workspace/HBase-0.94/trunk/target/surefire/surefire_925875245924434542252tmp
Running org.apache.hadoop.hbase.io.hfile.TestHFileBlockCompatibility
Tests run: 10, Failures: 0, Errors: 0, Skipped: 0, Time elapsed: 0.914 sec
Forking command line: /bin/sh -c cd /x1/jenkins/jenkins-slave/workspace/HBase-0.94/trunk &&
/x1/jenkins/tools/java/jdk1.6.0_27-32/jre/bin/java -enableassertions -Xmx1900m -Djava.security.egd=file:/dev/./urandom
-jar /x1/jenkins/jenkins-slave/workspace/HBase-0.94/trunk/target/surefire/surefirebooter2442631658142739550.jar
/x1/jenkins/jenkins-slave/workspace/HBase-0.94/trunk/target/surefire/surefire5966894163086710203tmp
/x1/jenkins/jenkins-slave/workspace/HBase-0.94/trunk/target/surefire/surefire_933781172628910837472tmp
Running org.apache.hadoop.hbase.io.hfile.TestForceCacheImportantBlocks
Tests run: 4, Failures: 0, Errors: 0, Skipped: 0, Time elapsed: 29.75 sec
Forking command line: /bin/sh -c cd /x1/jenkins/jenkins-slave/workspace/HBase-0.94/trunk &&
/x1/jenkins/tools/java/jdk1.6.0_27-32/jre/bin/java -enableassertions -Xmx1900m -Djava.security.egd=file:/dev/./urandom
-jar /x1/jenkins/jenkins-slave/workspace/HBase-0.94/trunk/target/surefire/surefirebooter4138943669363778205.jar
/x1/jenkins/jenkins-slave/workspace/HBase-0.94/trunk/target/surefire/surefire3586893721383373338tmp
/x1/jenkins/jenkins-slave/workspace/HBase-0.94/trunk/target/surefire/surefire_947812984790781910815tmp
Running org.apache.hadoop.hbase.io.hfile.TestCacheOnWrite
Running org.apache.hadoop.hbase.io.hfile.TestChecksum
Tests run: 3, Failures: 0, Errors: 0, Skipped: 0, Time elapsed: 0.793 sec
Tests run: 36, Failures: 0, Errors: 0, Skipped: 0, Time elapsed: 22.39 sec
Forking command line: /bin/sh -c cd /x1/jenkins/jenkins-slave/workspace/HBase-0.94/trunk &&
/x1/jenkins/tools/java/jdk1.6.0_27-32/jre/bin/java -enableassertions -Xmx1900m -Djava.security.egd=file:/dev/./urandom
-jar /x1/jenkins/jenkins-slave/workspace/HBase-0.94/trunk/target/surefire/surefirebooter6860255509556906317.jar
/x1/jenkins/jenkins-slave/workspace/HBase-0.94/trunk/target/surefire/surefire7925495388130763410tmp
/x1/jenkins/jenkins-slave/workspace/HBase-0.94/trunk/target/surefire/surefire_954044041500446244139tmp
Forking command line: /bin/sh -c cd /x1/jenkins/jenkins-slave/workspace/HBase-0.94/trunk &&
/x1/jenkins/tools/java/jdk1.6.0_27-32/jre/bin/java -enableassertions -Xmx1900m -Djava.security.egd=file:/dev/./urandom
-jar /x1/jenkins/jenkins-slave/workspace/HBase-0.94/trunk/target/surefire/surefirebooter6385668874486196596.jar
/x1/jenkins/jenkins-slave/workspace/HBase-0.94/trunk/target/surefire/surefire3847658713440415169tmp
/x1/jenkins/jenkins-slave/workspace/HBase-0.94/trunk/target/surefire/surefire_966462383372312652780tmp
Running org.apache.hadoop.hbase.io.hfile.slab.TestSlabCache
Tests run: 7, Failures: 0, Errors: 0, Skipped: 0, Time elapsed: 9.337 sec
Forking command line: /bin/sh -c cd /x1/jenkins/jenkins-slave/workspace/HBase-0.94/trunk &&
/x1/jenkins/tools/java/jdk1.6.0_27-32/jre/bin/java -enableassertions -Xmx1900m -Djava.security.egd=file:/dev/./urandom
-jar /x1/jenkins/jenkins-slave/workspace/HBase-0.94/trunk/target/surefire/surefirebooter2928927200066004069.jar
/x1/jenkins/jenkins-slave/workspace/HBase-0.94/trunk/target/surefire/surefire608258772663576519tmp
/x1/jenkins/jenkins-slave/workspace/HBase-0.94/trunk/target/surefire/surefire_977112678119008881683tmp
Running org.apache.hadoop.hbase.io.hfile.slab.TestSingleSizeCache
Tests run: 5, Failures: 0, Errors: 0, Skipped: 0, Time elapsed: 14.289 sec
Forking command line: /bin/sh -c cd /x1/jenkins/jenkins-slave/workspace/HBase-0.94/trunk &&
/x1/jenkins/tools/java/jdk1.6.0_27-32/jre/bin/java -enableassertions -Xmx1900m -Djava.security.egd=file:/dev/./urandom
-jar /x1/jenkins/jenkins-slave/workspace/HBase-0.94/trunk/target/surefire/surefirebooter7632302856152892440.jar
/x1/jenkins/jenkins-slave/workspace/HBase-0.94/trunk/target/surefire/surefire3685800692405527408tmp
/x1/jenkins/jenkins-slave/workspace/HBase-0.94/trunk/target/surefire/surefire_982147364568270024422tmp
Running org.apache.hadoop.hbase.io.hfile.TestHFileBlock
Tests run: 16, Failures: 0, Errors: 0, Skipped: 0, Time elapsed: 46.173 sec
Forking command line: /bin/sh -c cd /x1/jenkins/jenkins-slave/workspace/HBase-0.94/trunk &&
/x1/jenkins/tools/java/jdk1.6.0_27-32/jre/bin/java -enableassertions -Xmx1900m -Djava.security.egd=file:/dev/./urandom
-jar /x1/jenkins/jenkins-slave/workspace/HBase-0.94/trunk/target/surefire/surefirebooter1468691866389952239.jar
/x1/jenkins/jenkins-slave/workspace/HBase-0.94/trunk/target/surefire/surefire6232608911384112171tmp
/x1/jenkins/jenkins-slave/workspace/HBase-0.94/trunk/target/surefire/surefire_997451529216380162309tmp
Running org.apache.hadoop.hbase.io.encoding.TestLoadAndSwitchEncodeOnDisk
Tests run: 1, Failures: 0, Errors: 0, Skipped: 0, Time elapsed: 25.294 sec
Forking command line: /bin/sh -c cd /x1/jenkins/jenkins-slave/workspace/HBase-0.94/trunk &&
/x1/jenkins/tools/java/jdk1.6.0_27-32/jre/bin/java -enableassertions -Xmx1900m -Djava.security.egd=file:/dev/./urandom
-jar /x1/jenkins/jenkins-slave/workspace/HBase-0.94/trunk/target/surefire/surefirebooter7143787818973190372.jar
/x1/jenkins/jenkins-slave/workspace/HBase-0.94/trunk/target/surefire/surefire3063018128080727398tmp
/x1/jenkins/jenkins-slave/workspace/HBase-0.94/trunk/target/surefire/surefire_1006325180974794128187tmp
Running org.apache.hadoop.hbase.replication.regionserver.TestReplicationSourceManager
Tests run: 1, Failures: 0, Errors: 0, Skipped: 0, Time elapsed: 0.858 sec
Forking command line: /bin/sh -c cd /x1/jenkins/jenkins-slave/workspace/HBase-0.94/trunk &&
/x1/jenkins/tools/java/jdk1.6.0_27-32/jre/bin/java -enableassertions -Xmx1900m -Djava.security.egd=file:/dev/./urandom
-jar /x1/jenkins/jenkins-slave/workspace/HBase-0.94/trunk/target/surefire/surefirebooter7027107338977582226.jar
/x1/jenkins/jenkins-slave/workspace/HBase-0.94/trunk/target/surefire/surefire5782331966726450756tmp
/x1/jenkins/jenkins-slave/workspace/HBase-0.94/trunk/target/surefire/surefire_1015708647155255920948tmp
Running org.apache.hadoop.hbase.replication.TestReplicationSource
Tests run: 1, Failures: 0, Errors: 0, Skipped: 0, Time elapsed: 2.336 sec
Forking command line: /bin/sh -c cd /x1/jenkins/jenkins-slave/workspace/HBase-0.94/trunk &&
/x1/jenkins/tools/java/jdk1.6.0_27-32/jre/bin/java -enableassertions -Xmx1900m -Djava.security.egd=file:/dev/./urandom
-jar /x1/jenkins/jenkins-slave/workspace/HBase-0.94/trunk/target/surefire/surefirebooter3414473426976937978.jar
/x1/jenkins/jenkins-slave/workspace/HBase-0.94/trunk/target/surefire/surefire2420405619219588993tmp
/x1/jenkins/jenkins-slave/workspace/HBase-0.94/trunk/target/surefire/surefire_102751532556716516906tmp
Running org.apache.hadoop.hbase.replication.regionserver.TestReplicationSink
Tests run: 5, Failures: 0, Errors: 0, Skipped: 0, Time elapsed: 13.857 sec
Forking command line: /bin/sh -c cd /x1/jenkins/jenkins-slave/workspace/HBase-0.94/trunk &&
/x1/jenkins/tools/java/jdk1.6.0_27-32/jre/bin/java -enableassertions -Xmx1900m -Djava.security.egd=file:/dev/./urandom
-jar /x1/jenkins/jenkins-slave/workspace/HBase-0.94/trunk/target/surefire/surefirebooter5643719795146918523.jar
/x1/jenkins/jenkins-slave/workspace/HBase-0.94/trunk/target/surefire/surefire2509833339832019388tmp
/x1/jenkins/jenkins-slave/workspace/HBase-0.94/trunk/target/surefire/surefire_1039134471471974961785tmp
Running org.apache.hadoop.hbase.replication.TestReplicationPeer
Tests run: 1, Failures: 0, Errors: 0, Skipped: 0, Time elapsed: 7.597 sec
Running org.apache.hadoop.hbase.util.TestFSTableDescriptors
Tests run: 10, Failures: 0, Errors: 0, Skipped: 0, Time elapsed: 0.867 sec
Forking command line: /bin/sh -c cd /x1/jenkins/jenkins-slave/workspace/HBase-0.94/trunk &&
/x1/jenkins/tools/java/jdk1.6.0_27-32/jre/bin/java -enableassertions -Xmx1900m -Djava.security.egd=file:/dev/./urandom
-jar /x1/jenkins/jenkins-slave/workspace/HBase-0.94/trunk/target/surefire/surefirebooter1622809923590733852.jar
/x1/jenkins/jenkins-slave/workspace/HBase-0.94/trunk/target/surefire/surefire225818746764618564tmp
/x1/jenkins/jenkins-slave/workspace/HBase-0.94/trunk/target/surefire/surefire_1047327318482324423309tmp
Forking command line: /bin/sh -c cd /x1/jenkins/jenkins-slave/workspace/HBase-0.94/trunk &&
/x1/jenkins/tools/java/jdk1.6.0_27-32/jre/bin/java -enableassertions -Xmx1900m -Djava.security.egd=file:/dev/./urandom
-jar /x1/jenkins/jenkins-slave/workspace/HBase-0.94/trunk/target/surefire/surefirebooter3981817059208723845.jar
/x1/jenkins/jenkins-slave/workspace/HBase-0.94/trunk/target/surefire/surefire6234415359146733595tmp
/x1/jenkins/jenkins-slave/workspace/HBase-0.94/trunk/target/surefire/surefire_1056487844262260691957tmp
Running org.apache.hadoop.hbase.util.TestEnvironmentEdgeManager
Tests run: 2, Failures: 0, Errors: 0, Skipped: 0, Time elapsed: 0.322 sec
Forking command line: /bin/sh -c cd /x1/jenkins/jenkins-slave/workspace/HBase-0.94/trunk &&
/x1/jenkins/tools/java/jdk1.6.0_27-32/jre/bin/java -enableassertions -Xmx1900m -Djava.security.egd=file:/dev/./urandom
-jar /x1/jenkins/jenkins-slave/workspace/HBase-0.94/trunk/target/surefire/surefirebooter7736596583033735426.jar
/x1/jenkins/jenkins-slave/workspace/HBase-0.94/trunk/target/surefire/surefire9150439983805830224tmp
/x1/jenkins/jenkins-slave/workspace/HBase-0.94/trunk/target/surefire/surefire_1061631416506421554535tmp
Running org.apache.hadoop.hbase.util.TestIdLock
Tests run: 1, Failures: 0, Errors: 0, Skipped: 0, Time elapsed: 15.27 sec
Forking command line: /bin/sh -c cd /x1/jenkins/jenkins-slave/workspace/HBase-0.94/trunk &&
/x1/jenkins/tools/java/jdk1.6.0_27-32/jre/bin/java -enableassertions -Xmx1900m -Djava.security.egd=file:/dev/./urandom
-jar /x1/jenkins/jenkins-slave/workspace/HBase-0.94/trunk/target/surefire/surefirebooter2114933046017676795.jar
/x1/jenkins/jenkins-slave/workspace/HBase-0.94/trunk/target/surefire/surefire8748747996602741083tmp
/x1/jenkins/jenkins-slave/workspace/HBase-0.94/trunk/target/surefire/surefire_1073042118023282050328tmp
Running org.apache.hadoop.hbase.util.TestMergeTable
Tests run: 1, Failures: 0, Errors: 0, Skipped: 0, Time elapsed: 23.962 sec
Forking command line: /bin/sh -c cd /x1/jenkins/jenkins-slave/workspace/HBase-0.94/trunk &&
/x1/jenkins/tools/java/jdk1.6.0_27-32/jre/bin/java -enableassertions -Xmx1900m -Djava.security.egd=file:/dev/./urandom
-jar /x1/jenkins/jenkins-slave/workspace/HBase-0.94/trunk/target/surefire/surefirebooter1098172431470173717.jar
/x1/jenkins/jenkins-slave/workspace/HBase-0.94/trunk/target/surefire/surefire2876591956670163217tmp
/x1/jenkins/jenkins-slave/workspace/HBase-0.94/trunk/target/surefire/surefire_1084079016148022147907tmp
Running org.apache.hadoop.hbase.util.TestFSUtils
Tests run: 3, Failures: 1, Errors: 0, Skipped: 0, Time elapsed: 19.046 sec <<< FAILURE!
Forking command line: /bin/sh -c cd /x1/jenkins/jenkins-slave/workspace/HBase-0.94/trunk &&
/x1/jenkins/tools/java/jdk1.6.0_27-32/jre/bin/java -enableassertions -Xmx1900m -Djava.security.egd=file:/dev/./urandom
-jar /x1/jenkins/jenkins-slave/workspace/HBase-0.94/trunk/target/surefire/surefirebooter1085107558155324310.jar
/x1/jenkins/jenkins-slave/workspace/HBase-0.94/trunk/target/surefire/surefire7397331190355879937tmp
/x1/jenkins/jenkins-slave/workspace/HBase-0.94/trunk/target/surefire/surefire_109799243933455406009tmp
Running org.apache.hadoop.hbase.util.TestPoolMap$TestRoundRobinPoolType
Tests run: 3, Failures: 0, Errors: 0, Skipped: 0, Time elapsed: 0.006 sec
Running org.apache.hadoop.hbase.util.TestPoolMap$TestThreadLocalPoolType
Tests run: 3, Failures: 0, Errors: 0, Skipped: 0, Time elapsed: 0.004 sec
Running org.apache.hadoop.hbase.util.TestPoolMap$TestReusablePoolType
Tests run: 3, Failures: 0, Errors: 0, Skipped: 0, Time elapsed: 0.019 sec
Forking command line: /bin/sh -c cd /x1/jenkins/jenkins-slave/workspace/HBase-0.94/trunk &&
/x1/jenkins/tools/java/jdk1.6.0_27-32/jre/bin/java -enableassertions -Xmx1900m -Djava.security.egd=file:/dev/./urandom
-jar /x1/jenkins/jenkins-slave/workspace/HBase-0.94/trunk/target/surefire/surefirebooter7290212629185163859.jar
/x1/jenkins/jenkins-slave/workspace/HBase-0.94/trunk/target/surefire/surefire6784933667154492194tmp
/x1/jenkins/jenkins-slave/workspace/HBase-0.94/trunk/target/surefire/surefire_1105176448172310099260tmp
Running org.apache.hadoop.hbase.util.TestHBaseFsck
Tests run: 6, Failures: 0, Errors: 0, Skipped: 0, Time elapsed: 38.628 sec
Forking command line: /bin/sh -c cd /x1/jenkins/jenkins-slave/workspace/HBase-0.94/trunk &&
/x1/jenkins/tools/java/jdk1.6.0_27-32/jre/bin/java -enableassertions -Xmx1900m -Djava.security.egd=file:/dev/./urandom
-jar /x1/jenkins/jenkins-slave/workspace/HBase-0.94/trunk/target/surefire/surefirebooter6202667916474755836.jar
/x1/jenkins/jenkins-slave/workspace/HBase-0.94/trunk/target/surefire/surefire7563652584801830116tmp
/x1/jenkins/jenkins-slave/workspace/HBase-0.94/trunk/target/surefire/surefire_1117190639862886932041tmp
Running org.apache.hadoop.hbase.util.TestRegionSplitter
Tests run: 5, Failures: 0, Errors: 0, Skipped: 0, Time elapsed: 25.035 sec
Forking command line: /bin/sh -c cd /x1/jenkins/jenkins-slave/workspace/HBase-0.94/trunk &&
/x1/jenkins/tools/java/jdk1.6.0_27-32/jre/bin/java -enableassertions -Xmx1900m -Djava.security.egd=file:/dev/./urandom
-jar /x1/jenkins/jenkins-slave/workspace/HBase-0.94/trunk/target/surefire/surefirebooter5906441828382743288.jar
/x1/jenkins/jenkins-slave/workspace/HBase-0.94/trunk/target/surefire/surefire92532438117328199tmp
/x1/jenkins/jenkins-slave/workspace/HBase-0.94/trunk/target/surefire/surefire_1121798977213509686188tmp
Running org.apache.hadoop.hbase.util.hbck.TestOfflineMetaRebuildBase
Tests run: 1, Failures: 0, Errors: 0, Skipped: 0, Time elapsed: 18.919 sec
Forking command line: /bin/sh -c cd /x1/jenkins/jenkins-slave/workspace/HBase-0.94/trunk &&
/x1/jenkins/tools/java/jdk1.6.0_27-32/jre/bin/java -enableassertions -Xmx1900m -Djava.security.egd=file:/dev/./urandom
-jar /x1/jenkins/jenkins-slave/workspace/HBase-0.94/trunk/target/surefire/surefirebooter2877681244050063138.jar
/x1/jenkins/jenkins-slave/workspace/HBase-0.94/trunk/target/surefire/surefire6216829232638449212tmp
/x1/jenkins/jenkins-slave/workspace/HBase-0.94/trunk/target/surefire/surefire_1136214899337154558364tmp
Running org.apache.hadoop.hbase.util.hbck.TestOfflineMetaRebuildOverlap
Tests run: 1, Failures: 0, Errors: 0, Skipped: 0, Time elapsed: 18.571 sec
Forking command line: /bin/sh -c cd /x1/jenkins/jenkins-slave/workspace/HBase-0.94/trunk &&
/x1/jenkins/tools/java/jdk1.6.0_27-32/jre/bin/java -enableassertions -Xmx1900m -Djava.security.egd=file:/dev/./urandom
-jar /x1/jenkins/jenkins-slave/workspace/HBase-0.94/trunk/target/surefire/surefirebooter778928634637571789.jar
/x1/jenkins/jenkins-slave/workspace/HBase-0.94/trunk/target/surefire/surefire7517435700305881286tmp
/x1/jenkins/jenkins-slave/workspace/HBase-0.94/trunk/target/surefire/surefire_1145556935122868371078tmp
Running org.apache.hadoop.hbase.util.TestDefaultEnvironmentEdge
Tests run: 1, Failures: 0, Errors: 0, Skipped: 0, Time elapsed: 0.234 sec
Forking command line: /bin/sh -c cd /x1/jenkins/jenkins-slave/workspace/HBase-0.94/trunk &&
/x1/jenkins/tools/java/jdk1.6.0_27-32/jre/bin/java -enableassertions -Xmx1900m -Djava.security.egd=file:/dev/./urandom
-jar /x1/jenkins/jenkins-slave/workspace/HBase-0.94/trunk/target/surefire/surefirebooter6561511893387911847.jar
/x1/jenkins/jenkins-slave/workspace/HBase-0.94/trunk/target/surefire/surefire2375672597681939325tmp
/x1/jenkins/jenkins-slave/workspace/HBase-0.94/trunk/target/surefire/surefire_1152285346101429515729tmp
Running org.apache.hadoop.hbase.util.hbck.TestOfflineMetaRebuildHole
Tests run: 1, Failures: 0, Errors: 0, Skipped: 0, Time elapsed: 18.232 sec
Running org.apache.hadoop.hbase.TestInfoServers
Tests run: 2, Failures: 0, Errors: 0, Skipped: 0, Time elapsed: 10.7 sec

Results :

Failed tests:   testcomputeHDFSBlocksDistribution(org.apache.hadoop.hbase.util.TestFSUtils):
Wrong number of hosts distributing blocks. expected:<3> but was:<2>

Tests run: 600, Failures: 1, Errors: 0, Skipped: 2

[INFO] ------------------------------------------------------------------------
[INFO] BUILD FAILURE
[INFO] ------------------------------------------------------------------------
[INFO] Total time: 19:51.385s
[INFO] Finished at: Mon Mar 12 21:40:04 UTC 2012
[INFO] Final Memory: 50M/990M
[INFO] ------------------------------------------------------------------------
[ERROR] Failed to execute goal org.apache.maven.plugins:maven-surefire-plugin:2.12-TRUNK-HBASE-2:test
(secondPartTestsExecution) on project hbase: There are test failures.
[ERROR] 
[ERROR] Please refer to /x1/jenkins/jenkins-slave/workspace/HBase-0.94/trunk/target/surefire-reports
for the individual test results.
[ERROR] -> [Help 1]
org.apache.maven.lifecycle.LifecycleExecutionException: Failed to execute goal org.apache.maven.plugins:maven-surefire-plugin:2.12-TRUNK-HBASE-2:test
(secondPartTestsExecution) on project hbase: There are test failures.

Please refer to /x1/jenkins/jenkins-slave/workspace/HBase-0.94/trunk/target/surefire-reports
for the individual test results.
	at org.apache.maven.lifecycle.internal.MojoExecutor.execute(MojoExecutor.java:213)
	at org.apache.maven.lifecycle.internal.MojoExecutor.execute(MojoExecutor.java:153)
	at org.apache.maven.lifecycle.internal.MojoExecutor.execute(MojoExecutor.java:145)
	at org.apache.maven.lifecycle.internal.MojoExecutor.executeForkedExecutions(MojoExecutor.java:365)
	at org.apache.maven.lifecycle.internal.MojoExecutor.execute(MojoExecutor.java:199)
	at org.apache.maven.lifecycle.internal.MojoExecutor.execute(MojoExecutor.java:153)
	at org.apache.maven.lifecycle.internal.MojoExecutor.execute(MojoExecutor.java:145)
	at org.apache.maven.lifecycle.internal.LifecycleModuleBuilder.buildProject(LifecycleModuleBuilder.java:84)
	at org.apache.maven.lifecycle.internal.LifecycleModuleBuilder.buildProject(LifecycleModuleBuilder.java:59)
	at org.apache.maven.lifecycle.internal.LifecycleStarter.singleThreadedBuild(LifecycleStarter.java:183)
	at org.apache.maven.lifecycle.internal.LifecycleStarter.execute(LifecycleStarter.java:161)
	at org.apache.maven.DefaultMaven.doExecute(DefaultMaven.java:319)
	at org.apache.maven.DefaultMaven.execute(DefaultMaven.java:156)
	at org.apache.maven.cli.MavenCli.execute(MavenCli.java:537)
	at org.apache.maven.cli.MavenCli.doMain(MavenCli.java:196)
	at org.apache.maven.cli.MavenCli.main(MavenCli.java:141)
	at sun.reflect.NativeMethodAccessorImpl.invoke0(Native Method)
	at sun.reflect.NativeMethodAccessorImpl.invoke(NativeMethodAccessorImpl.java:39)
	at sun.reflect.DelegatingMethodAccessorImpl.invoke(DelegatingMethodAccessorImpl.java:25)
	at java.lang.reflect.Method.invoke(Method.java:597)
	at org.codehaus.plexus.classworlds.launcher.Launcher.launchEnhanced(Launcher.java:290)
	at org.codehaus.plexus.classworlds.launcher.Launcher.launch(Launcher.java:230)
	at org.codehaus.plexus.classworlds.launcher.Launcher.mainWithExitCode(Launcher.java:409)
	at org.codehaus.plexus.classworlds.launcher.Launcher.main(Launcher.java:352)
Caused by: org.apache.maven.plugin.MojoFailureException: There are test failures.

Please refer to /x1/jenkins/jenkins-slave/workspace/HBase-0.94/trunk/target/surefire-reports
for the individual test results.
	at org.apache.maven.plugin.surefire.SurefireHelper.reportExecution(SurefireHelper.java:87)
	at org.apache.maven.plugin.surefire.SurefirePlugin.writeSummary(SurefirePlugin.java:651)
	at org.apache.maven.plugin.surefire.SurefirePlugin.handleSummary(SurefirePlugin.java:625)
	at org.apache.maven.plugin.surefire.AbstractSurefireMojo.executeAfterPreconditionsChecked(AbstractSurefireMojo.java:137)
	at org.apache.maven.plugin.surefire.AbstractSurefireMojo.execute(AbstractSurefireMojo.java:98)
	at org.apache.maven.plugin.DefaultBuildPluginManager.executeMojo(DefaultBuildPluginManager.java:101)
	at org.apache.maven.lifecycle.internal.MojoExecutor.execute(MojoExecutor.java:209)
	... 23 more
[ERROR] 
[ERROR] 
[ERROR] For more information about the errors and possible solutions, please read the following
articles:
[ERROR] [Help 1] http://cwiki.apache.org/confluence/display/MAVEN/MojoFailureException
Build step 'Invoke top-level Maven targets' marked build as failure
Archiving artifacts
Updating HBASE-5562
Recording test results


Mime
View raw message