hbase-dev mailing list archives

Site index · List index
Message view « Date » · « Thread »
Top « Date » · « Thread »
From Apache Jenkins Server <jenk...@builds.apache.org>
Subject Build failed in Jenkins: HBase-0.92-security #103
Date Sun, 25 Mar 2012 17:04:55 GMT
See <https://builds.apache.org/job/HBase-0.92-security/103/changes>

Changes:

[jmhsieh] HBASE-5128 Addendum adds two missing new files

[jmhsieh] HBASE-5128 [uber hbck] Online automated repair of table integrity and region consistency problems

[stack] HBASE-5624 Aborting regionserver when splitting region, may cause daughter region not assigned by ServerShutdownHandler

[jdcryans] HBASE-5586  [replication] NPE in ReplicationSource when creating a stream
               to an inexistent cluster

[jmhsieh] HBASE-5589 Add of the offline call to the Master Interface

[stack] HBASE-5560 Avoid RegionServer GC caused by timed-out calls

[stack] HBASE-5560 Avoid RegionServer GC caused by timed-out calls

[stack] HBASE-5270 Handle potential data loss due to concurrent processing of processFaileOver and ServerShutdownHandler

[stack] HBASE-5270 Handle potential data loss due to concurrent processing of processFaileOver and ServerShutdownHandler

[jmhsieh] HBASE-5603 rolling-restart.sh script hangs when attempting to detect expiration of /hbase/master znode

[tedyu] HBASE-5568 Multi concurrent flushcache() for one region could cause data loss (Chunhui)

[stack] HBASE-5955 Fix NoSuchMethodException in 0.92 when running on local filesystem

[stack] Moving version on past 0.92.1 now its released

[jmhsieh] HBASE-5599 Addendum: Fix CHANGES.txt

[jmhsieh] HBASE-5588 Deprecate/remove AssignmentManager#clearRegionFromTransition

[jmhsieh] HBASE-5563 Addendum: Updating CHANGES.txt

[jmhsieh] HBASE-5563 Add comparison of regionId to HRegionInfo#compareTo (chunhui and jmhsieh)

[stack] HBASE-5592 Make it easier to get a table from shell

------------------------------------------
[...truncated 7079 lines...]
Running org.apache.hadoop.hbase.regionserver.TestExplicitColumnTracker
Tests run: 4, Failures: 0, Errors: 0, Skipped: 0, Time elapsed: 0.889 sec
Forking command line: /bin/sh -c cd <https://builds.apache.org/job/HBase-0.92-security/ws/trunk> && /home/hudson/tools/java/jdk1.6.0_27-32/jre/bin/java -enableassertions -Xmx1400m -Djava.security.egd=file:/dev/./urandom -jar <https://builds.apache.org/job/HBase-0.92-security/ws/trunk/target/surefire/surefirebooter4662961292590669115.jar> <https://builds.apache.org/job/HBase-0.92-security/ws/trunk/target/surefire/surefire4178882682469962308tmp> <https://builds.apache.org/job/HBase-0.92-security/ws/trunk/target/surefire/surefire2306878014376324671tmp>
Running org.apache.hadoop.hbase.regionserver.TestHRegionServerBulkLoad
Tests run: 1, Failures: 0, Errors: 0, Skipped: 0, Time elapsed: 53.753 sec
Forking command line: /bin/sh -c cd <https://builds.apache.org/job/HBase-0.92-security/ws/trunk> && /home/hudson/tools/java/jdk1.6.0_27-32/jre/bin/java -enableassertions -Xmx1400m -Djava.security.egd=file:/dev/./urandom -jar <https://builds.apache.org/job/HBase-0.92-security/ws/trunk/target/surefire/surefirebooter1223345840491496910.jar> <https://builds.apache.org/job/HBase-0.92-security/ws/trunk/target/surefire/surefire7573968143155086549tmp> <https://builds.apache.org/job/HBase-0.92-security/ws/trunk/target/surefire/surefire7931265022422194072tmp>
Running org.apache.hadoop.hbase.regionserver.TestMemStoreLAB
Tests run: 3, Failures: 0, Errors: 0, Skipped: 0, Time elapsed: 1.389 sec
Forking command line: /bin/sh -c cd <https://builds.apache.org/job/HBase-0.92-security/ws/trunk> && /home/hudson/tools/java/jdk1.6.0_27-32/jre/bin/java -enableassertions -Xmx1400m -Djava.security.egd=file:/dev/./urandom -jar <https://builds.apache.org/job/HBase-0.92-security/ws/trunk/target/surefire/surefirebooter1854041242464618202.jar> <https://builds.apache.org/job/HBase-0.92-security/ws/trunk/target/surefire/surefire5730803068716444658tmp> <https://builds.apache.org/job/HBase-0.92-security/ws/trunk/target/surefire/surefire7374785888948753718tmp>
Running org.apache.hadoop.hbase.regionserver.TestSplitLogWorker
Tests run: 5, Failures: 0, Errors: 0, Skipped: 0, Time elapsed: 2.526 sec
Forking command line: /bin/sh -c cd <https://builds.apache.org/job/HBase-0.92-security/ws/trunk> && /home/hudson/tools/java/jdk1.6.0_27-32/jre/bin/java -enableassertions -Xmx1400m -Djava.security.egd=file:/dev/./urandom -jar <https://builds.apache.org/job/HBase-0.92-security/ws/trunk/target/surefire/surefirebooter6635406587957292842.jar> <https://builds.apache.org/job/HBase-0.92-security/ws/trunk/target/surefire/surefire5270712389746306433tmp> <https://builds.apache.org/job/HBase-0.92-security/ws/trunk/target/surefire/surefire4190128886170445073tmp>
Running org.apache.hadoop.hbase.regionserver.TestMultiColumnScanner
Tests run: 6, Failures: 0, Errors: 0, Skipped: 0, Time elapsed: 18.487 sec
Forking command line: /bin/sh -c cd <https://builds.apache.org/job/HBase-0.92-security/ws/trunk> && /home/hudson/tools/java/jdk1.6.0_27-32/jre/bin/java -enableassertions -Xmx1400m -Djava.security.egd=file:/dev/./urandom -jar <https://builds.apache.org/job/HBase-0.92-security/ws/trunk/target/surefire/surefirebooter6331756058342216972.jar> <https://builds.apache.org/job/HBase-0.92-security/ws/trunk/target/surefire/surefire9082616615131943422tmp> <https://builds.apache.org/job/HBase-0.92-security/ws/trunk/target/surefire/surefire5966363652081765307tmp>
Running org.apache.hadoop.hbase.regionserver.TestSplitTransaction
Tests run: 6, Failures: 0, Errors: 0, Skipped: 0, Time elapsed: 4.14 sec
Forking command line: /bin/sh -c cd <https://builds.apache.org/job/HBase-0.92-security/ws/trunk> && /home/hudson/tools/java/jdk1.6.0_27-32/jre/bin/java -enableassertions -Xmx1400m -Djava.security.egd=file:/dev/./urandom -jar <https://builds.apache.org/job/HBase-0.92-security/ws/trunk/target/surefire/surefirebooter9022774968849847789.jar> <https://builds.apache.org/job/HBase-0.92-security/ws/trunk/target/surefire/surefire3680578882933520776tmp> <https://builds.apache.org/job/HBase-0.92-security/ws/trunk/target/surefire/surefire5860237607429109059tmp>
Running org.apache.hadoop.hbase.regionserver.TestCompoundBloomFilter
Tests run: 3, Failures: 0, Errors: 0, Skipped: 0, Time elapsed: 20.988 sec
Forking command line: /bin/sh -c cd <https://builds.apache.org/job/HBase-0.92-security/ws/trunk> && /home/hudson/tools/java/jdk1.6.0_27-32/jre/bin/java -enableassertions -Xmx1400m -Djava.security.egd=file:/dev/./urandom -jar <https://builds.apache.org/job/HBase-0.92-security/ws/trunk/target/surefire/surefirebooter2078330915868020870.jar> <https://builds.apache.org/job/HBase-0.92-security/ws/trunk/target/surefire/surefire8608232131710273712tmp> <https://builds.apache.org/job/HBase-0.92-security/ws/trunk/target/surefire/surefire4079037743595808274tmp>
Running org.apache.hadoop.hbase.regionserver.TestEndToEndSplitTransaction
Tests run: 1, Failures: 0, Errors: 0, Skipped: 0, Time elapsed: 49.558 sec
Forking command line: /bin/sh -c cd <https://builds.apache.org/job/HBase-0.92-security/ws/trunk> && /home/hudson/tools/java/jdk1.6.0_27-32/jre/bin/java -enableassertions -Xmx1400m -Djava.security.egd=file:/dev/./urandom -jar <https://builds.apache.org/job/HBase-0.92-security/ws/trunk/target/surefire/surefirebooter8307025040811783338.jar> <https://builds.apache.org/job/HBase-0.92-security/ws/trunk/target/surefire/surefire4477477186347617119tmp> <https://builds.apache.org/job/HBase-0.92-security/ws/trunk/target/surefire/surefire6905071770273908486tmp>
Running org.apache.hadoop.hbase.regionserver.TestWideScanner
Tests run: 1, Failures: 0, Errors: 0, Skipped: 0, Time elapsed: 1.925 sec
Forking command line: /bin/sh -c cd <https://builds.apache.org/job/HBase-0.92-security/ws/trunk> && /home/hudson/tools/java/jdk1.6.0_27-32/jre/bin/java -enableassertions -Xmx1400m -Djava.security.egd=file:/dev/./urandom -jar <https://builds.apache.org/job/HBase-0.92-security/ws/trunk/target/surefire/surefirebooter2504089033720424253.jar> <https://builds.apache.org/job/HBase-0.92-security/ws/trunk/target/surefire/surefire1485219406995285312tmp> <https://builds.apache.org/job/HBase-0.92-security/ws/trunk/target/surefire/surefire7463889483550666374tmp>
Running org.apache.hadoop.hbase.regionserver.TestHRegion
Tests run: 60, Failures: 0, Errors: 0, Skipped: 0, Time elapsed: 40.313 sec
Forking command line: /bin/sh -c cd <https://builds.apache.org/job/HBase-0.92-security/ws/trunk> && /home/hudson/tools/java/jdk1.6.0_27-32/jre/bin/java -enableassertions -Xmx1400m -Djava.security.egd=file:/dev/./urandom -jar <https://builds.apache.org/job/HBase-0.92-security/ws/trunk/target/surefire/surefirebooter9191529936425965939.jar> <https://builds.apache.org/job/HBase-0.92-security/ws/trunk/target/surefire/surefire7401033149634704743tmp> <https://builds.apache.org/job/HBase-0.92-security/ws/trunk/target/surefire/surefire7812662063202363224tmp>
Running org.apache.hadoop.hbase.regionserver.TestMinVersions
Tests run: 6, Failures: 0, Errors: 0, Skipped: 0, Time elapsed: 1.23 sec
Forking command line: /bin/sh -c cd <https://builds.apache.org/job/HBase-0.92-security/ws/trunk> && /home/hudson/tools/java/jdk1.6.0_27-32/jre/bin/java -enableassertions -Xmx1400m -Djava.security.egd=file:/dev/./urandom -jar <https://builds.apache.org/job/HBase-0.92-security/ws/trunk/target/surefire/surefirebooter6174559408276967720.jar> <https://builds.apache.org/job/HBase-0.92-security/ws/trunk/target/surefire/surefire7472085277703591528tmp> <https://builds.apache.org/job/HBase-0.92-security/ws/trunk/target/surefire/surefire6945978520166657554tmp>
Running org.apache.hadoop.hbase.client.TestGet
Tests run: 2, Failures: 0, Errors: 0, Skipped: 0, Time elapsed: 0.139 sec
Forking command line: /bin/sh -c cd <https://builds.apache.org/job/HBase-0.92-security/ws/trunk> && /home/hudson/tools/java/jdk1.6.0_27-32/jre/bin/java -enableassertions -Xmx1400m -Djava.security.egd=file:/dev/./urandom -jar <https://builds.apache.org/job/HBase-0.92-security/ws/trunk/target/surefire/surefirebooter7068338508992695744.jar> <https://builds.apache.org/job/HBase-0.92-security/ws/trunk/target/surefire/surefire1655635275888688588tmp> <https://builds.apache.org/job/HBase-0.92-security/ws/trunk/target/surefire/surefire2372313267375103615tmp>
Running org.apache.hadoop.hbase.client.TestAttributes
Tests run: 3, Failures: 0, Errors: 0, Skipped: 0, Time elapsed: 0.141 sec
Forking command line: /bin/sh -c cd <https://builds.apache.org/job/HBase-0.92-security/ws/trunk> && /home/hudson/tools/java/jdk1.6.0_27-32/jre/bin/java -enableassertions -Xmx1400m -Djava.security.egd=file:/dev/./urandom -jar <https://builds.apache.org/job/HBase-0.92-security/ws/trunk/target/surefire/surefirebooter1358315713128261591.jar> <https://builds.apache.org/job/HBase-0.92-security/ws/trunk/target/surefire/surefire3476466955482871190tmp> <https://builds.apache.org/job/HBase-0.92-security/ws/trunk/target/surefire/surefire6835998061599621640tmp>
Running org.apache.hadoop.hbase.client.TestResult
Tests run: 3, Failures: 0, Errors: 0, Skipped: 0, Time elapsed: 0.145 sec
Forking command line: /bin/sh -c cd <https://builds.apache.org/job/HBase-0.92-security/ws/trunk> && /home/hudson/tools/java/jdk1.6.0_27-32/jre/bin/java -enableassertions -Xmx1400m -Djava.security.egd=file:/dev/./urandom -jar <https://builds.apache.org/job/HBase-0.92-security/ws/trunk/target/surefire/surefirebooter998553967017624374.jar> <https://builds.apache.org/job/HBase-0.92-security/ws/trunk/target/surefire/surefire1843954988221090990tmp> <https://builds.apache.org/job/HBase-0.92-security/ws/trunk/target/surefire/surefire1779098364549393085tmp>
Running org.apache.hadoop.hbase.client.replication.TestReplicationAdmin
Tests run: 1, Failures: 0, Errors: 0, Skipped: 0, Time elapsed: 1.01 sec
Forking command line: /bin/sh -c cd <https://builds.apache.org/job/HBase-0.92-security/ws/trunk> && /home/hudson/tools/java/jdk1.6.0_27-32/jre/bin/java -enableassertions -Xmx1400m -Djava.security.egd=file:/dev/./urandom -jar <https://builds.apache.org/job/HBase-0.92-security/ws/trunk/target/surefire/surefirebooter511065718730439953.jar> <https://builds.apache.org/job/HBase-0.92-security/ws/trunk/target/surefire/surefire6505075292227423915tmp> <https://builds.apache.org/job/HBase-0.92-security/ws/trunk/target/surefire/surefire8251366000248773002tmp>
Running org.apache.hadoop.hbase.client.TestTimestampsFilter
Tests run: 3, Failures: 0, Errors: 0, Skipped: 0, Time elapsed: 37.054 sec
Forking command line: /bin/sh -c cd <https://builds.apache.org/job/HBase-0.92-security/ws/trunk> && /home/hudson/tools/java/jdk1.6.0_27-32/jre/bin/java -enableassertions -Xmx1400m -Djava.security.egd=file:/dev/./urandom -jar <https://builds.apache.org/job/HBase-0.92-security/ws/trunk/target/surefire/surefirebooter2586767733447437096.jar> <https://builds.apache.org/job/HBase-0.92-security/ws/trunk/target/surefire/surefire6521641436149801391tmp> <https://builds.apache.org/job/HBase-0.92-security/ws/trunk/target/surefire/surefire5406739123918103184tmp>
Running org.apache.hadoop.hbase.client.TestMultipleTimestamps
Tests run: 8, Failures: 0, Errors: 0, Skipped: 0, Time elapsed: 68.643 sec
Forking command line: /bin/sh -c cd <https://builds.apache.org/job/HBase-0.92-security/ws/trunk> && /home/hudson/tools/java/jdk1.6.0_27-32/jre/bin/java -enableassertions -Xmx1400m -Djava.security.egd=file:/dev/./urandom -jar <https://builds.apache.org/job/HBase-0.92-security/ws/trunk/target/surefire/surefirebooter7844156791793132983.jar> <https://builds.apache.org/job/HBase-0.92-security/ws/trunk/target/surefire/surefire3797722850998429665tmp> <https://builds.apache.org/job/HBase-0.92-security/ws/trunk/target/surefire/surefire6907377819372803744tmp>
Running org.apache.hadoop.hbase.client.TestFromClientSide
Tests run: 48, Failures: 0, Errors: 0, Skipped: 3, Time elapsed: 188.029 sec
Forking command line: /bin/sh -c cd <https://builds.apache.org/job/HBase-0.92-security/ws/trunk> && /home/hudson/tools/java/jdk1.6.0_27-32/jre/bin/java -enableassertions -Xmx1400m -Djava.security.egd=file:/dev/./urandom -jar <https://builds.apache.org/job/HBase-0.92-security/ws/trunk/target/surefire/surefirebooter70114445811652975.jar> <https://builds.apache.org/job/HBase-0.92-security/ws/trunk/target/surefire/surefire7052892079317826859tmp> <https://builds.apache.org/job/HBase-0.92-security/ws/trunk/target/surefire/surefire61354008709001525tmp>
Running org.apache.hadoop.hbase.client.TestHCM
Tests run: 5, Failures: 0, Errors: 0, Skipped: 0, Time elapsed: 25.568 sec
Forking command line: /bin/sh -c cd <https://builds.apache.org/job/HBase-0.92-security/ws/trunk> && /home/hudson/tools/java/jdk1.6.0_27-32/jre/bin/java -enableassertions -Xmx1400m -Djava.security.egd=file:/dev/./urandom -jar <https://builds.apache.org/job/HBase-0.92-security/ws/trunk/target/surefire/surefirebooter5721759603612916553.jar> <https://builds.apache.org/job/HBase-0.92-security/ws/trunk/target/surefire/surefire1227838384949469953tmp> <https://builds.apache.org/job/HBase-0.92-security/ws/trunk/target/surefire/surefire6932237190610394525tmp>
Running org.apache.hadoop.hbase.client.TestHTablePool
Tests run: 18, Failures: 0, Errors: 0, Skipped: 0, Time elapsed: 32.548 sec
Forking command line: /bin/sh -c cd <https://builds.apache.org/job/HBase-0.92-security/ws/trunk> && /home/hudson/tools/java/jdk1.6.0_27-32/jre/bin/java -enableassertions -Xmx1400m -Djava.security.egd=file:/dev/./urandom -jar <https://builds.apache.org/job/HBase-0.92-security/ws/trunk/target/surefire/surefirebooter7310216134736626648.jar> <https://builds.apache.org/job/HBase-0.92-security/ws/trunk/target/surefire/surefire1995728386317214153tmp> <https://builds.apache.org/job/HBase-0.92-security/ws/trunk/target/surefire/surefire1021711788608531220tmp>
Running org.apache.hadoop.hbase.client.TestHTableUtil
Tests run: 2, Failures: 0, Errors: 0, Skipped: 0, Time elapsed: 24.815 sec
Forking command line: /bin/sh -c cd <https://builds.apache.org/job/HBase-0.92-security/ws/trunk> && /home/hudson/tools/java/jdk1.6.0_27-32/jre/bin/java -enableassertions -Xmx1400m -Djava.security.egd=file:/dev/./urandom -jar <https://builds.apache.org/job/HBase-0.92-security/ws/trunk/target/surefire/surefirebooter1003830537375997635.jar> <https://builds.apache.org/job/HBase-0.92-security/ws/trunk/target/surefire/surefire6513949016467926459tmp> <https://builds.apache.org/job/HBase-0.92-security/ws/trunk/target/surefire/surefire1681158729879373381tmp>
Running org.apache.hadoop.hbase.client.TestScan
Tests run: 2, Failures: 0, Errors: 0, Skipped: 0, Time elapsed: 0.142 sec
Forking command line: /bin/sh -c cd <https://builds.apache.org/job/HBase-0.92-security/ws/trunk> && /home/hudson/tools/java/jdk1.6.0_27-32/jre/bin/java -enableassertions -Xmx1400m -Djava.security.egd=file:/dev/./urandom -jar <https://builds.apache.org/job/HBase-0.92-security/ws/trunk/target/surefire/surefirebooter3763030273236502913.jar> <https://builds.apache.org/job/HBase-0.92-security/ws/trunk/target/surefire/surefire610021059416674876tmp> <https://builds.apache.org/job/HBase-0.92-security/ws/trunk/target/surefire/surefire8683878720252145205tmp>
Running org.apache.hadoop.hbase.client.TestAdmin
Tests run: 35, Failures: 0, Errors: 0, Skipped: 0, Time elapsed: 508.432 sec
Forking command line: /bin/sh -c cd <https://builds.apache.org/job/HBase-0.92-security/ws/trunk> && /home/hudson/tools/java/jdk1.6.0_27-32/jre/bin/java -enableassertions -Xmx1400m -Djava.security.egd=file:/dev/./urandom -jar <https://builds.apache.org/job/HBase-0.92-security/ws/trunk/target/surefire/surefirebooter3845214957630800463.jar> <https://builds.apache.org/job/HBase-0.92-security/ws/trunk/target/surefire/surefire6048565991485863895tmp> <https://builds.apache.org/job/HBase-0.92-security/ws/trunk/target/surefire/surefire2311835179875053397tmp>
Running org.apache.hadoop.hbase.client.TestMetaScanner
Tests run: 1, Failures: 0, Errors: 0, Skipped: 0, Time elapsed: 23.468 sec
Forking command line: /bin/sh -c cd <https://builds.apache.org/job/HBase-0.92-security/ws/trunk> && /home/hudson/tools/java/jdk1.6.0_27-32/jre/bin/java -enableassertions -Xmx1400m -Djava.security.egd=file:/dev/./urandom -jar <https://builds.apache.org/job/HBase-0.92-security/ws/trunk/target/surefire/surefirebooter6378900933757450160.jar> <https://builds.apache.org/job/HBase-0.92-security/ws/trunk/target/surefire/surefire9030664195469127965tmp> <https://builds.apache.org/job/HBase-0.92-security/ws/trunk/target/surefire/surefire7688742743909728863tmp>
Running org.apache.hadoop.hbase.client.TestShell
Tests run: 1, Failures: 0, Errors: 0, Skipped: 0, Time elapsed: 100.82 sec
Forking command line: /bin/sh -c cd <https://builds.apache.org/job/HBase-0.92-security/ws/trunk> && /home/hudson/tools/java/jdk1.6.0_27-32/jre/bin/java -enableassertions -Xmx1400m -Djava.security.egd=file:/dev/./urandom -jar <https://builds.apache.org/job/HBase-0.92-security/ws/trunk/target/surefire/surefirebooter5573210948393309702.jar> <https://builds.apache.org/job/HBase-0.92-security/ws/trunk/target/surefire/surefire2989445415108939150tmp> <https://builds.apache.org/job/HBase-0.92-security/ws/trunk/target/surefire/surefire9213782271779106369tmp>
Running org.apache.hadoop.hbase.client.TestScannerTimeout
Tests run: 4, Failures: 0, Errors: 0, Skipped: 0, Time elapsed: 58.226 sec
Forking command line: /bin/sh -c cd <https://builds.apache.org/job/HBase-0.92-security/ws/trunk> && /home/hudson/tools/java/jdk1.6.0_27-32/jre/bin/java -enableassertions -Xmx1400m -Djava.security.egd=file:/dev/./urandom -jar <https://builds.apache.org/job/HBase-0.92-security/ws/trunk/target/surefire/surefirebooter3335300652901608648.jar> <https://builds.apache.org/job/HBase-0.92-security/ws/trunk/target/surefire/surefire7040134888209150245tmp> <https://builds.apache.org/job/HBase-0.92-security/ws/trunk/target/surefire/surefire870275335829027026tmp>
Running org.apache.hadoop.hbase.client.TestMetaMigrationRemovingHTD
Tests run: 3, Failures: 0, Errors: 0, Skipped: 0, Time elapsed: 33.228 sec
Forking command line: /bin/sh -c cd <https://builds.apache.org/job/HBase-0.92-security/ws/trunk> && /home/hudson/tools/java/jdk1.6.0_27-32/jre/bin/java -enableassertions -Xmx1400m -Djava.security.egd=file:/dev/./urandom -jar <https://builds.apache.org/job/HBase-0.92-security/ws/trunk/target/surefire/surefirebooter4694544096472701987.jar> <https://builds.apache.org/job/HBase-0.92-security/ws/trunk/target/surefire/surefire3918310451565829484tmp> <https://builds.apache.org/job/HBase-0.92-security/ws/trunk/target/surefire/surefire4969999111880532136tmp>
Running org.apache.hadoop.hbase.client.TestOperation
Tests run: 1, Failures: 0, Errors: 0, Skipped: 0, Time elapsed: 0.574 sec
Forking command line: /bin/sh -c cd <https://builds.apache.org/job/HBase-0.92-security/ws/trunk> && /home/hudson/tools/java/jdk1.6.0_27-32/jre/bin/java -enableassertions -Xmx1400m -Djava.security.egd=file:/dev/./urandom -jar <https://builds.apache.org/job/HBase-0.92-security/ws/trunk/target/surefire/surefirebooter5685006026066103020.jar> <https://builds.apache.org/job/HBase-0.92-security/ws/trunk/target/surefire/surefire5926638331411411893tmp> <https://builds.apache.org/job/HBase-0.92-security/ws/trunk/target/surefire/surefire8164480312793641914tmp>
Running org.apache.hadoop.hbase.client.TestMultiParallel
Tests run: 10, Failures: 0, Errors: 0, Skipped: 0, Time elapsed: 50.298 sec
Forking command line: /bin/sh -c cd <https://builds.apache.org/job/HBase-0.92-security/ws/trunk> && /home/hudson/tools/java/jdk1.6.0_27-32/jre/bin/java -enableassertions -Xmx1400m -Djava.security.egd=file:/dev/./urandom -jar <https://builds.apache.org/job/HBase-0.92-security/ws/trunk/target/surefire/surefirebooter4280716708475196145.jar> <https://builds.apache.org/job/HBase-0.92-security/ws/trunk/target/surefire/surefire2533934487813851876tmp> <https://builds.apache.org/job/HBase-0.92-security/ws/trunk/target/surefire/surefire6056686424436419010tmp>
Running org.apache.hadoop.hbase.TestMultiVersions
Tests run: 3, Failures: 0, Errors: 0, Skipped: 0, Time elapsed: 37.592 sec
Forking command line: /bin/sh -c cd <https://builds.apache.org/job/HBase-0.92-security/ws/trunk> && /home/hudson/tools/java/jdk1.6.0_27-32/jre/bin/java -enableassertions -Xmx1400m -Djava.security.egd=file:/dev/./urandom -jar <https://builds.apache.org/job/HBase-0.92-security/ws/trunk/target/surefire/surefirebooter4834961509884309403.jar> <https://builds.apache.org/job/HBase-0.92-security/ws/trunk/target/surefire/surefire2969561172203158698tmp> <https://builds.apache.org/job/HBase-0.92-security/ws/trunk/target/surefire/surefire7612774891105764222tmp>
Running org.apache.hadoop.hbase.thrift.TestThriftServer
Tests run: 1, Failures: 0, Errors: 0, Skipped: 0, Time elapsed: 25.904 sec
Forking command line: /bin/sh -c cd <https://builds.apache.org/job/HBase-0.92-security/ws/trunk> && /home/hudson/tools/java/jdk1.6.0_27-32/jre/bin/java -enableassertions -Xmx1400m -Djava.security.egd=file:/dev/./urandom -jar <https://builds.apache.org/job/HBase-0.92-security/ws/trunk/target/surefire/surefirebooter8991767387522424916.jar> <https://builds.apache.org/job/HBase-0.92-security/ws/trunk/target/surefire/surefire5480000479050531429tmp> <https://builds.apache.org/job/HBase-0.92-security/ws/trunk/target/surefire/surefire8508802550864797807tmp>
Running org.apache.hadoop.hbase.master.TestRollingRestart
Tests run: 1, Failures: 0, Errors: 0, Skipped: 0, Time elapsed: 84.438 sec
Forking command line: /bin/sh -c cd <https://builds.apache.org/job/HBase-0.92-security/ws/trunk> && /home/hudson/tools/java/jdk1.6.0_27-32/jre/bin/java -enableassertions -Xmx1400m -Djava.security.egd=file:/dev/./urandom -jar <https://builds.apache.org/job/HBase-0.92-security/ws/trunk/target/surefire/surefirebooter3313599253159433337.jar> <https://builds.apache.org/job/HBase-0.92-security/ws/trunk/target/surefire/surefire8119220355448405006tmp> <https://builds.apache.org/job/HBase-0.92-security/ws/trunk/target/surefire/surefire4564072730654400859tmp>
Running org.apache.hadoop.hbase.master.TestActiveMasterManager
Tests run: 2, Failures: 0, Errors: 0, Skipped: 0, Time elapsed: 1.003 sec
Forking command line: /bin/sh -c cd <https://builds.apache.org/job/HBase-0.92-security/ws/trunk> && /home/hudson/tools/java/jdk1.6.0_27-32/jre/bin/java -enableassertions -Xmx1400m -Djava.security.egd=file:/dev/./urandom -jar <https://builds.apache.org/job/HBase-0.92-security/ws/trunk/target/surefire/surefirebooter1296719534596361392.jar> <https://builds.apache.org/job/HBase-0.92-security/ws/trunk/target/surefire/surefire8834080027722368287tmp> <https://builds.apache.org/job/HBase-0.92-security/ws/trunk/target/surefire/surefire6851403756294347235tmp>
Running org.apache.hadoop.hbase.master.TestDeadServer
Tests run: 1, Failures: 0, Errors: 0, Skipped: 0, Time elapsed: 0.137 sec
Forking command line: /bin/sh -c cd <https://builds.apache.org/job/HBase-0.92-security/ws/trunk> && /home/hudson/tools/java/jdk1.6.0_27-32/jre/bin/java -enableassertions -Xmx1400m -Djava.security.egd=file:/dev/./urandom -jar <https://builds.apache.org/job/HBase-0.92-security/ws/trunk/target/surefire/surefirebooter1778692398314437295.jar> <https://builds.apache.org/job/HBase-0.92-security/ws/trunk/target/surefire/surefire496320404148886001tmp> <https://builds.apache.org/job/HBase-0.92-security/ws/trunk/target/surefire/surefire2319101983549049149tmp>
Running org.apache.hadoop.hbase.master.TestLogsCleaner
Tests run: 1, Failures: 0, Errors: 0, Skipped: 0, Time elapsed: 3.242 sec
Forking command line: /bin/sh -c cd <https://builds.apache.org/job/HBase-0.92-security/ws/trunk> && /home/hudson/tools/java/jdk1.6.0_27-32/jre/bin/java -enableassertions -Xmx1400m -Djava.security.egd=file:/dev/./urandom -jar <https://builds.apache.org/job/HBase-0.92-security/ws/trunk/target/surefire/surefirebooter7268406268966264841.jar> <https://builds.apache.org/job/HBase-0.92-security/ws/trunk/target/surefire/surefire6893084010004554985tmp> <https://builds.apache.org/job/HBase-0.92-security/ws/trunk/target/surefire/surefire7304304670749640078tmp>
Running org.apache.hadoop.hbase.master.TestZKBasedOpenCloseRegion
Tests run: 3, Failures: 0, Errors: 0, Skipped: 0, Time elapsed: 29.162 sec
Forking command line: /bin/sh -c cd <https://builds.apache.org/job/HBase-0.92-security/ws/trunk> && /home/hudson/tools/java/jdk1.6.0_27-32/jre/bin/java -enableassertions -Xmx1400m -Djava.security.egd=file:/dev/./urandom -jar <https://builds.apache.org/job/HBase-0.92-security/ws/trunk/target/surefire/surefirebooter7234135813720967321.jar> <https://builds.apache.org/job/HBase-0.92-security/ws/trunk/target/surefire/surefire867463978202853016tmp> <https://builds.apache.org/job/HBase-0.92-security/ws/trunk/target/surefire/surefire8269092998991008114tmp>
Running org.apache.hadoop.hbase.master.TestMaster
Tests run: 1, Failures: 0, Errors: 0, Skipped: 0, Time elapsed: 23.26 sec
Forking command line: /bin/sh -c cd <https://builds.apache.org/job/HBase-0.92-security/ws/trunk> && /home/hudson/tools/java/jdk1.6.0_27-32/jre/bin/java -enableassertions -Xmx1400m -Djava.security.egd=file:/dev/./urandom -jar <https://builds.apache.org/job/HBase-0.92-security/ws/trunk/target/surefire/surefirebooter7890554470030229707.jar> <https://builds.apache.org/job/HBase-0.92-security/ws/trunk/target/surefire/surefire66283340716689352tmp> <https://builds.apache.org/job/HBase-0.92-security/ws/trunk/target/surefire/surefire3401430348559032156tmp>
Running org.apache.hadoop.hbase.master.TestMasterTransitions
Tests run: 3, Failures: 0, Errors: 0, Skipped: 3, Time elapsed: 27.481 sec
Forking command line: /bin/sh -c cd <https://builds.apache.org/job/HBase-0.92-security/ws/trunk> && /home/hudson/tools/java/jdk1.6.0_27-32/jre/bin/java -enableassertions -Xmx1400m -Djava.security.egd=file:/dev/./urandom -jar <https://builds.apache.org/job/HBase-0.92-security/ws/trunk/target/surefire/surefirebooter9180948813662953844.jar> <https://builds.apache.org/job/HBase-0.92-security/ws/trunk/target/surefire/surefire2853159749741190491tmp> <https://builds.apache.org/job/HBase-0.92-security/ws/trunk/target/surefire/surefire7224198318129333679tmp>
Running org.apache.hadoop.hbase.master.TestOpenedRegionHandler
Tests run: 2, Failures: 0, Errors: 0, Skipped: 0, Time elapsed: 24.74 sec
Forking command line: /bin/sh -c cd <https://builds.apache.org/job/HBase-0.92-security/ws/trunk> && /home/hudson/tools/java/jdk1.6.0_27-32/jre/bin/java -enableassertions -Xmx1400m -Djava.security.egd=file:/dev/./urandom -jar <https://builds.apache.org/job/HBase-0.92-security/ws/trunk/target/surefire/surefirebooter5937669954423671547.jar> <https://builds.apache.org/job/HBase-0.92-security/ws/trunk/target/surefire/surefire4458151592902094636tmp> <https://builds.apache.org/job/HBase-0.92-security/ws/trunk/target/surefire/surefire2262421880340517086tmp>
Running org.apache.hadoop.hbase.master.TestClockSkewDetection
Tests run: 1, Failures: 0, Errors: 0, Skipped: 0, Time elapsed: 0.245 sec
Forking command line: /bin/sh -c cd <https://builds.apache.org/job/HBase-0.92-security/ws/trunk> && /home/hudson/tools/java/jdk1.6.0_27-32/jre/bin/java -enableassertions -Xmx1400m -Djava.security.egd=file:/dev/./urandom -jar <https://builds.apache.org/job/HBase-0.92-security/ws/trunk/target/surefire/surefirebooter8783462897193873897.jar> <https://builds.apache.org/job/HBase-0.92-security/ws/trunk/target/surefire/surefire4396243395895671774tmp> <https://builds.apache.org/job/HBase-0.92-security/ws/trunk/target/surefire/surefire2072932319388358951tmp>
Running org.apache.hadoop.hbase.master.TestCatalogJanitor
Tests run: 4, Failures: 0, Errors: 0, Skipped: 0, Time elapsed: 7.293 sec
Forking command line: /bin/sh -c cd <https://builds.apache.org/job/HBase-0.92-security/ws/trunk> && /home/hudson/tools/java/jdk1.6.0_27-32/jre/bin/java -enableassertions -Xmx1400m -Djava.security.egd=file:/dev/./urandom -jar <https://builds.apache.org/job/HBase-0.92-security/ws/trunk/target/surefire/surefirebooter3170083798376927248.jar> <https://builds.apache.org/job/HBase-0.92-security/ws/trunk/target/surefire/surefire6508585776687992134tmp> <https://builds.apache.org/job/HBase-0.92-security/ws/trunk/target/surefire/surefire4694465311607559684tmp>
Running org.apache.hadoop.hbase.master.TestMXBean
Tests run: 1, Failures: 0, Errors: 0, Skipped: 0, Time elapsed: 22.004 sec
Forking command line: /bin/sh -c cd <https://builds.apache.org/job/HBase-0.92-security/ws/trunk> && /home/hudson/tools/java/jdk1.6.0_27-32/jre/bin/java -enableassertions -Xmx1400m -Djava.security.egd=file:/dev/./urandom -jar <https://builds.apache.org/job/HBase-0.92-security/ws/trunk/target/surefire/surefirebooter4549969034979631622.jar> <https://builds.apache.org/job/HBase-0.92-security/ws/trunk/target/surefire/surefire5369429654941955055tmp> <https://builds.apache.org/job/HBase-0.92-security/ws/trunk/target/surefire/surefire596418980433374882tmp>
Running org.apache.hadoop.hbase.master.TestSplitLogManager
Tests run: 12, Failures: 0, Errors: 0, Skipped: 0, Time elapsed: 15.868 sec
Forking command line: /bin/sh -c cd <https://builds.apache.org/job/HBase-0.92-security/ws/trunk> && /home/hudson/tools/java/jdk1.6.0_27-32/jre/bin/java -enableassertions -Xmx1400m -Djava.security.egd=file:/dev/./urandom -jar <https://builds.apache.org/job/HBase-0.92-security/ws/trunk/target/surefire/surefirebooter3430691919810464836.jar> <https://builds.apache.org/job/HBase-0.92-security/ws/trunk/target/surefire/surefire9027958204907849465tmp> <https://builds.apache.org/job/HBase-0.92-security/ws/trunk/target/surefire/surefire1943595621628380508tmp>
Running org.apache.hadoop.hbase.master.TestMasterRestartAfterDisablingTable
Tests run: 1, Failures: 0, Errors: 0, Skipped: 0, Time elapsed: 28.538 sec
Forking command line: /bin/sh -c cd <https://builds.apache.org/job/HBase-0.92-security/ws/trunk> && /home/hudson/tools/java/jdk1.6.0_27-32/jre/bin/java -enableassertions -Xmx1400m -Djava.security.egd=file:/dev/./urandom -jar <https://builds.apache.org/job/HBase-0.92-security/ws/trunk/target/surefire/surefirebooter2658709682683110671.jar> <https://builds.apache.org/job/HBase-0.92-security/ws/trunk/target/surefire/surefire5638018464909990542tmp> <https://builds.apache.org/job/HBase-0.92-security/ws/trunk/target/surefire/surefire5008999085995331213tmp>
Running org.apache.hadoop.hbase.master.TestDistributedLogSplitting
Tests run: 4, Failures: 0, Errors: 0, Skipped: 0, Time elapsed: 144.609 sec
Forking command line: /bin/sh -c cd <https://builds.apache.org/job/HBase-0.92-security/ws/trunk> && /home/hudson/tools/java/jdk1.6.0_27-32/jre/bin/java -enableassertions -Xmx1400m -Djava.security.egd=file:/dev/./urandom -jar <https://builds.apache.org/job/HBase-0.92-security/ws/trunk/target/surefire/surefirebooter7861042299446742715.jar> <https://builds.apache.org/job/HBase-0.92-security/ws/trunk/target/surefire/surefire2287244971715508185tmp> <https://builds.apache.org/job/HBase-0.92-security/ws/trunk/target/surefire/surefire685831839141423307tmp>
Running org.apache.hadoop.hbase.master.TestDefaultLoadBalancer
Tests run: 4, Failures: 0, Errors: 0, Skipped: 0, Time elapsed: 1.439 sec
Forking command line: /bin/sh -c cd <https://builds.apache.org/job/HBase-0.92-security/ws/trunk> && /home/hudson/tools/java/jdk1.6.0_27-32/jre/bin/java -enableassertions -Xmx1400m -Djava.security.egd=file:/dev/./urandom -jar <https://builds.apache.org/job/HBase-0.92-security/ws/trunk/target/surefire/surefirebooter3021262313960506.jar> <https://builds.apache.org/job/HBase-0.92-security/ws/trunk/target/surefire/surefire8507161409090171918tmp> <https://builds.apache.org/job/HBase-0.92-security/ws/trunk/target/surefire/surefire6745485089933541678tmp>
Running org.apache.hadoop.hbase.master.TestMasterStatusServlet
Tests run: 5, Failures: 0, Errors: 0, Skipped: 0, Time elapsed: 1.053 sec
Forking command line: /bin/sh -c cd <https://builds.apache.org/job/HBase-0.92-security/ws/trunk> && /home/hudson/tools/java/jdk1.6.0_27-32/jre/bin/java -enableassertions -Xmx1400m -Djava.security.egd=file:/dev/./urandom -jar <https://builds.apache.org/job/HBase-0.92-security/ws/trunk/target/surefire/surefirebooter5298708320066803803.jar> <https://builds.apache.org/job/HBase-0.92-security/ws/trunk/target/surefire/surefire6638697598421421790tmp> <https://builds.apache.org/job/HBase-0.92-security/ws/trunk/target/surefire/surefire2974061618130697825tmp>
Running org.apache.hadoop.hbase.master.TestHMasterRPCException
Tests run: 1, Failures: 0, Errors: 0, Skipped: 0, Time elapsed: 1.258 sec
Forking command line: /bin/sh -c cd <https://builds.apache.org/job/HBase-0.92-security/ws/trunk> && /home/hudson/tools/java/jdk1.6.0_27-32/jre/bin/java -enableassertions -Xmx1400m -Djava.security.egd=file:/dev/./urandom -jar <https://builds.apache.org/job/HBase-0.92-security/ws/trunk/target/surefire/surefirebooter8350151237831115574.jar> <https://builds.apache.org/job/HBase-0.92-security/ws/trunk/target/surefire/surefire3079791998790673106tmp> <https://builds.apache.org/job/HBase-0.92-security/ws/trunk/target/surefire/surefire4799296074316940917tmp>
Running org.apache.hadoop.hbase.master.TestMasterFailover
Tests run: 4, Failures: 0, Errors: 1, Skipped: 0, Time elapsed: 252.782 sec <<< FAILURE!
Forking command line: /bin/sh -c cd <https://builds.apache.org/job/HBase-0.92-security/ws/trunk> && /home/hudson/tools/java/jdk1.6.0_27-32/jre/bin/java -enableassertions -Xmx1400m -Djava.security.egd=file:/dev/./urandom -jar <https://builds.apache.org/job/HBase-0.92-security/ws/trunk/target/surefire/surefirebooter8917866802780765451.jar> <https://builds.apache.org/job/HBase-0.92-security/ws/trunk/target/surefire/surefire3310620312332704738tmp> <https://builds.apache.org/job/HBase-0.92-security/ws/trunk/target/surefire/surefire7088538721855311459tmp>
Running org.apache.hadoop.hbase.master.TestMasterZKSessionRecovery
Tests run: 2, Failures: 0, Errors: 0, Skipped: 0, Time elapsed: 35.999 sec
Forking command line: /bin/sh -c cd <https://builds.apache.org/job/HBase-0.92-security/ws/trunk> && /home/hudson/tools/java/jdk1.6.0_27-32/jre/bin/java -enableassertions -Xmx1400m -Djava.security.egd=file:/dev/./urandom -jar <https://builds.apache.org/job/HBase-0.92-security/ws/trunk/target/surefire/surefirebooter8111471391289104305.jar> <https://builds.apache.org/job/HBase-0.92-security/ws/trunk/target/surefire/surefire4867547367419604056tmp> <https://builds.apache.org/job/HBase-0.92-security/ws/trunk/target/surefire/surefire2125601169569634522tmp>
Running org.apache.hadoop.hbase.master.TestRestartCluster
Tests run: 2, Failures: 0, Errors: 0, Skipped: 0, Time elapsed: 56.311 sec
Forking command line: /bin/sh -c cd <https://builds.apache.org/job/HBase-0.92-security/ws/trunk> && /home/hudson/tools/java/jdk1.6.0_27-32/jre/bin/java -enableassertions -Xmx1400m -Djava.security.egd=file:/dev/./urandom -jar <https://builds.apache.org/job/HBase-0.92-security/ws/trunk/target/surefire/surefirebooter3725495182164046574.jar> <https://builds.apache.org/job/HBase-0.92-security/ws/trunk/target/surefire/surefire727183424001706714tmp> <https://builds.apache.org/job/HBase-0.92-security/ws/trunk/target/surefire/surefire6753398805693387821tmp>
Running org.apache.hadoop.hbase.migration.TestMigrationFrom090To092
Tests run: 1, Failures: 0, Errors: 0, Skipped: 0, Time elapsed: 0.274 sec
Forking command line: /bin/sh -c cd <https://builds.apache.org/job/HBase-0.92-security/ws/trunk> && /home/hudson/tools/java/jdk1.6.0_27-32/jre/bin/java -enableassertions -Xmx1400m -Djava.security.egd=file:/dev/./urandom -jar <https://builds.apache.org/job/HBase-0.92-security/ws/trunk/target/surefire/surefirebooter6953051553513460853.jar> <https://builds.apache.org/job/HBase-0.92-security/ws/trunk/target/surefire/surefire7374840216019840762tmp> <https://builds.apache.org/job/HBase-0.92-security/ws/trunk/target/surefire/surefire8326558292310833382tmp>
Running org.apache.hadoop.hbase.TestRegionRebalancing
Tests run: 1, Failures: 0, Errors: 0, Skipped: 0, Time elapsed: 62.952 sec
Forking command line: /bin/sh -c cd <https://builds.apache.org/job/HBase-0.92-security/ws/trunk> && /home/hudson/tools/java/jdk1.6.0_27-32/jre/bin/java -enableassertions -Xmx1400m -Djava.security.egd=file:/dev/./urandom -jar <https://builds.apache.org/job/HBase-0.92-security/ws/trunk/target/surefire/surefirebooter7590637889103684251.jar> <https://builds.apache.org/job/HBase-0.92-security/ws/trunk/target/surefire/surefire5424791051635693194tmp> <https://builds.apache.org/job/HBase-0.92-security/ws/trunk/target/surefire/surefire6670653603661874812tmp>
Running org.apache.hadoop.hbase.avro.TestAvroUtil
Tests run: 1, Failures: 0, Errors: 0, Skipped: 0, Time elapsed: 0.736 sec
Forking command line: /bin/sh -c cd <https://builds.apache.org/job/HBase-0.92-security/ws/trunk> && /home/hudson/tools/java/jdk1.6.0_27-32/jre/bin/java -enableassertions -Xmx1400m -Djava.security.egd=file:/dev/./urandom -jar <https://builds.apache.org/job/HBase-0.92-security/ws/trunk/target/surefire/surefirebooter412806921240905012.jar> <https://builds.apache.org/job/HBase-0.92-security/ws/trunk/target/surefire/surefire3271785110508410988tmp> <https://builds.apache.org/job/HBase-0.92-security/ws/trunk/target/surefire/surefire7656773687968937102tmp>
Running org.apache.hadoop.hbase.avro.TestAvroServer
Tests run: 3, Failures: 0, Errors: 0, Skipped: 0, Time elapsed: 39.183 sec
Forking command line: /bin/sh -c cd <https://builds.apache.org/job/HBase-0.92-security/ws/trunk> && /home/hudson/tools/java/jdk1.6.0_27-32/jre/bin/java -enableassertions -Xmx1400m -Djava.security.egd=file:/dev/./urandom -jar <https://builds.apache.org/job/HBase-0.92-security/ws/trunk/target/surefire/surefirebooter6946509300077556833.jar> <https://builds.apache.org/job/HBase-0.92-security/ws/trunk/target/surefire/surefire2850891436931908073tmp> <https://builds.apache.org/job/HBase-0.92-security/ws/trunk/target/surefire/surefire2818471464054269051tmp>
Running org.apache.hadoop.hbase.TestAcidGuarantees
Tests run: 3, Failures: 0, Errors: 0, Skipped: 0, Time elapsed: 122.719 sec
Forking command line: /bin/sh -c cd <https://builds.apache.org/job/HBase-0.92-security/ws/trunk> && /home/hudson/tools/java/jdk1.6.0_27-32/jre/bin/java -enableassertions -Xmx1400m -Djava.security.egd=file:/dev/./urandom -jar <https://builds.apache.org/job/HBase-0.92-security/ws/trunk/target/surefire/surefirebooter4033461518687310637.jar> <https://builds.apache.org/job/HBase-0.92-security/ws/trunk/target/surefire/surefire3412717524281192361tmp> <https://builds.apache.org/job/HBase-0.92-security/ws/trunk/target/surefire/surefire5977741238843325355tmp>
Running org.apache.hadoop.hbase.TestHRegionLocation
Tests run: 3, Failures: 0, Errors: 0, Skipped: 0, Time elapsed: 0.142 sec
Forking command line: /bin/sh -c cd <https://builds.apache.org/job/HBase-0.92-security/ws/trunk> && /home/hudson/tools/java/jdk1.6.0_27-32/jre/bin/java -enableassertions -Xmx1400m -Djava.security.egd=file:/dev/./urandom -jar <https://builds.apache.org/job/HBase-0.92-security/ws/trunk/target/surefire/surefirebooter5962657412228187187.jar> <https://builds.apache.org/job/HBase-0.92-security/ws/trunk/target/surefire/surefire4410558702508914318tmp> <https://builds.apache.org/job/HBase-0.92-security/ws/trunk/target/surefire/surefire6204514964256245186tmp>
Running org.apache.hadoop.hbase.TestZooKeeper
Tests run: 7, Failures: 0, Errors: 0, Skipped: 0, Time elapsed: 89.785 sec
Forking command line: /bin/sh -c cd <https://builds.apache.org/job/HBase-0.92-security/ws/trunk> && /home/hudson/tools/java/jdk1.6.0_27-32/jre/bin/java -enableassertions -Xmx1400m -Djava.security.egd=file:/dev/./urandom -jar <https://builds.apache.org/job/HBase-0.92-security/ws/trunk/target/surefire/surefirebooter6595098039704698299.jar> <https://builds.apache.org/job/HBase-0.92-security/ws/trunk/target/surefire/surefire5293147615950370509tmp> <https://builds.apache.org/job/HBase-0.92-security/ws/trunk/target/surefire/surefire1444439499318339545tmp>
Running org.apache.hadoop.hbase.TestCompare
Tests run: 1, Failures: 0, Errors: 0, Skipped: 0, Time elapsed: 0.245 sec
Forking command line: /bin/sh -c cd <https://builds.apache.org/job/HBase-0.92-security/ws/trunk> && /home/hudson/tools/java/jdk1.6.0_27-32/jre/bin/java -enableassertions -Xmx1400m -Djava.security.egd=file:/dev/./urandom -jar <https://builds.apache.org/job/HBase-0.92-security/ws/trunk/target/surefire/surefirebooter4913566014872588004.jar> <https://builds.apache.org/job/HBase-0.92-security/ws/trunk/target/surefire/surefire8004574389229298677tmp> <https://builds.apache.org/job/HBase-0.92-security/ws/trunk/target/surefire/surefire7148492561741202264tmp>
Running org.apache.hadoop.hbase.ipc.TestDelayedRpc
Tests run: 4, Failures: 0, Errors: 0, Skipped: 0, Time elapsed: 2.301 sec
Forking command line: /bin/sh -c cd <https://builds.apache.org/job/HBase-0.92-security/ws/trunk> && /home/hudson/tools/java/jdk1.6.0_27-32/jre/bin/java -enableassertions -Xmx1400m -Djava.security.egd=file:/dev/./urandom -jar <https://builds.apache.org/job/HBase-0.92-security/ws/trunk/target/surefire/surefirebooter4549404613211159126.jar> <https://builds.apache.org/job/HBase-0.92-security/ws/trunk/target/surefire/surefire13486563446494064tmp> <https://builds.apache.org/job/HBase-0.92-security/ws/trunk/target/surefire/surefire2115522193230893780tmp>
Running org.apache.hadoop.hbase.TestFSTableDescriptorForceCreation
Tests run: 3, Failures: 0, Errors: 0, Skipped: 0, Time elapsed: 0.593 sec
Forking command line: /bin/sh -c cd <https://builds.apache.org/job/HBase-0.92-security/ws/trunk> && /home/hudson/tools/java/jdk1.6.0_27-32/jre/bin/java -enableassertions -Xmx1400m -Djava.security.egd=file:/dev/./urandom -jar <https://builds.apache.org/job/HBase-0.92-security/ws/trunk/target/surefire/surefirebooter7144215574479371840.jar> <https://builds.apache.org/job/HBase-0.92-security/ws/trunk/target/surefire/surefire3839838738264425481tmp> <https://builds.apache.org/job/HBase-0.92-security/ws/trunk/target/surefire/surefire2220953026973209588tmp>
Running org.apache.hadoop.hbase.TestInfoServers
Tests run: 2, Failures: 0, Errors: 0, Skipped: 0, Time elapsed: 19.201 sec

Results :

Failed tests:   testExistingZnodeBlocksSplitAndWeRollback(org.apache.hadoop.hbase.regionserver.TestSplitTransactionOnCluster): expected:<1> but was:<0>

Tests in error: 
  testMasterFailoverWithMockedRITOnDeadRS(org.apache.hadoop.hbase.master.TestMasterFailover): test timed out after 180000 milliseconds

Tests run: 1126, Failures: 1, Errors: 1, Skipped: 8

[INFO] ------------------------------------------------------------------------
[INFO] BUILD FAILURE
[INFO] ------------------------------------------------------------------------
[INFO] Total time: 2:15:39.279s
[INFO] Finished at: Sun Mar 25 17:04:32 UTC 2012
[INFO] Final Memory: 41M/608M
[INFO] ------------------------------------------------------------------------
[ERROR] Failed to execute goal org.apache.maven.plugins:maven-surefire-plugin:2.10:test (default-test) on project hbase: There are test failures.
[ERROR] 
[ERROR] Please refer to <https://builds.apache.org/job/HBase-0.92-security/ws/trunk/target/surefire-reports> for the individual test results.
[ERROR] -> [Help 1]
org.apache.maven.lifecycle.LifecycleExecutionException: Failed to execute goal org.apache.maven.plugins:maven-surefire-plugin:2.10:test (default-test) on project hbase: There are test failures.

Please refer to <https://builds.apache.org/job/HBase-0.92-security/ws/trunk/target/surefire-reports> for the individual test results.
	at org.apache.maven.lifecycle.internal.MojoExecutor.execute(MojoExecutor.java:213)
	at org.apache.maven.lifecycle.internal.MojoExecutor.execute(MojoExecutor.java:153)
	at org.apache.maven.lifecycle.internal.MojoExecutor.execute(MojoExecutor.java:145)
	at org.apache.maven.lifecycle.internal.LifecycleModuleBuilder.buildProject(LifecycleModuleBuilder.java:84)
	at org.apache.maven.lifecycle.internal.LifecycleModuleBuilder.buildProject(LifecycleModuleBuilder.java:59)
	at org.apache.maven.lifecycle.internal.LifecycleStarter.singleThreadedBuild(LifecycleStarter.java:183)
	at org.apache.maven.lifecycle.internal.LifecycleStarter.execute(LifecycleStarter.java:161)
	at org.apache.maven.DefaultMaven.doExecute(DefaultMaven.java:319)
	at org.apache.maven.DefaultMaven.execute(DefaultMaven.java:156)
	at org.apache.maven.cli.MavenCli.execute(MavenCli.java:537)
	at org.apache.maven.cli.MavenCli.doMain(MavenCli.java:196)
	at org.apache.maven.cli.MavenCli.main(MavenCli.java:141)
	at sun.reflect.NativeMethodAccessorImpl.invoke0(Native Method)
	at sun.reflect.NativeMethodAccessorImpl.invoke(NativeMethodAccessorImpl.java:39)
	at sun.reflect.DelegatingMethodAccessorImpl.invoke(DelegatingMethodAccessorImpl.java:25)
	at java.lang.reflect.Method.invoke(Method.java:597)
	at org.codehaus.plexus.classworlds.launcher.Launcher.launchEnhanced(Launcher.java:290)
	at org.codehaus.plexus.classworlds.launcher.Launcher.launch(Launcher.java:230)
	at org.codehaus.plexus.classworlds.launcher.Launcher.mainWithExitCode(Launcher.java:409)
	at org.codehaus.plexus.classworlds.launcher.Launcher.main(Launcher.java:352)
Caused by: org.apache.maven.plugin.MojoFailureException: There are test failures.

Please refer to <https://builds.apache.org/job/HBase-0.92-security/ws/trunk/target/surefire-reports> for the individual test results.
	at org.apache.maven.plugin.surefire.SurefireHelper.reportExecution(SurefireHelper.java:87)
	at org.apache.maven.plugin.surefire.SurefirePlugin.writeSummary(SurefirePlugin.java:641)
	at org.apache.maven.plugin.surefire.SurefirePlugin.handleSummary(SurefirePlugin.java:615)
	at org.apache.maven.plugin.surefire.AbstractSurefireMojo.executeAfterPreconditionsChecked(AbstractSurefireMojo.java:137)
	at org.apache.maven.plugin.surefire.AbstractSurefireMojo.execute(AbstractSurefireMojo.java:98)
	at org.apache.maven.plugin.DefaultBuildPluginManager.executeMojo(DefaultBuildPluginManager.java:101)
	at org.apache.maven.lifecycle.internal.MojoExecutor.execute(MojoExecutor.java:209)
	... 19 more
[ERROR] 
[ERROR] 
[ERROR] For more information about the errors and possible solutions, please read the following articles:
[ERROR] [Help 1] http://cwiki.apache.org/confluence/display/MAVEN/MojoFailureException
Build step 'Invoke top-level Maven targets' marked build as failure
Archiving artifacts
Error updating JIRA issues. Saving issues for next build.
com.atlassian.jira.rpc.exception.RemotePermissionException: This issue does not exist or you don't have permission to view it.
Recording test results

Mime
View raw message