hbase-dev mailing list archives

Site index · List index
Message view « Date » · « Thread »
Top « Date » · « Thread »
From Apache Jenkins Server <jenk...@builds.apache.org>
Subject Build failed in Jenkins: HBase-0.94 #17
Date Tue, 06 Mar 2012 22:02:57 GMT
See <https://builds.apache.org/job/HBase-0.94/17/changes>

Changes:

[stack] HBASE-5519 Incorrect warning in splitlogmanager

[stack] HBASE-5522 hbase 0.92 test artifacts are missing from Maven central

------------------------------------------
[...truncated 7083 lines...]
Forking command line: /bin/sh -c cd <https://builds.apache.org/job/HBase-0.94/ws/trunk>
&& /home/hudson/tools/java/jdk1.6.0_27-32/jre/bin/java -enableassertions -Xmx1900m
-Djava.security.egd=file:/dev/./urandom -jar <https://builds.apache.org/job/HBase-0.94/ws/trunk/target/surefire/surefirebooter6685151804505587495.jar>
<https://builds.apache.org/job/HBase-0.94/ws/trunk/target/surefire/surefire5756488562262400580tmp>
<https://builds.apache.org/job/HBase-0.94/ws/trunk/target/surefire/surefire_566096856255954400782tmp>
Running org.apache.hadoop.hbase.util.TestMergeTable
Tests run: 1, Failures: 0, Errors: 0, Skipped: 0, Time elapsed: 34.953 sec
Forking command line: /bin/sh -c cd <https://builds.apache.org/job/HBase-0.94/ws/trunk>
&& /home/hudson/tools/java/jdk1.6.0_27-32/jre/bin/java -enableassertions -Xmx1900m
-Djava.security.egd=file:/dev/./urandom -jar <https://builds.apache.org/job/HBase-0.94/ws/trunk/target/surefire/surefirebooter4296476815518354278.jar>
<https://builds.apache.org/job/HBase-0.94/ws/trunk/target/surefire/surefire205480502150410628tmp>
<https://builds.apache.org/job/HBase-0.94/ws/trunk/target/surefire/surefire_573071977741962851981tmp>
Running org.apache.hadoop.hbase.util.hbck.TestOfflineMetaRebuildOverlap
Tests run: 1, Failures: 0, Errors: 0, Skipped: 0, Time elapsed: 24.437 sec
Forking command line: /bin/sh -c cd <https://builds.apache.org/job/HBase-0.94/ws/trunk>
&& /home/hudson/tools/java/jdk1.6.0_27-32/jre/bin/java -enableassertions -Xmx1900m
-Djava.security.egd=file:/dev/./urandom -jar <https://builds.apache.org/job/HBase-0.94/ws/trunk/target/surefire/surefirebooter5420210717148096916.jar>
<https://builds.apache.org/job/HBase-0.94/ws/trunk/target/surefire/surefire7119091388311382112tmp>
<https://builds.apache.org/job/HBase-0.94/ws/trunk/target/surefire/surefire_583961407676718258120tmp>
Running org.apache.hadoop.hbase.util.hbck.TestOfflineMetaRebuildBase
Tests run: 1, Failures: 0, Errors: 0, Skipped: 0, Time elapsed: 25.317 sec
Forking command line: /bin/sh -c cd <https://builds.apache.org/job/HBase-0.94/ws/trunk>
&& /home/hudson/tools/java/jdk1.6.0_27-32/jre/bin/java -enableassertions -Xmx1900m
-Djava.security.egd=file:/dev/./urandom -jar <https://builds.apache.org/job/HBase-0.94/ws/trunk/target/surefire/surefirebooter7977900803169608603.jar>
<https://builds.apache.org/job/HBase-0.94/ws/trunk/target/surefire/surefire4165120891398446700tmp>
<https://builds.apache.org/job/HBase-0.94/ws/trunk/target/surefire/surefire_593427903332949855629tmp>
Running org.apache.hadoop.hbase.util.TestPoolMap$TestRoundRobinPoolType
Tests run: 3, Failures: 0, Errors: 0, Skipped: 0, Time elapsed: 0.013 sec
Running org.apache.hadoop.hbase.util.TestPoolMap$TestThreadLocalPoolType
Tests run: 3, Failures: 0, Errors: 0, Skipped: 0, Time elapsed: 0.01 sec
Running org.apache.hadoop.hbase.util.TestPoolMap$TestReusablePoolType
Tests run: 3, Failures: 0, Errors: 0, Skipped: 0, Time elapsed: 0.038 sec
Forking command line: /bin/sh -c cd <https://builds.apache.org/job/HBase-0.94/ws/trunk>
&& /home/hudson/tools/java/jdk1.6.0_27-32/jre/bin/java -enableassertions -Xmx1900m
-Djava.security.egd=file:/dev/./urandom -jar <https://builds.apache.org/job/HBase-0.94/ws/trunk/target/surefire/surefirebooter3037427089195065904.jar>
<https://builds.apache.org/job/HBase-0.94/ws/trunk/target/surefire/surefire3404241211437158541tmp>
<https://builds.apache.org/job/HBase-0.94/ws/trunk/target/surefire/surefire_608754337890419934095tmp>
Running org.apache.hadoop.hbase.util.hbck.TestOfflineMetaRebuildHole
Tests run: 1, Failures: 0, Errors: 0, Skipped: 0, Time elapsed: 22.969 sec
Forking command line: /bin/sh -c cd <https://builds.apache.org/job/HBase-0.94/ws/trunk>
&& /home/hudson/tools/java/jdk1.6.0_27-32/jre/bin/java -enableassertions -Xmx1900m
-Djava.security.egd=file:/dev/./urandom -jar <https://builds.apache.org/job/HBase-0.94/ws/trunk/target/surefire/surefirebooter112000453326623093.jar>
<https://builds.apache.org/job/HBase-0.94/ws/trunk/target/surefire/surefire988251142175883324tmp>
<https://builds.apache.org/job/HBase-0.94/ws/trunk/target/surefire/surefire_618045993858749850670tmp>
Running org.apache.hadoop.hbase.util.TestIdLock
Tests run: 1, Failures: 0, Errors: 0, Skipped: 0, Time elapsed: 15.299 sec
Forking command line: /bin/sh -c cd <https://builds.apache.org/job/HBase-0.94/ws/trunk>
&& /home/hudson/tools/java/jdk1.6.0_27-32/jre/bin/java -enableassertions -Xmx1900m
-Djava.security.egd=file:/dev/./urandom -jar <https://builds.apache.org/job/HBase-0.94/ws/trunk/target/surefire/surefirebooter1979182966580374491.jar>
<https://builds.apache.org/job/HBase-0.94/ws/trunk/target/surefire/surefire2661926576534972859tmp>
<https://builds.apache.org/job/HBase-0.94/ws/trunk/target/surefire/surefire_62908267731661341054tmp>
Running org.apache.hadoop.hbase.util.TestDefaultEnvironmentEdge
Tests run: 1, Failures: 0, Errors: 0, Skipped: 0, Time elapsed: 0.218 sec
Forking command line: /bin/sh -c cd <https://builds.apache.org/job/HBase-0.94/ws/trunk>
&& /home/hudson/tools/java/jdk1.6.0_27-32/jre/bin/java -enableassertions -Xmx1900m
-Djava.security.egd=file:/dev/./urandom -jar <https://builds.apache.org/job/HBase-0.94/ws/trunk/target/surefire/surefirebooter1284659661233944210.jar>
<https://builds.apache.org/job/HBase-0.94/ws/trunk/target/surefire/surefire3104937774841041635tmp>
<https://builds.apache.org/job/HBase-0.94/ws/trunk/target/surefire/surefire_635110198138093066083tmp>
Running org.apache.hadoop.hbase.util.TestFSTableDescriptors
Tests run: 10, Failures: 0, Errors: 0, Skipped: 0, Time elapsed: 0.949 sec
Forking command line: /bin/sh -c cd <https://builds.apache.org/job/HBase-0.94/ws/trunk>
&& /home/hudson/tools/java/jdk1.6.0_27-32/jre/bin/java -enableassertions -Xmx1900m
-Djava.security.egd=file:/dev/./urandom -jar <https://builds.apache.org/job/HBase-0.94/ws/trunk/target/surefire/surefirebooter3536910757779823868.jar>
<https://builds.apache.org/job/HBase-0.94/ws/trunk/target/surefire/surefire4177202682635257719tmp>
<https://builds.apache.org/job/HBase-0.94/ws/trunk/target/surefire/surefire_642128605923801099891tmp>
Running org.apache.hadoop.hbase.util.TestEnvironmentEdgeManager
Tests run: 2, Failures: 0, Errors: 0, Skipped: 0, Time elapsed: 0.379 sec
Forking command line: /bin/sh -c cd <https://builds.apache.org/job/HBase-0.94/ws/trunk>
&& /home/hudson/tools/java/jdk1.6.0_27-32/jre/bin/java -enableassertions -Xmx1900m
-Djava.security.egd=file:/dev/./urandom -jar <https://builds.apache.org/job/HBase-0.94/ws/trunk/target/surefire/surefirebooter5677653401151180318.jar>
<https://builds.apache.org/job/HBase-0.94/ws/trunk/target/surefire/surefire7605091836635428794tmp>
<https://builds.apache.org/job/HBase-0.94/ws/trunk/target/surefire/surefire_656607443738449433564tmp>
Running org.apache.hadoop.hbase.util.TestRegionSplitter
Tests run: 5, Failures: 0, Errors: 0, Skipped: 0, Time elapsed: 34.995 sec
Forking command line: /bin/sh -c cd <https://builds.apache.org/job/HBase-0.94/ws/trunk>
&& /home/hudson/tools/java/jdk1.6.0_27-32/jre/bin/java -enableassertions -Xmx1900m
-Djava.security.egd=file:/dev/./urandom -jar <https://builds.apache.org/job/HBase-0.94/ws/trunk/target/surefire/surefirebooter3192270963486333987.jar>
<https://builds.apache.org/job/HBase-0.94/ws/trunk/target/surefire/surefire3852899052575411782tmp>
<https://builds.apache.org/job/HBase-0.94/ws/trunk/target/surefire/surefire_661515218610949558786tmp>
Running org.apache.hadoop.hbase.util.TestHBaseFsck
Tests run: 6, Failures: 0, Errors: 0, Skipped: 0, Time elapsed: 45.986 sec
Forking command line: /bin/sh -c cd <https://builds.apache.org/job/HBase-0.94/ws/trunk>
&& /home/hudson/tools/java/jdk1.6.0_27-32/jre/bin/java -enableassertions -Xmx1900m
-Djava.security.egd=file:/dev/./urandom -jar <https://builds.apache.org/job/HBase-0.94/ws/trunk/target/surefire/surefirebooter3432800338962478709.jar>
<https://builds.apache.org/job/HBase-0.94/ws/trunk/target/surefire/surefire6110003422195281650tmp>
<https://builds.apache.org/job/HBase-0.94/ws/trunk/target/surefire/surefire_678213543608113027512tmp>
Running org.apache.hadoop.hbase.regionserver.TestStore
Tests run: 12, Failures: 0, Errors: 0, Skipped: 0, Time elapsed: 3.461 sec
Forking command line: /bin/sh -c cd <https://builds.apache.org/job/HBase-0.94/ws/trunk>
&& /home/hudson/tools/java/jdk1.6.0_27-32/jre/bin/java -enableassertions -Xmx1900m
-Djava.security.egd=file:/dev/./urandom -jar <https://builds.apache.org/job/HBase-0.94/ws/trunk/target/surefire/surefirebooter5211097301346740387.jar>
<https://builds.apache.org/job/HBase-0.94/ws/trunk/target/surefire/surefire5416487712327957812tmp>
<https://builds.apache.org/job/HBase-0.94/ws/trunk/target/surefire/surefire_68948101797189066864tmp>
Running org.apache.hadoop.hbase.regionserver.TestStoreFileBlockCacheSummary
Tests run: 1, Failures: 0, Errors: 0, Skipped: 0, Time elapsed: 18.563 sec
Forking command line: /bin/sh -c cd <https://builds.apache.org/job/HBase-0.94/ws/trunk>
&& /home/hudson/tools/java/jdk1.6.0_27-32/jre/bin/java -enableassertions -Xmx1900m
-Djava.security.egd=file:/dev/./urandom -jar <https://builds.apache.org/job/HBase-0.94/ws/trunk/target/surefire/surefirebooter1193226933692239905.jar>
<https://builds.apache.org/job/HBase-0.94/ws/trunk/target/surefire/surefire2994755025603517602tmp>
<https://builds.apache.org/job/HBase-0.94/ws/trunk/target/surefire/surefire_694142553857824999920tmp>
Running org.apache.hadoop.hbase.regionserver.handler.TestOpenRegionHandler
Tests run: 3, Failures: 0, Errors: 0, Skipped: 0, Time elapsed: 1.315 sec
Forking command line: /bin/sh -c cd <https://builds.apache.org/job/HBase-0.94/ws/trunk>
&& /home/hudson/tools/java/jdk1.6.0_27-32/jre/bin/java -enableassertions -Xmx1900m
-Djava.security.egd=file:/dev/./urandom -jar <https://builds.apache.org/job/HBase-0.94/ws/trunk/target/surefire/surefirebooter8945317153713641041.jar>
<https://builds.apache.org/job/HBase-0.94/ws/trunk/target/surefire/surefire8819194135850702974tmp>
<https://builds.apache.org/job/HBase-0.94/ws/trunk/target/surefire/surefire_708898901296515351522tmp>
Running org.apache.hadoop.hbase.regionserver.handler.TestCloseRegionHandler
Tests run: 3, Failures: 0, Errors: 0, Skipped: 0, Time elapsed: 1.524 sec
Forking command line: /bin/sh -c cd <https://builds.apache.org/job/HBase-0.94/ws/trunk>
&& /home/hudson/tools/java/jdk1.6.0_27-32/jre/bin/java -enableassertions -Xmx1900m
-Djava.security.egd=file:/dev/./urandom -jar <https://builds.apache.org/job/HBase-0.94/ws/trunk/target/surefire/surefirebooter8310907613948988302.jar>
<https://builds.apache.org/job/HBase-0.94/ws/trunk/target/surefire/surefire9143000371842623503tmp>
<https://builds.apache.org/job/HBase-0.94/ws/trunk/target/surefire/surefire_718089965080657053969tmp>
Running org.apache.hadoop.hbase.regionserver.TestParallelPut
Tests run: 2, Failures: 0, Errors: 0, Skipped: 0, Time elapsed: 6.022 sec
Forking command line: /bin/sh -c cd <https://builds.apache.org/job/HBase-0.94/ws/trunk>
&& /home/hudson/tools/java/jdk1.6.0_27-32/jre/bin/java -enableassertions -Xmx1900m
-Djava.security.egd=file:/dev/./urandom -jar <https://builds.apache.org/job/HBase-0.94/ws/trunk/target/surefire/surefirebooter1033187996268162027.jar>
<https://builds.apache.org/job/HBase-0.94/ws/trunk/target/surefire/surefire1352007697811961317tmp>
<https://builds.apache.org/job/HBase-0.94/ws/trunk/target/surefire/surefire_72584622596121624240tmp>
Running org.apache.hadoop.hbase.regionserver.TestServerCustomProtocol
Tests run: 7, Failures: 0, Errors: 0, Skipped: 0, Time elapsed: 18.951 sec
Forking command line: /bin/sh -c cd <https://builds.apache.org/job/HBase-0.94/ws/trunk>
&& /home/hudson/tools/java/jdk1.6.0_27-32/jre/bin/java -enableassertions -Xmx1900m
-Djava.security.egd=file:/dev/./urandom -jar <https://builds.apache.org/job/HBase-0.94/ws/trunk/target/surefire/surefirebooter5690752084925436158.jar>
<https://builds.apache.org/job/HBase-0.94/ws/trunk/target/surefire/surefire4969599968482112836tmp>
<https://builds.apache.org/job/HBase-0.94/ws/trunk/target/surefire/surefire_739142636031348774660tmp>
Running org.apache.hadoop.hbase.regionserver.TestRegionServerMetrics
Tests run: 1, Failures: 0, Errors: 0, Skipped: 0, Time elapsed: 41.618 sec
Forking command line: /bin/sh -c cd <https://builds.apache.org/job/HBase-0.94/ws/trunk>
&& /home/hudson/tools/java/jdk1.6.0_27-32/jre/bin/java -enableassertions -Xmx1900m
-Djava.security.egd=file:/dev/./urandom -jar <https://builds.apache.org/job/HBase-0.94/ws/trunk/target/surefire/surefirebooter1755302126706349122.jar>
<https://builds.apache.org/job/HBase-0.94/ws/trunk/target/surefire/surefire1145530601580532363tmp>
<https://builds.apache.org/job/HBase-0.94/ws/trunk/target/surefire/surefire_74660236248035562713tmp>
Running org.apache.hadoop.hbase.regionserver.TestBlocksRead
Tests run: 4, Failures: 0, Errors: 0, Skipped: 0, Time elapsed: 2.206 sec
Forking command line: /bin/sh -c cd <https://builds.apache.org/job/HBase-0.94/ws/trunk>
&& /home/hudson/tools/java/jdk1.6.0_27-32/jre/bin/java -enableassertions -Xmx1900m
-Djava.security.egd=file:/dev/./urandom -jar <https://builds.apache.org/job/HBase-0.94/ws/trunk/target/surefire/surefirebooter3015662865647447902.jar>
<https://builds.apache.org/job/HBase-0.94/ws/trunk/target/surefire/surefire5323514223846576491tmp>
<https://builds.apache.org/job/HBase-0.94/ws/trunk/target/surefire/surefire_754825673731664094185tmp>
Running org.apache.hadoop.hbase.regionserver.TestMasterAddressManager
Tests run: 1, Failures: 0, Errors: 0, Skipped: 0, Time elapsed: 1.442 sec
Forking command line: /bin/sh -c cd <https://builds.apache.org/job/HBase-0.94/ws/trunk>
&& /home/hudson/tools/java/jdk1.6.0_27-32/jre/bin/java -enableassertions -Xmx1900m
-Djava.security.egd=file:/dev/./urandom -jar <https://builds.apache.org/job/HBase-0.94/ws/trunk/target/surefire/surefirebooter3596768805553660251.jar>
<https://builds.apache.org/job/HBase-0.94/ws/trunk/target/surefire/surefire73142499356970587tmp>
<https://builds.apache.org/job/HBase-0.94/ws/trunk/target/surefire/surefire_762561711272214609767tmp>
Running org.apache.hadoop.hbase.regionserver.TestAtomicOperation
Tests run: 5, Failures: 0, Errors: 0, Skipped: 0, Time elapsed: 46.818 sec
Forking command line: /bin/sh -c cd <https://builds.apache.org/job/HBase-0.94/ws/trunk>
&& /home/hudson/tools/java/jdk1.6.0_27-32/jre/bin/java -enableassertions -Xmx1900m
-Djava.security.egd=file:/dev/./urandom -jar <https://builds.apache.org/job/HBase-0.94/ws/trunk/target/surefire/surefirebooter4701901338197144278.jar>
<https://builds.apache.org/job/HBase-0.94/ws/trunk/target/surefire/surefire5125785903535888076tmp>
<https://builds.apache.org/job/HBase-0.94/ws/trunk/target/surefire/surefire_775704416787013192326tmp>
Running org.apache.hadoop.hbase.regionserver.wal.TestHLogBench
Tests run: 1, Failures: 0, Errors: 0, Skipped: 0, Time elapsed: 1.401 sec
Forking command line: /bin/sh -c cd <https://builds.apache.org/job/HBase-0.94/ws/trunk>
&& /home/hudson/tools/java/jdk1.6.0_27-32/jre/bin/java -enableassertions -Xmx1900m
-Djava.security.egd=file:/dev/./urandom -jar <https://builds.apache.org/job/HBase-0.94/ws/trunk/target/surefire/surefirebooter3118344733461602378.jar>
<https://builds.apache.org/job/HBase-0.94/ws/trunk/target/surefire/surefire4550581873825372697tmp>
<https://builds.apache.org/job/HBase-0.94/ws/trunk/target/surefire/surefire_781196304245665688551tmp>
Running org.apache.hadoop.hbase.regionserver.wal.TestWALReplay
Tests run: 5, Failures: 0, Errors: 0, Skipped: 0, Time elapsed: 47.057 sec
Running org.apache.hadoop.hbase.regionserver.wal.TestLogRollAbort
Tests run: 1, Failures: 0, Errors: 0, Skipped: 0, Time elapsed: 153.475 sec
Forking command line: /bin/sh -c cd <https://builds.apache.org/job/HBase-0.94/ws/trunk>
&& /home/hudson/tools/java/jdk1.6.0_27-32/jre/bin/java -enableassertions -Xmx1900m
-Djava.security.egd=file:/dev/./urandom -jar <https://builds.apache.org/job/HBase-0.94/ws/trunk/target/surefire/surefirebooter4838255420808343591.jar>
<https://builds.apache.org/job/HBase-0.94/ws/trunk/target/surefire/surefire2054799943593481254tmp>
<https://builds.apache.org/job/HBase-0.94/ws/trunk/target/surefire/surefire_798065053850287388781tmp>
Running org.apache.hadoop.hbase.regionserver.metrics.TestSchemaMetrics
Tests run: 6, Failures: 0, Errors: 0, Skipped: 0, Time elapsed: 15.577 sec
Forking command line: /bin/sh -c cd <https://builds.apache.org/job/HBase-0.94/ws/trunk>
&& /home/hudson/tools/java/jdk1.6.0_27-32/jre/bin/java -enableassertions -Xmx1900m
-Djava.security.egd=file:/dev/./urandom -jar <https://builds.apache.org/job/HBase-0.94/ws/trunk/target/surefire/surefirebooter4533641143679794506.jar>
<https://builds.apache.org/job/HBase-0.94/ws/trunk/target/surefire/surefire8586722648682316301tmp>
<https://builds.apache.org/job/HBase-0.94/ws/trunk/target/surefire/surefire_808408251194721651033tmp>
Running org.apache.hadoop.hbase.regionserver.TestRpcMetrics
Tests run: 1, Failures: 0, Errors: 0, Skipped: 0, Time elapsed: 2.099 sec
Forking command line: /bin/sh -c cd <https://builds.apache.org/job/HBase-0.94/ws/trunk>
&& /home/hudson/tools/java/jdk1.6.0_27-32/jre/bin/java -enableassertions -Xmx1900m
-Djava.security.egd=file:/dev/./urandom -jar <https://builds.apache.org/job/HBase-0.94/ws/trunk/target/surefire/surefirebooter1699716222765826610.jar>
<https://builds.apache.org/job/HBase-0.94/ws/trunk/target/surefire/surefire4236956713600561279tmp>
<https://builds.apache.org/job/HBase-0.94/ws/trunk/target/surefire/surefire_817197017893403305027tmp>
Running org.apache.hadoop.hbase.regionserver.TestStoreScanner
Tests run: 16, Failures: 0, Errors: 0, Skipped: 0, Time elapsed: 0.074 sec
Forking command line: /bin/sh -c cd <https://builds.apache.org/job/HBase-0.94/ws/trunk>
&& /home/hudson/tools/java/jdk1.6.0_27-32/jre/bin/java -enableassertions -Xmx1900m
-Djava.security.egd=file:/dev/./urandom -jar <https://builds.apache.org/job/HBase-0.94/ws/trunk/target/surefire/surefirebooter1579002200128410206.jar>
<https://builds.apache.org/job/HBase-0.94/ws/trunk/target/surefire/surefire6465832202034635195tmp>
<https://builds.apache.org/job/HBase-0.94/ws/trunk/target/surefire/surefire_825969170871532505252tmp>
Running org.apache.hadoop.hbase.regionserver.TestSeekOptimizations
Tests run: 6, Failures: 0, Errors: 0, Skipped: 0, Time elapsed: 3.061 sec
Forking command line: /bin/sh -c cd <https://builds.apache.org/job/HBase-0.94/ws/trunk>
&& /home/hudson/tools/java/jdk1.6.0_27-32/jre/bin/java -enableassertions -Xmx1900m
-Djava.security.egd=file:/dev/./urandom -jar <https://builds.apache.org/job/HBase-0.94/ws/trunk/target/surefire/surefirebooter1007540546990168400.jar>
<https://builds.apache.org/job/HBase-0.94/ws/trunk/target/surefire/surefire5682543517151062846tmp>
<https://builds.apache.org/job/HBase-0.94/ws/trunk/target/surefire/surefire_831141002325262832063tmp>
Forking command line: /bin/sh -c cd <https://builds.apache.org/job/HBase-0.94/ws/trunk>
&& /home/hudson/tools/java/jdk1.6.0_27-32/jre/bin/java -enableassertions -Xmx1900m
-Djava.security.egd=file:/dev/./urandom -jar <https://builds.apache.org/job/HBase-0.94/ws/trunk/target/surefire/surefirebooter5103133068767076621.jar>
<https://builds.apache.org/job/HBase-0.94/ws/trunk/target/surefire/surefire6466611203725576243tmp>
<https://builds.apache.org/job/HBase-0.94/ws/trunk/target/surefire/surefire_844533353959641828347tmp>
Running org.apache.hadoop.hbase.regionserver.TestSplitLogWorker
Tests run: 5, Failures: 0, Errors: 0, Skipped: 0, Time elapsed: 2.795 sec
Forking command line: /bin/sh -c cd <https://builds.apache.org/job/HBase-0.94/ws/trunk>
&& /home/hudson/tools/java/jdk1.6.0_27-32/jre/bin/java -enableassertions -Xmx1900m
-Djava.security.egd=file:/dev/./urandom -jar <https://builds.apache.org/job/HBase-0.94/ws/trunk/target/surefire/surefirebooter8809662205438504261.jar>
<https://builds.apache.org/job/HBase-0.94/ws/trunk/target/surefire/surefire3607237021697687804tmp>
<https://builds.apache.org/job/HBase-0.94/ws/trunk/target/surefire/surefire_859143109078675229411tmp>
Running org.apache.hadoop.hbase.regionserver.TestFSErrorsExposed
Tests run: 3, Failures: 0, Errors: 0, Skipped: 0, Time elapsed: 30.437 sec
Forking command line: /bin/sh -c cd <https://builds.apache.org/job/HBase-0.94/ws/trunk>
&& /home/hudson/tools/java/jdk1.6.0_27-32/jre/bin/java -enableassertions -Xmx1900m
-Djava.security.egd=file:/dev/./urandom -jar <https://builds.apache.org/job/HBase-0.94/ws/trunk/target/surefire/surefirebooter6279583976217549964.jar>
<https://builds.apache.org/job/HBase-0.94/ws/trunk/target/surefire/surefire8046013933928303835tmp>
<https://builds.apache.org/job/HBase-0.94/ws/trunk/target/surefire/surefire_86761491519235248430tmp>
Running org.apache.hadoop.hbase.regionserver.TestMultiColumnScanner
Tests run: 12, Failures: 0, Errors: 0, Skipped: 0, Time elapsed: 43.519 sec
Forking command line: /bin/sh -c cd <https://builds.apache.org/job/HBase-0.94/ws/trunk>
&& /home/hudson/tools/java/jdk1.6.0_27-32/jre/bin/java -enableassertions -Xmx1900m
-Djava.security.egd=file:/dev/./urandom -jar <https://builds.apache.org/job/HBase-0.94/ws/trunk/target/surefire/surefirebooter1874835130481679925.jar>
<https://builds.apache.org/job/HBase-0.94/ws/trunk/target/surefire/surefire3427870149005191450tmp>
<https://builds.apache.org/job/HBase-0.94/ws/trunk/target/surefire/surefire_876046805415025711216tmp>
Running org.apache.hadoop.hbase.client.replication.TestReplicationAdmin
Tests run: 1, Failures: 0, Errors: 0, Skipped: 0, Time elapsed: 1.492 sec
Forking command line: /bin/sh -c cd <https://builds.apache.org/job/HBase-0.94/ws/trunk>
&& /home/hudson/tools/java/jdk1.6.0_27-32/jre/bin/java -enableassertions -Xmx1900m
-Djava.security.egd=file:/dev/./urandom -jar <https://builds.apache.org/job/HBase-0.94/ws/trunk/target/surefire/surefirebooter5538076758808067975.jar>
<https://builds.apache.org/job/HBase-0.94/ws/trunk/target/surefire/surefire7513673796515619810tmp>
<https://builds.apache.org/job/HBase-0.94/ws/trunk/target/surefire/surefire_882882744434378075807tmp>
Running org.apache.hadoop.hbase.regionserver.TestHRegion
Tests run: 61, Failures: 0, Errors: 0, Skipped: 0, Time elapsed: 37.195 sec
Forking command line: /bin/sh -c cd <https://builds.apache.org/job/HBase-0.94/ws/trunk>
&& /home/hudson/tools/java/jdk1.6.0_27-32/jre/bin/java -enableassertions -Xmx1900m
-Djava.security.egd=file:/dev/./urandom -jar <https://builds.apache.org/job/HBase-0.94/ws/trunk/target/surefire/surefirebooter6198103704487125934.jar>
<https://builds.apache.org/job/HBase-0.94/ws/trunk/target/surefire/surefire75779028909694848tmp>
<https://builds.apache.org/job/HBase-0.94/ws/trunk/target/surefire/surefire_894574416686452886664tmp>
Running org.apache.hadoop.hbase.client.TestTimestampsFilter
Tests run: 3, Failures: 0, Errors: 0, Skipped: 0, Time elapsed: 23.078 sec
Forking command line: /bin/sh -c cd <https://builds.apache.org/job/HBase-0.94/ws/trunk>
&& /home/hudson/tools/java/jdk1.6.0_27-32/jre/bin/java -enableassertions -Xmx1900m
-Djava.security.egd=file:/dev/./urandom -jar <https://builds.apache.org/job/HBase-0.94/ws/trunk/target/surefire/surefirebooter7583250973171914044.jar>
<https://builds.apache.org/job/HBase-0.94/ws/trunk/target/surefire/surefire3585803354460734980tmp>
<https://builds.apache.org/job/HBase-0.94/ws/trunk/target/surefire/surefire_90272019099162073508tmp>
Running org.apache.hadoop.hbase.client.TestHCM
Tests run: 5, Failures: 0, Errors: 0, Skipped: 0, Time elapsed: 17.679 sec
Forking command line: /bin/sh -c cd <https://builds.apache.org/job/HBase-0.94/ws/trunk>
&& /home/hudson/tools/java/jdk1.6.0_27-32/jre/bin/java -enableassertions -Xmx1900m
-Djava.security.egd=file:/dev/./urandom -jar <https://builds.apache.org/job/HBase-0.94/ws/trunk/target/surefire/surefirebooter823923604389100078.jar>
<https://builds.apache.org/job/HBase-0.94/ws/trunk/target/surefire/surefire8863319567611292085tmp>
<https://builds.apache.org/job/HBase-0.94/ws/trunk/target/surefire/surefire_915479969790612125180tmp>
Running org.apache.hadoop.hbase.client.TestHTablePool$TestHTableReusablePool
Tests run: 9, Failures: 0, Errors: 0, Skipped: 0, Time elapsed: 5.194 sec
Running org.apache.hadoop.hbase.client.TestHTableUtil
Tests run: 2, Failures: 0, Errors: 0, Skipped: 0, Time elapsed: 18.171 sec
Forking command line: /bin/sh -c cd <https://builds.apache.org/job/HBase-0.94/ws/trunk>
&& /home/hudson/tools/java/jdk1.6.0_27-32/jre/bin/java -enableassertions -Xmx1900m
-Djava.security.egd=file:/dev/./urandom -jar <https://builds.apache.org/job/HBase-0.94/ws/trunk/target/surefire/surefirebooter8370781631651941818.jar>
<https://builds.apache.org/job/HBase-0.94/ws/trunk/target/surefire/surefire4555149198452925590tmp>
<https://builds.apache.org/job/HBase-0.94/ws/trunk/target/surefire/surefire_92504507851264368076tmp>
Running org.apache.hadoop.hbase.client.TestHTablePool$TestHTableThreadLocalPool
Tests run: 9, Failures: 0, Errors: 0, Skipped: 0, Time elapsed: 25.749 sec
Forking command line: /bin/sh -c cd <https://builds.apache.org/job/HBase-0.94/ws/trunk>
&& /home/hudson/tools/java/jdk1.6.0_27-32/jre/bin/java -enableassertions -Xmx1900m
-Djava.security.egd=file:/dev/./urandom -jar <https://builds.apache.org/job/HBase-0.94/ws/trunk/target/surefire/surefirebooter1774543529958518673.jar>
<https://builds.apache.org/job/HBase-0.94/ws/trunk/target/surefire/surefire8958322225097811535tmp>
<https://builds.apache.org/job/HBase-0.94/ws/trunk/target/surefire/surefire_935290528046088063961tmp>
Running org.apache.hadoop.hbase.client.TestMetaScanner
Tests run: 1, Failures: 0, Errors: 0, Skipped: 0, Time elapsed: 17.349 sec
Forking command line: /bin/sh -c cd <https://builds.apache.org/job/HBase-0.94/ws/trunk>
&& /home/hudson/tools/java/jdk1.6.0_27-32/jre/bin/java -enableassertions -Xmx1900m
-Djava.security.egd=file:/dev/./urandom -jar <https://builds.apache.org/job/HBase-0.94/ws/trunk/target/surefire/surefirebooter8743802739112112740.jar>
<https://builds.apache.org/job/HBase-0.94/ws/trunk/target/surefire/surefire8603441383493639921tmp>
<https://builds.apache.org/job/HBase-0.94/ws/trunk/target/surefire/surefire_94743585385777053363tmp>
Running org.apache.hadoop.hbase.client.TestMetaMigrationRemovingHTD
Tests run: 3, Failures: 0, Errors: 0, Skipped: 0, Time elapsed: 26.171 sec
Forking command line: /bin/sh -c cd <https://builds.apache.org/job/HBase-0.94/ws/trunk>
&& /home/hudson/tools/java/jdk1.6.0_27-32/jre/bin/java -enableassertions -Xmx1900m
-Djava.security.egd=file:/dev/./urandom -jar <https://builds.apache.org/job/HBase-0.94/ws/trunk/target/surefire/surefirebooter569304400678674274.jar>
<https://builds.apache.org/job/HBase-0.94/ws/trunk/target/surefire/surefire2111248371745295310tmp>
<https://builds.apache.org/job/HBase-0.94/ws/trunk/target/surefire/surefire_956481114439464838688tmp>
Running org.apache.hadoop.hbase.client.TestMultiParallel
Tests run: 11, Failures: 0, Errors: 0, Skipped: 0, Time elapsed: 43.57 sec
Running org.apache.hadoop.hbase.TestMultiVersions
Tests run: 3, Failures: 0, Errors: 0, Skipped: 0, Time elapsed: 29.938 sec
Forking command line: /bin/sh -c cd <https://builds.apache.org/job/HBase-0.94/ws/trunk>
&& /home/hudson/tools/java/jdk1.6.0_27-32/jre/bin/java -enableassertions -Xmx1900m
-Djava.security.egd=file:/dev/./urandom -jar <https://builds.apache.org/job/HBase-0.94/ws/trunk/target/surefire/surefirebooter6784308307402910314.jar>
<https://builds.apache.org/job/HBase-0.94/ws/trunk/target/surefire/surefire3862128147885014975tmp>
<https://builds.apache.org/job/HBase-0.94/ws/trunk/target/surefire/surefire_967418017769813087527tmp>
Forking command line: /bin/sh -c cd <https://builds.apache.org/job/HBase-0.94/ws/trunk>
&& /home/hudson/tools/java/jdk1.6.0_27-32/jre/bin/java -enableassertions -Xmx1900m
-Djava.security.egd=file:/dev/./urandom -jar <https://builds.apache.org/job/HBase-0.94/ws/trunk/target/surefire/surefirebooter6539987457003453916.jar>
<https://builds.apache.org/job/HBase-0.94/ws/trunk/target/surefire/surefire7968607800771095411tmp>
<https://builds.apache.org/job/HBase-0.94/ws/trunk/target/surefire/surefire_972862239645887181709tmp>
Running org.apache.hadoop.hbase.master.TestActiveMasterManager
Tests run: 2, Failures: 0, Errors: 0, Skipped: 0, Time elapsed: 1.406 sec
Forking command line: /bin/sh -c cd <https://builds.apache.org/job/HBase-0.94/ws/trunk>
&& /home/hudson/tools/java/jdk1.6.0_27-32/jre/bin/java -enableassertions -Xmx1900m
-Djava.security.egd=file:/dev/./urandom -jar <https://builds.apache.org/job/HBase-0.94/ws/trunk/target/surefire/surefirebooter2120895699346396024.jar>
<https://builds.apache.org/job/HBase-0.94/ws/trunk/target/surefire/surefire8222719961703179666tmp>
<https://builds.apache.org/job/HBase-0.94/ws/trunk/target/surefire/surefire_987406968809259801297tmp>
Running org.apache.hadoop.hbase.master.TestDeadServer
Tests run: 1, Failures: 0, Errors: 0, Skipped: 0, Time elapsed: 0.204 sec
Forking command line: /bin/sh -c cd <https://builds.apache.org/job/HBase-0.94/ws/trunk>
&& /home/hudson/tools/java/jdk1.6.0_27-32/jre/bin/java -enableassertions -Xmx1900m
-Djava.security.egd=file:/dev/./urandom -jar <https://builds.apache.org/job/HBase-0.94/ws/trunk/target/surefire/surefirebooter3574040918649181138.jar>
<https://builds.apache.org/job/HBase-0.94/ws/trunk/target/surefire/surefire3405700576303844888tmp>
<https://builds.apache.org/job/HBase-0.94/ws/trunk/target/surefire/surefire_994435177774183749895tmp>
Running org.apache.hadoop.hbase.master.TestLogsCleaner
Tests run: 1, Failures: 0, Errors: 0, Skipped: 0, Time elapsed: 3.375 sec
Forking command line: /bin/sh -c cd <https://builds.apache.org/job/HBase-0.94/ws/trunk>
&& /home/hudson/tools/java/jdk1.6.0_27-32/jre/bin/java -enableassertions -Xmx1900m
-Djava.security.egd=file:/dev/./urandom -jar <https://builds.apache.org/job/HBase-0.94/ws/trunk/target/surefire/surefirebooter1900443726108127940.jar>
<https://builds.apache.org/job/HBase-0.94/ws/trunk/target/surefire/surefire3212212199369131101tmp>
<https://builds.apache.org/job/HBase-0.94/ws/trunk/target/surefire/surefire_1006464454299465053291tmp>
Running org.apache.hadoop.hbase.master.TestZKBasedOpenCloseRegion
Tests run: 3, Failures: 0, Errors: 0, Skipped: 0, Time elapsed: 27.347 sec
Forking command line: /bin/sh -c cd <https://builds.apache.org/job/HBase-0.94/ws/trunk>
&& /home/hudson/tools/java/jdk1.6.0_27-32/jre/bin/java -enableassertions -Xmx1900m
-Djava.security.egd=file:/dev/./urandom -jar <https://builds.apache.org/job/HBase-0.94/ws/trunk/target/surefire/surefirebooter6663834185724121210.jar>
<https://builds.apache.org/job/HBase-0.94/ws/trunk/target/surefire/surefire7537326842170450119tmp>
<https://builds.apache.org/job/HBase-0.94/ws/trunk/target/surefire/surefire_1012323474531487589086tmp>
Running org.apache.hadoop.hbase.thrift.TestThriftServer
Tests run: 1, Failures: 0, Errors: 0, Skipped: 0, Time elapsed: 53.35 sec
Forking command line: /bin/sh -c cd <https://builds.apache.org/job/HBase-0.94/ws/trunk>
&& /home/hudson/tools/java/jdk1.6.0_27-32/jre/bin/java -enableassertions -Xmx1900m
-Djava.security.egd=file:/dev/./urandom -jar <https://builds.apache.org/job/HBase-0.94/ws/trunk/target/surefire/surefirebooter7360980406997643391.jar>
<https://builds.apache.org/job/HBase-0.94/ws/trunk/target/surefire/surefire5912964788076186458tmp>
<https://builds.apache.org/job/HBase-0.94/ws/trunk/target/surefire/surefire_1022602972982647036806tmp>
Running org.apache.hadoop.hbase.master.TestMaster
Tests run: 1, Failures: 0, Errors: 0, Skipped: 0, Time elapsed: 22.284 sec
Forking command line: /bin/sh -c cd <https://builds.apache.org/job/HBase-0.94/ws/trunk>
&& /home/hudson/tools/java/jdk1.6.0_27-32/jre/bin/java -enableassertions -Xmx1900m
-Djava.security.egd=file:/dev/./urandom -jar <https://builds.apache.org/job/HBase-0.94/ws/trunk/target/surefire/surefirebooter430008905717414654.jar>
<https://builds.apache.org/job/HBase-0.94/ws/trunk/target/surefire/surefire5401548308125862759tmp>
<https://builds.apache.org/job/HBase-0.94/ws/trunk/target/surefire/surefire_1037199379586935176980tmp>
Running org.apache.hadoop.hbase.master.TestClockSkewDetection
Tests run: 1, Failures: 0, Errors: 0, Skipped: 0, Time elapsed: 0.297 sec
Forking command line: /bin/sh -c cd <https://builds.apache.org/job/HBase-0.94/ws/trunk>
&& /home/hudson/tools/java/jdk1.6.0_27-32/jre/bin/java -enableassertions -Xmx1900m
-Djava.security.egd=file:/dev/./urandom -jar <https://builds.apache.org/job/HBase-0.94/ws/trunk/target/surefire/surefirebooter1623683821991717708.jar>
<https://builds.apache.org/job/HBase-0.94/ws/trunk/target/surefire/surefire7288291048749626771tmp>
<https://builds.apache.org/job/HBase-0.94/ws/trunk/target/surefire/surefire_1042024736500821781002tmp>
Running org.apache.hadoop.hbase.master.TestOpenedRegionHandler
Tests run: 2, Failures: 0, Errors: 0, Skipped: 0, Time elapsed: 19.766 sec
Forking command line: /bin/sh -c cd <https://builds.apache.org/job/HBase-0.94/ws/trunk>
&& /home/hudson/tools/java/jdk1.6.0_27-32/jre/bin/java -enableassertions -Xmx1900m
-Djava.security.egd=file:/dev/./urandom -jar <https://builds.apache.org/job/HBase-0.94/ws/trunk/target/surefire/surefirebooter3247623587018758069.jar>
<https://builds.apache.org/job/HBase-0.94/ws/trunk/target/surefire/surefire1780455833595178954tmp>
<https://builds.apache.org/job/HBase-0.94/ws/trunk/target/surefire/surefire_1058372516678240386820tmp>
Running org.apache.hadoop.hbase.master.TestSplitLogManager
Tests run: 12, Failures: 0, Errors: 0, Skipped: 0, Time elapsed: 16.443 sec
Forking command line: /bin/sh -c cd <https://builds.apache.org/job/HBase-0.94/ws/trunk>
&& /home/hudson/tools/java/jdk1.6.0_27-32/jre/bin/java -enableassertions -Xmx1900m
-Djava.security.egd=file:/dev/./urandom -jar <https://builds.apache.org/job/HBase-0.94/ws/trunk/target/surefire/surefirebooter3373671293884335808.jar>
<https://builds.apache.org/job/HBase-0.94/ws/trunk/target/surefire/surefire5392821643123006616tmp>
<https://builds.apache.org/job/HBase-0.94/ws/trunk/target/surefire/surefire_106639876896112309360tmp>
Running org.apache.hadoop.hbase.master.TestMasterStatusServlet
Tests run: 5, Failures: 0, Errors: 0, Skipped: 0, Time elapsed: 1.103 sec
Forking command line: /bin/sh -c cd <https://builds.apache.org/job/HBase-0.94/ws/trunk>
&& /home/hudson/tools/java/jdk1.6.0_27-32/jre/bin/java -enableassertions -Xmx1900m
-Djava.security.egd=file:/dev/./urandom -jar <https://builds.apache.org/job/HBase-0.94/ws/trunk/target/surefire/surefirebooter7922769212549815238.jar>
<https://builds.apache.org/job/HBase-0.94/ws/trunk/target/surefire/surefire6041765445907930435tmp>
<https://builds.apache.org/job/HBase-0.94/ws/trunk/target/surefire/surefire_1074370081685062989884tmp>
Running org.apache.hadoop.hbase.master.TestDefaultLoadBalancer
Tests run: 4, Failures: 0, Errors: 0, Skipped: 0, Time elapsed: 1.564 sec
Forking command line: /bin/sh -c cd <https://builds.apache.org/job/HBase-0.94/ws/trunk>
&& /home/hudson/tools/java/jdk1.6.0_27-32/jre/bin/java -enableassertions -Xmx1900m
-Djava.security.egd=file:/dev/./urandom -jar <https://builds.apache.org/job/HBase-0.94/ws/trunk/target/surefire/surefirebooter7813662758157672933.jar>
<https://builds.apache.org/job/HBase-0.94/ws/trunk/target/surefire/surefire5156505650038357298tmp>
<https://builds.apache.org/job/HBase-0.94/ws/trunk/target/surefire/surefire_1088214933442690572272tmp>
Running org.apache.hadoop.hbase.master.TestHMasterRPCException
Tests run: 1, Failures: 0, Errors: 0, Skipped: 0, Time elapsed: 1.648 sec
Forking command line: /bin/sh -c cd <https://builds.apache.org/job/HBase-0.94/ws/trunk>
&& /home/hudson/tools/java/jdk1.6.0_27-32/jre/bin/java -enableassertions -Xmx1900m
-Djava.security.egd=file:/dev/./urandom -jar <https://builds.apache.org/job/HBase-0.94/ws/trunk/target/surefire/surefirebooter8997635033911873437.jar>
<https://builds.apache.org/job/HBase-0.94/ws/trunk/target/surefire/surefire517866686549451485tmp>
<https://builds.apache.org/job/HBase-0.94/ws/trunk/target/surefire/surefire_1094989966529846467058tmp>
Running org.apache.hadoop.hbase.master.TestMasterZKSessionRecovery
Tests run: 2, Failures: 0, Errors: 0, Skipped: 0, Time elapsed: 27.642 sec
Forking command line: /bin/sh -c cd <https://builds.apache.org/job/HBase-0.94/ws/trunk>
&& /home/hudson/tools/java/jdk1.6.0_27-32/jre/bin/java -enableassertions -Xmx1900m
-Djava.security.egd=file:/dev/./urandom -jar <https://builds.apache.org/job/HBase-0.94/ws/trunk/target/surefire/surefirebooter5145594654123045693.jar>
<https://builds.apache.org/job/HBase-0.94/ws/trunk/target/surefire/surefire310064833321967454tmp>
<https://builds.apache.org/job/HBase-0.94/ws/trunk/target/surefire/surefire_1103462013770877417953tmp>
Running org.apache.hadoop.hbase.avro.TestAvroServer
Tests run: 3, Failures: 0, Errors: 0, Skipped: 0, Time elapsed: 33.504 sec
Forking command line: /bin/sh -c cd <https://builds.apache.org/job/HBase-0.94/ws/trunk>
&& /home/hudson/tools/java/jdk1.6.0_27-32/jre/bin/java -enableassertions -Xmx1900m
-Djava.security.egd=file:/dev/./urandom -jar <https://builds.apache.org/job/HBase-0.94/ws/trunk/target/surefire/surefirebooter4650435420716087823.jar>
<https://builds.apache.org/job/HBase-0.94/ws/trunk/target/surefire/surefire3382158438322401213tmp>
<https://builds.apache.org/job/HBase-0.94/ws/trunk/target/surefire/surefire_1111521397031685590216tmp>
Running org.apache.hadoop.hbase.ipc.TestDelayedRpc
Tests run: 4, Failures: 0, Errors: 0, Skipped: 0, Time elapsed: 2.739 sec
Forking command line: /bin/sh -c cd <https://builds.apache.org/job/HBase-0.94/ws/trunk>
&& /home/hudson/tools/java/jdk1.6.0_27-32/jre/bin/java -enableassertions -Xmx1900m
-Djava.security.egd=file:/dev/./urandom -jar <https://builds.apache.org/job/HBase-0.94/ws/trunk/target/surefire/surefirebooter5731464028469411800.jar>
<https://builds.apache.org/job/HBase-0.94/ws/trunk/target/surefire/surefire8358297610330001459tmp>
<https://builds.apache.org/job/HBase-0.94/ws/trunk/target/surefire/surefire_1122484377493640839053tmp>
Running org.apache.hadoop.hbase.thrift2.TestThriftHBaseServiceHandler
Tests run: 12, Failures: 0, Errors: 0, Skipped: 0, Time elapsed: 19.731 sec
Forking command line: /bin/sh -c cd <https://builds.apache.org/job/HBase-0.94/ws/trunk>
&& /home/hudson/tools/java/jdk1.6.0_27-32/jre/bin/java -enableassertions -Xmx1900m
-Djava.security.egd=file:/dev/./urandom -jar <https://builds.apache.org/job/HBase-0.94/ws/trunk/target/surefire/surefirebooter2458618421753262902.jar>
<https://builds.apache.org/job/HBase-0.94/ws/trunk/target/surefire/surefire4542879582999909476tmp>
<https://builds.apache.org/job/HBase-0.94/ws/trunk/target/surefire/surefire_1132774748787991281500tmp>
Running org.apache.hadoop.hbase.TestInfoServers
Tests run: 2, Failures: 0, Errors: 0, Skipped: 0, Time elapsed: 13.927 sec
Running org.apache.hadoop.hbase.TestAcidGuarantees
Tests run: 3, Failures: 0, Errors: 0, Skipped: 0, Time elapsed: 109.248 sec

Results :

Tests in error: 
  testTableOperations(org.apache.hadoop.hbase.coprocessor.TestMasterObserver): org.apache.hadoop.hbase.InvalidFamilyOperationException:
Column family 'fam2' does not exist(..)
  testRegionTransitionOperations(org.apache.hadoop.hbase.coprocessor.TestMasterObserver):
org.apache.hadoop.hbase.TableExistsException: observed_table

Tests run: 586, Failures: 0, Errors: 2, Skipped: 2

[INFO] ------------------------------------------------------------------------
[INFO] BUILD FAILURE
[INFO] ------------------------------------------------------------------------
[INFO] Total time: 33:02.032s
[INFO] Finished at: Tue Mar 06 22:02:26 UTC 2012
[INFO] Final Memory: 42M/611M
[INFO] ------------------------------------------------------------------------
[ERROR] Failed to execute goal org.apache.maven.plugins:maven-surefire-plugin:2.12-TRUNK-HBASE-2:test
(secondPartTestsExecution) on project hbase: There are test failures.
[ERROR] 
[ERROR] Please refer to <https://builds.apache.org/job/HBase-0.94/ws/trunk/target/surefire-reports>
for the individual test results.
[ERROR] -> [Help 1]
org.apache.maven.lifecycle.LifecycleExecutionException: Failed to execute goal org.apache.maven.plugins:maven-surefire-plugin:2.12-TRUNK-HBASE-2:test
(secondPartTestsExecution) on project hbase: There are test failures.

Please refer to <https://builds.apache.org/job/HBase-0.94/ws/trunk/target/surefire-reports>
for the individual test results.
	at org.apache.maven.lifecycle.internal.MojoExecutor.execute(MojoExecutor.java:213)
	at org.apache.maven.lifecycle.internal.MojoExecutor.execute(MojoExecutor.java:153)
	at org.apache.maven.lifecycle.internal.MojoExecutor.execute(MojoExecutor.java:145)
	at org.apache.maven.lifecycle.internal.MojoExecutor.executeForkedExecutions(MojoExecutor.java:365)
	at org.apache.maven.lifecycle.internal.MojoExecutor.execute(MojoExecutor.java:199)
	at org.apache.maven.lifecycle.internal.MojoExecutor.execute(MojoExecutor.java:153)
	at org.apache.maven.lifecycle.internal.MojoExecutor.execute(MojoExecutor.java:145)
	at org.apache.maven.lifecycle.internal.LifecycleModuleBuilder.buildProject(LifecycleModuleBuilder.java:84)
	at org.apache.maven.lifecycle.internal.LifecycleModuleBuilder.buildProject(LifecycleModuleBuilder.java:59)
	at org.apache.maven.lifecycle.internal.LifecycleStarter.singleThreadedBuild(LifecycleStarter.java:183)
	at org.apache.maven.lifecycle.internal.LifecycleStarter.execute(LifecycleStarter.java:161)
	at org.apache.maven.DefaultMaven.doExecute(DefaultMaven.java:319)
	at org.apache.maven.DefaultMaven.execute(DefaultMaven.java:156)
	at org.apache.maven.cli.MavenCli.execute(MavenCli.java:537)
	at org.apache.maven.cli.MavenCli.doMain(MavenCli.java:196)
	at org.apache.maven.cli.MavenCli.main(MavenCli.java:141)
	at sun.reflect.NativeMethodAccessorImpl.invoke0(Native Method)
	at sun.reflect.NativeMethodAccessorImpl.invoke(NativeMethodAccessorImpl.java:39)
	at sun.reflect.DelegatingMethodAccessorImpl.invoke(DelegatingMethodAccessorImpl.java:25)
	at java.lang.reflect.Method.invoke(Method.java:597)
	at org.codehaus.plexus.classworlds.launcher.Launcher.launchEnhanced(Launcher.java:290)
	at org.codehaus.plexus.classworlds.launcher.Launcher.launch(Launcher.java:230)
	at org.codehaus.plexus.classworlds.launcher.Launcher.mainWithExitCode(Launcher.java:409)
	at org.codehaus.plexus.classworlds.launcher.Launcher.main(Launcher.java:352)
Caused by: org.apache.maven.plugin.MojoFailureException: There are test failures.

Please refer to <https://builds.apache.org/job/HBase-0.94/ws/trunk/target/surefire-reports>
for the individual test results.
	at org.apache.maven.plugin.surefire.SurefireHelper.reportExecution(SurefireHelper.java:87)
	at org.apache.maven.plugin.surefire.SurefirePlugin.writeSummary(SurefirePlugin.java:651)
	at org.apache.maven.plugin.surefire.SurefirePlugin.handleSummary(SurefirePlugin.java:625)
	at org.apache.maven.plugin.surefire.AbstractSurefireMojo.executeAfterPreconditionsChecked(AbstractSurefireMojo.java:137)
	at org.apache.maven.plugin.surefire.AbstractSurefireMojo.execute(AbstractSurefireMojo.java:98)
	at org.apache.maven.plugin.DefaultBuildPluginManager.executeMojo(DefaultBuildPluginManager.java:101)
	at org.apache.maven.lifecycle.internal.MojoExecutor.execute(MojoExecutor.java:209)
	... 23 more
[ERROR] 
[ERROR] 
[ERROR] For more information about the errors and possible solutions, please read the following
articles:
[ERROR] [Help 1] http://cwiki.apache.org/confluence/display/MAVEN/MojoFailureException
Build step 'Invoke top-level Maven targets' marked build as failure
Archiving artifacts
Updating HBASE-5522
Updating HBASE-5519
Recording test results


Mime
View raw message