hbase-dev mailing list archives

Site index · List index
Message view « Date » · « Thread »
Top « Date » · « Thread »
From Apache Jenkins Server <jenk...@builds.apache.org>
Subject Build failed in Jenkins: HBase-TRUNK-security #150
Date Mon, 26 Mar 2012 05:27:21 GMT
See <https://builds.apache.org/job/HBase-TRUNK-security/150/changes>

Changes:

[tedyu] HBASE-5615 the master never does balance because of balancing the parent region (Xufeng)

------------------------------------------
[...truncated 1466 lines...]
A         bin/get-active-master.rb
AU        bin/start-hbase.sh
A         bin/hirb.rb
A         bin/region_status.rb
AU        bin/hbase-daemon.sh
A         bin/region_mover.rb
A         bin/hbase-config.sh
A         bin/local-regionservers.sh
AU        bin/zookeepers.sh
A         bin/local-master-backup.sh
AU        bin/rolling-restart.sh
A         bin/graceful_stop.sh
AU        bin/regionservers.sh
AU        bin/master-backup.sh
A         bin/replication
A         bin/replication/copy_tables_desc.rb
A         bin/hbase-jruby
AU        bin/stop-hbase.sh
A         dev-support
AU        dev-support/test-util.sh
AU        dev-support/findHangingTest.sh
AU        dev-support/test-patch.sh
A         dev-support/test-patch.properties
AU        dev-support/hbasetests.sh
A         .arcconfig
A         pom.xml
A         README.txt
 U        .
At revision 1305226
[HBase-TRUNK-security] $ /bin/bash -xe /tmp/hudson8714360889786058572.sh
+ uname -a
Linux minerva 2.6.32-33-server #70-Ubuntu SMP Thu Jul 7 22:28:30 UTC 2011 x86_64 GNU/Linux
[HBase-TRUNK-security] $ /bin/bash -xe /tmp/hudson2595011651412643810.sh
+ ulimit -a
core file size          (blocks, -c) 0
data seg size           (kbytes, -d) unlimited
scheduling priority             (-e) 20
file size               (blocks, -f) unlimited
pending signals                 (-i) 16382
max locked memory       (kbytes, -l) 64
max memory size         (kbytes, -m) unlimited
open files                      (-n) 40000
pipe size            (512 bytes, -p) 8
POSIX message queues     (bytes, -q) 819200
real-time priority              (-r) 0
stack size              (kbytes, -s) 8192
cpu time               (seconds, -t) unlimited
max user processes              (-u) unlimited
virtual memory          (kbytes, -v) unlimited
file locks                      (-x) unlimited
[trunk] $ /home/hudson/tools/maven/latest3/bin/mvn -e clean -Dmaven.test.redirectTestOutputToFile=true
-P security,runAllTests -Dsurefire.secondPartThreadCount=3 site assembly:assembly
[INFO] Error stacktraces are turned on.
[INFO] Scanning for projects...
[INFO]                                                                         
[INFO] ------------------------------------------------------------------------
[INFO] Building HBase 0.95-SNAPSHOT
[INFO] ------------------------------------------------------------------------
[INFO] 
[INFO] --- maven-clean-plugin:2.4.1:clean (default-clean) @ hbase ---
[INFO] 
[INFO] --- xml-maven-plugin:1.0-beta-3:transform (default) @ hbase ---
[INFO] Transforming file: <https://builds.apache.org/job/HBase-TRUNK-security/ws/trunk/src/main/resources/hbase-default.xml>
[INFO] Transformed 1 file(s).
[INFO] 
[INFO] --- docbkx-maven-plugin:2.0.13:generate-html (multipage) @ hbase ---
[INFO] Processing input file: upgrading.xml
[INFO] Chunking output.
[INFO] See <https://builds.apache.org/job/HBase-TRUNK-security/ws/trunk/target/site/book/upgrading>
for generated file(s)
[INFO] Processing input file: preface.xml
[INFO] Chunking output.
[INFO] See <https://builds.apache.org/job/HBase-TRUNK-security/ws/trunk/target/site/book/preface>
for generated file(s)
[INFO] Processing input file: configuration.xml
[INFO] Chunking output.
[INFO] See <https://builds.apache.org/job/HBase-TRUNK-security/ws/trunk/target/site/book/configuration>
for generated file(s)
[INFO] Processing input file: shell.xml
[INFO] Chunking output.
[INFO] See <https://builds.apache.org/job/HBase-TRUNK-security/ws/trunk/target/site/book/shell>
for generated file(s)
[INFO] Processing input file: performance.xml
[INFO] Chunking output.
[INFO] See <https://builds.apache.org/job/HBase-TRUNK-security/ws/trunk/target/site/book/performance>
for generated file(s)
[INFO] Processing input file: getting_started.xml
[INFO] Chunking output.
[INFO] See <https://builds.apache.org/job/HBase-TRUNK-security/ws/trunk/target/site/book/getting_started>
for generated file(s)
[INFO] Processing input file: external_apis.xml
[INFO] Chunking output.
[INFO] See <https://builds.apache.org/job/HBase-TRUNK-security/ws/trunk/target/site/book/external_apis>
for generated file(s)
[INFO] Processing input file: book.xml
[INFO] Chunking output.
[INFO] See <https://builds.apache.org/job/HBase-TRUNK-security/ws/trunk/target/site/book/book>
for generated file(s)
[INFO] Processing input file: ops_mgt.xml
[INFO] Chunking output.
[INFO] See <https://builds.apache.org/job/HBase-TRUNK-security/ws/trunk/target/site/book/ops_mgt>
for generated file(s)
[INFO] Processing input file: troubleshooting.xml
[INFO] Chunking output.
[INFO] See <https://builds.apache.org/job/HBase-TRUNK-security/ws/trunk/target/site/book/troubleshooting>
for generated file(s)
[INFO] Processing input file: developer.xml
[INFO] Chunking output.
[INFO] See <https://builds.apache.org/job/HBase-TRUNK-security/ws/trunk/target/site/book/developer>
for generated file(s)
[INFO] 
[INFO] --- docbkx-maven-plugin:2.0.13:generate-html (onepage) @ hbase ---
[INFO] Processing input file: upgrading.xml
[INFO] <https://builds.apache.org/job/HBase-TRUNK-security/150/artifact/trunk/target/site/upgrading.html>
has been generated.
[INFO] Processing input file: preface.xml
[INFO] <https://builds.apache.org/job/HBase-TRUNK-security/150/artifact/trunk/target/site/preface.html>
has been generated.
[INFO] Processing input file: configuration.xml
[INFO] <https://builds.apache.org/job/HBase-TRUNK-security/150/artifact/trunk/target/site/configuration.html>
has been generated.
[INFO] Processing input file: shell.xml
[INFO] <https://builds.apache.org/job/HBase-TRUNK-security/150/artifact/trunk/target/site/shell.html>
has been generated.
[INFO] Processing input file: performance.xml
[INFO] <https://builds.apache.org/job/HBase-TRUNK-security/150/artifact/trunk/target/site/performance.html>
has been generated.
[INFO] Processing input file: getting_started.xml
[INFO] <https://builds.apache.org/job/HBase-TRUNK-security/150/artifact/trunk/target/site/getting_started.html>
has been generated.
[INFO] Processing input file: external_apis.xml
[INFO] <https://builds.apache.org/job/HBase-TRUNK-security/150/artifact/trunk/target/site/external_apis.html>
has been generated.
[INFO] Processing input file: book.xml
[INFO] <https://builds.apache.org/job/HBase-TRUNK-security/150/artifact/trunk/target/site/book.html>
has been generated.
[INFO] Processing input file: ops_mgt.xml
[INFO] <https://builds.apache.org/job/HBase-TRUNK-security/150/artifact/trunk/target/site/ops_mgt.html>
has been generated.
[INFO] Processing input file: troubleshooting.xml
[INFO] <https://builds.apache.org/job/HBase-TRUNK-security/150/artifact/trunk/target/site/troubleshooting.html>
has been generated.
[INFO] Processing input file: developer.xml
[INFO] <https://builds.apache.org/job/HBase-TRUNK-security/150/artifact/trunk/target/site/developer.html>
has been generated.
[INFO] 
[INFO] --- maven-site-plugin:2.0.1:site (default-site) @ hbase ---
[INFO] Parent project loaded from repository.
[INFO] Parent project loaded from repository.
[INFO]                                                                         
[INFO] ------------------------------------------------------------------------
[INFO] Building HBase 0.95-SNAPSHOT
[INFO] ------------------------------------------------------------------------
[INFO] 
[INFO] >>> maven-assembly-plugin:2.2-beta-5:assembly (default-cli) @ hbase >>>
[INFO] 
[INFO] --- maven-antrun-plugin:1.6:run (arc-setup) @ hbase ---
[WARNING] Parameter tasks is deprecated, use target instead
[INFO] Executing tasks

main:
[INFO] Executed tasks
[INFO] 
[INFO] --- avro-maven-plugin:1.5.3:schema (generate-avro-sources) @ hbase ---
[INFO] 
[INFO] --- avro-maven-plugin:1.5.3:protocol (generate-avro-sources) @ hbase ---
[INFO] 
[INFO] --- maven-antrun-plugin:1.6:run (generate) @ hbase ---
[INFO] Executing tasks

main:
    [mkdir] Created dir: <https://builds.apache.org/job/HBase-TRUNK-security/ws/trunk/target/hbase-webapps>
     [copy] Copying 6 files to <https://builds.apache.org/job/HBase-TRUNK-security/ws/trunk/target/hbase-webapps>
12/03/26 05:26:16 INFO mortbay.log: Logging to org.slf4j.impl.Log4jLoggerAdapter(org.mortbay.log)
via org.mortbay.log.Slf4jLog
    [mkdir] Created dir: <https://builds.apache.org/job/HBase-TRUNK-security/ws/trunk/target/hbase-webapps/master/WEB-INF>
    [mkdir] Created dir: <https://builds.apache.org/job/HBase-TRUNK-security/ws/trunk/target/hbase-webapps/regionserver/WEB-INF>
[INFO] Executed tasks
[INFO] 
[INFO] --- build-helper-maven-plugin:1.5:add-source (jspcSource-packageInfo-Avro-source) @
hbase ---
[INFO] Source directory: <https://builds.apache.org/job/HBase-TRUNK-security/ws/trunk/target/generated-jamon>
added.
[INFO] Source directory: <https://builds.apache.org/job/HBase-TRUNK-security/ws/trunk/target/generated-sources/java>
added.
[INFO] 
[INFO] --- build-helper-maven-plugin:1.5:add-source (add-source) @ hbase ---
[INFO] Source directory: <https://builds.apache.org/job/HBase-TRUNK-security/ws/trunk/security/src/main/java>
added.
[INFO] 
[INFO] --- jamon-maven-plugin:2.3.4:translate (default) @ hbase ---
[INFO] Translating 4 templates from <https://builds.apache.org/job/HBase-TRUNK-security/ws/trunk/src/main/jamon>
to <https://builds.apache.org/job/HBase-TRUNK-security/ws/trunk/target/generated-jamon>
[INFO] 
[INFO] --- maven-remote-resources-plugin:1.1:process (default) @ hbase ---
[INFO] Setting property: classpath.resource.loader.class => 'org.codehaus.plexus.velocity.ContextClassLoaderResourceLoader'.
[INFO] Setting property: velocimacro.messages.on => 'false'.
[INFO] Setting property: resource.loader => 'classpath'.
[INFO] Setting property: resource.manager.logwhenfound => 'false'.
[INFO] 
[INFO] --- maven-resources-plugin:2.4:resources (default-resources) @ hbase ---
[INFO] Using 'UTF-8' encoding to copy filtered resources.
[INFO] Copying 1 resource
[INFO] Copying 8 resources
[INFO] Copying 3 resources
[INFO] 
[INFO] --- maven-antrun-plugin:1.6:run (default) @ hbase ---
[INFO] Executing tasks

main:
    [mkdir] Created dir: <https://builds.apache.org/job/HBase-TRUNK-security/ws/trunk/target/nativelib>
     [exec] tar: hadoop-snappy-nativelibs.tar: Cannot open: No such file or directory
     [exec] tar: Error is not recoverable: exiting now
     [exec] Result: 2
[INFO] Executed tasks
[INFO] 
[INFO] --- maven-compiler-plugin:2.0.2:compile (default-compile) @ hbase ---
[INFO] Compiling 732 source files to <https://builds.apache.org/job/HBase-TRUNK-security/ws/trunk/target/classes>
[INFO] ------------------------------------------------------------------------
[INFO] BUILD FAILURE
[INFO] ------------------------------------------------------------------------
[INFO] Total time: 44.473s
[INFO] Finished at: Mon Mar 26 05:26:31 UTC 2012
[INFO] Final Memory: 41M/660M
[INFO] ------------------------------------------------------------------------
[ERROR] Failed to execute goal org.apache.maven.plugins:maven-compiler-plugin:2.0.2:compile
(default-compile) on project hbase: Compilation failure: Compilation failure:
[ERROR] <https://builds.apache.org/job/HBase-TRUNK-security/ws/trunk/src/main/java/org/apache/hadoop/hbase/util/Bytes.java>:[47,15]
sun.misc.Unsafe is Sun proprietary API and may be removed in a future release
[ERROR] 
[ERROR] <https://builds.apache.org/job/HBase-TRUNK-security/ws/trunk/src/main/java/org/apache/hadoop/hbase/util/Bytes.java>:[1040,19]
sun.misc.Unsafe is Sun proprietary API and may be removed in a future release
[ERROR] 
[ERROR] <https://builds.apache.org/job/HBase-TRUNK-security/ws/trunk/src/main/java/org/apache/hadoop/hbase/util/Bytes.java>:[1046,21]
sun.misc.Unsafe is Sun proprietary API and may be removed in a future release
[ERROR] 
[ERROR] <https://builds.apache.org/job/HBase-TRUNK-security/ws/trunk/src/main/java/org/apache/hadoop/hbase/util/Bytes.java>:[1051,28]
sun.misc.Unsafe is Sun proprietary API and may be removed in a future release
[ERROR] 
[ERROR] <https://builds.apache.org/job/HBase-TRUNK-security/ws/trunk/security/src/main/java/org/apache/hadoop/hbase/ipc/SecureServer.java>:[99,6]
cannot find symbol
[ERROR] symbol  : constructor Call(int,org.apache.hadoop.io.Writable,org.apache.hadoop.hbase.ipc.HBaseServer.Connection,org.apache.hadoop.hbase.ipc.HBaseServer.Responder)
[ERROR] location: class org.apache.hadoop.hbase.ipc.HBaseServer.Call
[ERROR] -> [Help 1]
org.apache.maven.lifecycle.LifecycleExecutionException: Failed to execute goal org.apache.maven.plugins:maven-compiler-plugin:2.0.2:compile
(default-compile) on project hbase: Compilation failure
	at org.apache.maven.lifecycle.internal.MojoExecutor.execute(MojoExecutor.java:213)
	at org.apache.maven.lifecycle.internal.MojoExecutor.execute(MojoExecutor.java:153)
	at org.apache.maven.lifecycle.internal.MojoExecutor.execute(MojoExecutor.java:145)
	at org.apache.maven.lifecycle.internal.MojoExecutor.executeForkedExecutions(MojoExecutor.java:365)
	at org.apache.maven.lifecycle.internal.MojoExecutor.execute(MojoExecutor.java:199)
	at org.apache.maven.lifecycle.internal.MojoExecutor.execute(MojoExecutor.java:153)
	at org.apache.maven.lifecycle.internal.MojoExecutor.execute(MojoExecutor.java:145)
	at org.apache.maven.lifecycle.internal.LifecycleModuleBuilder.buildProject(LifecycleModuleBuilder.java:84)
	at org.apache.maven.lifecycle.internal.LifecycleModuleBuilder.buildProject(LifecycleModuleBuilder.java:59)
	at org.apache.maven.lifecycle.internal.LifecycleStarter.singleThreadedBuild(LifecycleStarter.java:183)
	at org.apache.maven.lifecycle.internal.LifecycleStarter.execute(LifecycleStarter.java:161)
	at org.apache.maven.DefaultMaven.doExecute(DefaultMaven.java:319)
	at org.apache.maven.DefaultMaven.execute(DefaultMaven.java:156)
	at org.apache.maven.cli.MavenCli.execute(MavenCli.java:537)
	at org.apache.maven.cli.MavenCli.doMain(MavenCli.java:196)
	at org.apache.maven.cli.MavenCli.main(MavenCli.java:141)
	at sun.reflect.NativeMethodAccessorImpl.invoke0(Native Method)
	at sun.reflect.NativeMethodAccessorImpl.invoke(NativeMethodAccessorImpl.java:39)
	at sun.reflect.DelegatingMethodAccessorImpl.invoke(DelegatingMethodAccessorImpl.java:25)
	at java.lang.reflect.Method.invoke(Method.java:597)
	at org.codehaus.plexus.classworlds.launcher.Launcher.launchEnhanced(Launcher.java:290)
	at org.codehaus.plexus.classworlds.launcher.Launcher.launch(Launcher.java:230)
	at org.codehaus.plexus.classworlds.launcher.Launcher.mainWithExitCode(Launcher.java:409)
	at org.codehaus.plexus.classworlds.launcher.Launcher.main(Launcher.java:352)
Caused by: org.apache.maven.plugin.CompilationFailureException: Compilation failure
	at org.apache.maven.plugin.AbstractCompilerMojo.execute(AbstractCompilerMojo.java:516)
	at org.apache.maven.plugin.CompilerMojo.execute(CompilerMojo.java:114)
	at org.apache.maven.plugin.DefaultBuildPluginManager.executeMojo(DefaultBuildPluginManager.java:101)
	at org.apache.maven.lifecycle.internal.MojoExecutor.execute(MojoExecutor.java:209)
	... 23 more
[ERROR] 
[ERROR] Re-run Maven using the -X switch to enable full debug logging.
[ERROR] 
[ERROR] For more information about the errors and possible solutions, please read the following
articles:
[ERROR] [Help 1] http://cwiki.apache.org/confluence/display/MAVEN/MojoFailureException
Build step 'Invoke top-level Maven targets' marked build as failure
Archiving artifacts
Updating HBASE-5615
Recording test results

Mime
View raw message