hbase-dev mailing list archives

Site index · List index
Message view « Date » · « Thread »
Top « Date » · « Thread »
From Apache Jenkins Server <jenk...@builds.apache.org>
Subject Build failed in Jenkins: HBase-0.92-security #93
Date Wed, 22 Feb 2012 06:22:45 GMT
See <https://builds.apache.org/job/HBase-0.92-security/93/changes>

Changes:

[tedyu] HBASE-5209 Addendum adds znode creation call (David Wang)

------------------------------------------
[...truncated 6731 lines...]
Running org.apache.hadoop.hbase.rest.TestScannersWithFilters
Tests run: 10, Failures: 0, Errors: 0, Skipped: 0, Time elapsed: 24.997 sec
Forking command line: /bin/sh -c cd /x1/jenkins/jenkins-slave/workspace/HBase-0.92-security/trunk
&& /x1/jenkins/tools/java/jdk1.6.0_27-32/jre/bin/java -enableassertions -Xmx1400m
-Djava.security.egd=file:/dev/./urandom -jar /x1/jenkins/jenkins-slave/workspace/HBase-0.92-security/trunk/target/surefire/surefirebooter5332922322552968116.jar
/x1/jenkins/jenkins-slave/workspace/HBase-0.92-security/trunk/target/surefire/surefire6443882315803557939tmp
/x1/jenkins/jenkins-slave/workspace/HBase-0.92-security/trunk/target/surefire/surefire5635404206832713413tmp
Running org.apache.hadoop.hbase.metrics.TestMetricsMBeanBase
Tests run: 2, Failures: 0, Errors: 0, Skipped: 0, Time elapsed: 1.116 sec
Forking command line: /bin/sh -c cd /x1/jenkins/jenkins-slave/workspace/HBase-0.92-security/trunk
&& /x1/jenkins/tools/java/jdk1.6.0_27-32/jre/bin/java -enableassertions -Xmx1400m
-Djava.security.egd=file:/dev/./urandom -jar /x1/jenkins/jenkins-slave/workspace/HBase-0.92-security/trunk/target/surefire/surefirebooter2879133477484552315.jar
/x1/jenkins/jenkins-slave/workspace/HBase-0.92-security/trunk/target/surefire/surefire2320682579437225591tmp
/x1/jenkins/jenkins-slave/workspace/HBase-0.92-security/trunk/target/surefire/surefire1165120092444492482tmp
Running org.apache.hadoop.hbase.io.hfile.TestHFileWriterV2
Tests run: 1, Failures: 0, Errors: 0, Skipped: 0, Time elapsed: 1.106 sec
Forking command line: /bin/sh -c cd /x1/jenkins/jenkins-slave/workspace/HBase-0.92-security/trunk
&& /x1/jenkins/tools/java/jdk1.6.0_27-32/jre/bin/java -enableassertions -Xmx1400m
-Djava.security.egd=file:/dev/./urandom -jar /x1/jenkins/jenkins-slave/workspace/HBase-0.92-security/trunk/target/surefire/surefirebooter6181447708503744972.jar
/x1/jenkins/jenkins-slave/workspace/HBase-0.92-security/trunk/target/surefire/surefire3258991221413598490tmp
/x1/jenkins/jenkins-slave/workspace/HBase-0.92-security/trunk/target/surefire/surefire2416681111867056008tmp
Running org.apache.hadoop.hbase.io.hfile.TestHFile
Tests run: 6, Failures: 0, Errors: 0, Skipped: 0, Time elapsed: 0.607 sec
Forking command line: /bin/sh -c cd /x1/jenkins/jenkins-slave/workspace/HBase-0.92-security/trunk
&& /x1/jenkins/tools/java/jdk1.6.0_27-32/jre/bin/java -enableassertions -Xmx1400m
-Djava.security.egd=file:/dev/./urandom -jar /x1/jenkins/jenkins-slave/workspace/HBase-0.92-security/trunk/target/surefire/surefirebooter9207752473481780380.jar
/x1/jenkins/jenkins-slave/workspace/HBase-0.92-security/trunk/target/surefire/surefire2777339962376296728tmp
/x1/jenkins/jenkins-slave/workspace/HBase-0.92-security/trunk/target/surefire/surefire8172118048958069325tmp
Running org.apache.hadoop.hbase.io.hfile.TestHFileBlockIndex
Tests run: 10, Failures: 0, Errors: 0, Skipped: 0, Time elapsed: 7.344 sec
Forking command line: /bin/sh -c cd /x1/jenkins/jenkins-slave/workspace/HBase-0.92-security/trunk
&& /x1/jenkins/tools/java/jdk1.6.0_27-32/jre/bin/java -enableassertions -Xmx1400m
-Djava.security.egd=file:/dev/./urandom -jar /x1/jenkins/jenkins-slave/workspace/HBase-0.92-security/trunk/target/surefire/surefirebooter5358215463927329462.jar
/x1/jenkins/jenkins-slave/workspace/HBase-0.92-security/trunk/target/surefire/surefire4283959912576928608tmp
/x1/jenkins/jenkins-slave/workspace/HBase-0.92-security/trunk/target/surefire/surefire4493202687226194220tmp
Running org.apache.hadoop.hbase.io.hfile.TestHFileSeek
Tests run: 1, Failures: 0, Errors: 0, Skipped: 0, Time elapsed: 4.194 sec
Forking command line: /bin/sh -c cd /x1/jenkins/jenkins-slave/workspace/HBase-0.92-security/trunk
&& /x1/jenkins/tools/java/jdk1.6.0_27-32/jre/bin/java -enableassertions -Xmx1400m
-Djava.security.egd=file:/dev/./urandom -jar /x1/jenkins/jenkins-slave/workspace/HBase-0.92-security/trunk/target/surefire/surefirebooter2478724667156142911.jar
/x1/jenkins/jenkins-slave/workspace/HBase-0.92-security/trunk/target/surefire/surefire2702468780832306645tmp
/x1/jenkins/jenkins-slave/workspace/HBase-0.92-security/trunk/target/surefire/surefire2707880996267794913tmp
Running org.apache.hadoop.hbase.io.hfile.TestLruBlockCache
Tests run: 7, Failures: 0, Errors: 0, Skipped: 0, Time elapsed: 0.334 sec
Forking command line: /bin/sh -c cd /x1/jenkins/jenkins-slave/workspace/HBase-0.92-security/trunk
&& /x1/jenkins/tools/java/jdk1.6.0_27-32/jre/bin/java -enableassertions -Xmx1400m
-Djava.security.egd=file:/dev/./urandom -jar /x1/jenkins/jenkins-slave/workspace/HBase-0.92-security/trunk/target/surefire/surefirebooter2913991283953740789.jar
/x1/jenkins/jenkins-slave/workspace/HBase-0.92-security/trunk/target/surefire/surefire3112527675235338525tmp
/x1/jenkins/jenkins-slave/workspace/HBase-0.92-security/trunk/target/surefire/surefire4654839560388372349tmp
Running org.apache.hadoop.hbase.io.hfile.TestFixedFileTrailer
Tests run: 2, Failures: 0, Errors: 0, Skipped: 0, Time elapsed: 0.562 sec
Forking command line: /bin/sh -c cd /x1/jenkins/jenkins-slave/workspace/HBase-0.92-security/trunk
&& /x1/jenkins/tools/java/jdk1.6.0_27-32/jre/bin/java -enableassertions -Xmx1400m
-Djava.security.egd=file:/dev/./urandom -jar /x1/jenkins/jenkins-slave/workspace/HBase-0.92-security/trunk/target/surefire/surefirebooter6015818489143165035.jar
/x1/jenkins/jenkins-slave/workspace/HBase-0.92-security/trunk/target/surefire/surefire6533877363421298971tmp
/x1/jenkins/jenkins-slave/workspace/HBase-0.92-security/trunk/target/surefire/surefire8542714332078377826tmp
Running org.apache.hadoop.hbase.io.hfile.TestCachedBlockQueue
Tests run: 2, Failures: 0, Errors: 0, Skipped: 0, Time elapsed: 0.08 sec
Forking command line: /bin/sh -c cd /x1/jenkins/jenkins-slave/workspace/HBase-0.92-security/trunk
&& /x1/jenkins/tools/java/jdk1.6.0_27-32/jre/bin/java -enableassertions -Xmx1400m
-Djava.security.egd=file:/dev/./urandom -jar /x1/jenkins/jenkins-slave/workspace/HBase-0.92-security/trunk/target/surefire/surefirebooter3365910400042000549.jar
/x1/jenkins/jenkins-slave/workspace/HBase-0.92-security/trunk/target/surefire/surefire7447562114772525368tmp
/x1/jenkins/jenkins-slave/workspace/HBase-0.92-security/trunk/target/surefire/surefire743655330911044687tmp
Running org.apache.hadoop.hbase.io.hfile.TestHFilePerformance
Tests run: 1, Failures: 0, Errors: 0, Skipped: 0, Time elapsed: 4.192 sec
Forking command line: /bin/sh -c cd /x1/jenkins/jenkins-slave/workspace/HBase-0.92-security/trunk
&& /x1/jenkins/tools/java/jdk1.6.0_27-32/jre/bin/java -enableassertions -Xmx1400m
-Djava.security.egd=file:/dev/./urandom -jar /x1/jenkins/jenkins-slave/workspace/HBase-0.92-security/trunk/target/surefire/surefirebooter6321499825190417095.jar
/x1/jenkins/jenkins-slave/workspace/HBase-0.92-security/trunk/target/surefire/surefire7603082373427441945tmp
/x1/jenkins/jenkins-slave/workspace/HBase-0.92-security/trunk/target/surefire/surefire4258269932561302047tmp
Running org.apache.hadoop.hbase.io.hfile.TestCacheOnWrite
Tests run: 6, Failures: 0, Errors: 0, Skipped: 0, Time elapsed: 5.518 sec
Forking command line: /bin/sh -c cd /x1/jenkins/jenkins-slave/workspace/HBase-0.92-security/trunk
&& /x1/jenkins/tools/java/jdk1.6.0_27-32/jre/bin/java -enableassertions -Xmx1400m
-Djava.security.egd=file:/dev/./urandom -jar /x1/jenkins/jenkins-slave/workspace/HBase-0.92-security/trunk/target/surefire/surefirebooter7080331353286207917.jar
/x1/jenkins/jenkins-slave/workspace/HBase-0.92-security/trunk/target/surefire/surefire8368397883784342503tmp
/x1/jenkins/jenkins-slave/workspace/HBase-0.92-security/trunk/target/surefire/surefire6456730254270201553tmp
Running org.apache.hadoop.hbase.io.hfile.TestReseekTo
Tests run: 1, Failures: 0, Errors: 0, Skipped: 0, Time elapsed: 0.607 sec
Forking command line: /bin/sh -c cd /x1/jenkins/jenkins-slave/workspace/HBase-0.92-security/trunk
&& /x1/jenkins/tools/java/jdk1.6.0_27-32/jre/bin/java -enableassertions -Xmx1400m
-Djava.security.egd=file:/dev/./urandom -jar /x1/jenkins/jenkins-slave/workspace/HBase-0.92-security/trunk/target/surefire/surefirebooter8767418846012297437.jar
/x1/jenkins/jenkins-slave/workspace/HBase-0.92-security/trunk/target/surefire/surefire3087515448464465326tmp
/x1/jenkins/jenkins-slave/workspace/HBase-0.92-security/trunk/target/surefire/surefire4910829001108331165tmp
Running org.apache.hadoop.hbase.io.hfile.TestSeekTo
Tests run: 3, Failures: 0, Errors: 0, Skipped: 0, Time elapsed: 0.525 sec
Forking command line: /bin/sh -c cd /x1/jenkins/jenkins-slave/workspace/HBase-0.92-security/trunk
&& /x1/jenkins/tools/java/jdk1.6.0_27-32/jre/bin/java -enableassertions -Xmx1400m
-Djava.security.egd=file:/dev/./urandom -jar /x1/jenkins/jenkins-slave/workspace/HBase-0.92-security/trunk/target/surefire/surefirebooter270635780408826737.jar
/x1/jenkins/jenkins-slave/workspace/HBase-0.92-security/trunk/target/surefire/surefire7823141857840415090tmp
/x1/jenkins/jenkins-slave/workspace/HBase-0.92-security/trunk/target/surefire/surefire4407710698874695106tmp
Running org.apache.hadoop.hbase.io.hfile.TestBlockCacheColumnFamilySummary
Tests run: 4, Failures: 0, Errors: 0, Skipped: 0, Time elapsed: 0.046 sec
Forking command line: /bin/sh -c cd /x1/jenkins/jenkins-slave/workspace/HBase-0.92-security/trunk
&& /x1/jenkins/tools/java/jdk1.6.0_27-32/jre/bin/java -enableassertions -Xmx1400m
-Djava.security.egd=file:/dev/./urandom -jar /x1/jenkins/jenkins-slave/workspace/HBase-0.92-security/trunk/target/surefire/surefirebooter7340807802405785397.jar
/x1/jenkins/jenkins-slave/workspace/HBase-0.92-security/trunk/target/surefire/surefire208855930917028582tmp
/x1/jenkins/jenkins-slave/workspace/HBase-0.92-security/trunk/target/surefire/surefire6007954597924606577tmp
Running org.apache.hadoop.hbase.io.hfile.TestHFileBlock
Tests run: 7, Failures: 0, Errors: 0, Skipped: 0, Time elapsed: 24.09 sec
Forking command line: /bin/sh -c cd /x1/jenkins/jenkins-slave/workspace/HBase-0.92-security/trunk
&& /x1/jenkins/tools/java/jdk1.6.0_27-32/jre/bin/java -enableassertions -Xmx1400m
-Djava.security.egd=file:/dev/./urandom -jar /x1/jenkins/jenkins-slave/workspace/HBase-0.92-security/trunk/target/surefire/surefirebooter2891295483440389084.jar
/x1/jenkins/jenkins-slave/workspace/HBase-0.92-security/trunk/target/surefire/surefire8863112750597980622tmp
/x1/jenkins/jenkins-slave/workspace/HBase-0.92-security/trunk/target/surefire/surefire3993805814948812508tmp
Running org.apache.hadoop.hbase.io.hfile.slab.TestSlabCache
Tests run: 7, Failures: 0, Errors: 0, Skipped: 0, Time elapsed: 13.383 sec
Forking command line: /bin/sh -c cd /x1/jenkins/jenkins-slave/workspace/HBase-0.92-security/trunk
&& /x1/jenkins/tools/java/jdk1.6.0_27-32/jre/bin/java -enableassertions -Xmx1400m
-Djava.security.egd=file:/dev/./urandom -jar /x1/jenkins/jenkins-slave/workspace/HBase-0.92-security/trunk/target/surefire/surefirebooter582186108383498358.jar
/x1/jenkins/jenkins-slave/workspace/HBase-0.92-security/trunk/target/surefire/surefire1672523657042530072tmp
/x1/jenkins/jenkins-slave/workspace/HBase-0.92-security/trunk/target/surefire/surefire6949432507019193762tmp
Running org.apache.hadoop.hbase.io.hfile.slab.TestSingleSizeCache
Tests run: 5, Failures: 0, Errors: 0, Skipped: 0, Time elapsed: 17.439 sec
Forking command line: /bin/sh -c cd /x1/jenkins/jenkins-slave/workspace/HBase-0.92-security/trunk
&& /x1/jenkins/tools/java/jdk1.6.0_27-32/jre/bin/java -enableassertions -Xmx1400m
-Djava.security.egd=file:/dev/./urandom -jar /x1/jenkins/jenkins-slave/workspace/HBase-0.92-security/trunk/target/surefire/surefirebooter9136872820292092228.jar
/x1/jenkins/jenkins-slave/workspace/HBase-0.92-security/trunk/target/surefire/surefire2310734537141513497tmp
/x1/jenkins/jenkins-slave/workspace/HBase-0.92-security/trunk/target/surefire/surefire2328207455421890622tmp
Running org.apache.hadoop.hbase.io.hfile.slab.TestSlab
Tests run: 1, Failures: 0, Errors: 0, Skipped: 0, Time elapsed: 0.111 sec
Forking command line: /bin/sh -c cd /x1/jenkins/jenkins-slave/workspace/HBase-0.92-security/trunk
&& /x1/jenkins/tools/java/jdk1.6.0_27-32/jre/bin/java -enableassertions -Xmx1400m
-Djava.security.egd=file:/dev/./urandom -jar /x1/jenkins/jenkins-slave/workspace/HBase-0.92-security/trunk/target/surefire/surefirebooter4460788900144012075.jar
/x1/jenkins/jenkins-slave/workspace/HBase-0.92-security/trunk/target/surefire/surefire2834560838142765176tmp
/x1/jenkins/jenkins-slave/workspace/HBase-0.92-security/trunk/target/surefire/surefire3494659118888007425tmp
Running org.apache.hadoop.hbase.io.hfile.TestHFileReaderV1
Tests run: 1, Failures: 0, Errors: 0, Skipped: 0, Time elapsed: 0.454 sec
Forking command line: /bin/sh -c cd /x1/jenkins/jenkins-slave/workspace/HBase-0.92-security/trunk
&& /x1/jenkins/tools/java/jdk1.6.0_27-32/jre/bin/java -enableassertions -Xmx1400m
-Djava.security.egd=file:/dev/./urandom -jar /x1/jenkins/jenkins-slave/workspace/HBase-0.92-security/trunk/target/surefire/surefirebooter2675108643252807977.jar
/x1/jenkins/jenkins-slave/workspace/HBase-0.92-security/trunk/target/surefire/surefire7257182604366079802tmp
/x1/jenkins/jenkins-slave/workspace/HBase-0.92-security/trunk/target/surefire/surefire4041288566275802266tmp
Running org.apache.hadoop.hbase.io.TestHalfStoreFileReader
Tests run: 1, Failures: 0, Errors: 0, Skipped: 0, Time elapsed: 0.621 sec
Forking command line: /bin/sh -c cd /x1/jenkins/jenkins-slave/workspace/HBase-0.92-security/trunk
&& /x1/jenkins/tools/java/jdk1.6.0_27-32/jre/bin/java -enableassertions -Xmx1400m
-Djava.security.egd=file:/dev/./urandom -jar /x1/jenkins/jenkins-slave/workspace/HBase-0.92-security/trunk/target/surefire/surefirebooter5936812436794661792.jar
/x1/jenkins/jenkins-slave/workspace/HBase-0.92-security/trunk/target/surefire/surefire7100757576764682433tmp
/x1/jenkins/jenkins-slave/workspace/HBase-0.92-security/trunk/target/surefire/surefire6360579208510823756tmp
Running org.apache.hadoop.hbase.io.TestHbaseObjectWritable
Tests run: 4, Failures: 0, Errors: 0, Skipped: 0, Time elapsed: 0.364 sec
Forking command line: /bin/sh -c cd /x1/jenkins/jenkins-slave/workspace/HBase-0.92-security/trunk
&& /x1/jenkins/tools/java/jdk1.6.0_27-32/jre/bin/java -enableassertions -Xmx1400m
-Djava.security.egd=file:/dev/./urandom -jar /x1/jenkins/jenkins-slave/workspace/HBase-0.92-security/trunk/target/surefire/surefirebooter7637440478358683773.jar
/x1/jenkins/jenkins-slave/workspace/HBase-0.92-security/trunk/target/surefire/surefire3235773505261546574tmp
/x1/jenkins/jenkins-slave/workspace/HBase-0.92-security/trunk/target/surefire/surefire830987518666364137tmp
Running org.apache.hadoop.hbase.io.TestImmutableBytesWritable
Tests run: 3, Failures: 0, Errors: 0, Skipped: 0, Time elapsed: 0.084 sec
Forking command line: /bin/sh -c cd /x1/jenkins/jenkins-slave/workspace/HBase-0.92-security/trunk
&& /x1/jenkins/tools/java/jdk1.6.0_27-32/jre/bin/java -enableassertions -Xmx1400m
-Djava.security.egd=file:/dev/./urandom -jar /x1/jenkins/jenkins-slave/workspace/HBase-0.92-security/trunk/target/surefire/surefirebooter5527946865335664171.jar
/x1/jenkins/jenkins-slave/workspace/HBase-0.92-security/trunk/target/surefire/surefire5394256511182408764tmp
/x1/jenkins/jenkins-slave/workspace/HBase-0.92-security/trunk/target/surefire/surefire7280276662192621275tmp
Running org.apache.hadoop.hbase.io.TestHeapSize
Tests run: 2, Failures: 0, Errors: 0, Skipped: 0, Time elapsed: 0.135 sec
Forking command line: /bin/sh -c cd /x1/jenkins/jenkins-slave/workspace/HBase-0.92-security/trunk
&& /x1/jenkins/tools/java/jdk1.6.0_27-32/jre/bin/java -enableassertions -Xmx1400m
-Djava.security.egd=file:/dev/./urandom -jar /x1/jenkins/jenkins-slave/workspace/HBase-0.92-security/trunk/target/surefire/surefirebooter402614776277515493.jar
/x1/jenkins/jenkins-slave/workspace/HBase-0.92-security/trunk/target/surefire/surefire8386944895387433388tmp
/x1/jenkins/jenkins-slave/workspace/HBase-0.92-security/trunk/target/surefire/surefire8606685777960049452tmp
Running org.apache.hadoop.hbase.TestRegionRebalancing
Tests run: 1, Failures: 0, Errors: 0, Skipped: 0, Time elapsed: 46.496 sec
Forking command line: /bin/sh -c cd /x1/jenkins/jenkins-slave/workspace/HBase-0.92-security/trunk
&& /x1/jenkins/tools/java/jdk1.6.0_27-32/jre/bin/java -enableassertions -Xmx1400m
-Djava.security.egd=file:/dev/./urandom -jar /x1/jenkins/jenkins-slave/workspace/HBase-0.92-security/trunk/target/surefire/surefirebooter6623226763043170856.jar
/x1/jenkins/jenkins-slave/workspace/HBase-0.92-security/trunk/target/surefire/surefire2666305086503094906tmp
/x1/jenkins/jenkins-slave/workspace/HBase-0.92-security/trunk/target/surefire/surefire2976748480241638604tmp
Running org.apache.hadoop.hbase.mapred.TestTableInputFormat
Tests run: 6, Failures: 0, Errors: 0, Skipped: 0, Time elapsed: 26.567 sec
Forking command line: /bin/sh -c cd /x1/jenkins/jenkins-slave/workspace/HBase-0.92-security/trunk
&& /x1/jenkins/tools/java/jdk1.6.0_27-32/jre/bin/java -enableassertions -Xmx1400m
-Djava.security.egd=file:/dev/./urandom -jar /x1/jenkins/jenkins-slave/workspace/HBase-0.92-security/trunk/target/surefire/surefirebooter3020597931924384634.jar
/x1/jenkins/jenkins-slave/workspace/HBase-0.92-security/trunk/target/surefire/surefire3811356777024028029tmp
/x1/jenkins/jenkins-slave/workspace/HBase-0.92-security/trunk/target/surefire/surefire6263464835994942066tmp
Running org.apache.hadoop.hbase.mapred.TestTableMapReduce
Tests run: 1, Failures: 0, Errors: 0, Skipped: 0, Time elapsed: 68.558 sec
Forking command line: /bin/sh -c cd /x1/jenkins/jenkins-slave/workspace/HBase-0.92-security/trunk
&& /x1/jenkins/tools/java/jdk1.6.0_27-32/jre/bin/java -enableassertions -Xmx1400m
-Djava.security.egd=file:/dev/./urandom -jar /x1/jenkins/jenkins-slave/workspace/HBase-0.92-security/trunk/target/surefire/surefirebooter538025050743138875.jar
/x1/jenkins/jenkins-slave/workspace/HBase-0.92-security/trunk/target/surefire/surefire2604009845204876815tmp
/x1/jenkins/jenkins-slave/workspace/HBase-0.92-security/trunk/target/surefire/surefire1710375113237061967tmp
Running org.apache.hadoop.hbase.replication.regionserver.TestReplicationSink
Tests run: 5, Failures: 0, Errors: 0, Skipped: 0, Time elapsed: 19.812 sec
Forking command line: /bin/sh -c cd /x1/jenkins/jenkins-slave/workspace/HBase-0.92-security/trunk
&& /x1/jenkins/tools/java/jdk1.6.0_27-32/jre/bin/java -enableassertions -Xmx1400m
-Djava.security.egd=file:/dev/./urandom -jar /x1/jenkins/jenkins-slave/workspace/HBase-0.92-security/trunk/target/surefire/surefirebooter5889968890472776861.jar
/x1/jenkins/jenkins-slave/workspace/HBase-0.92-security/trunk/target/surefire/surefire3490474266393235908tmp
/x1/jenkins/jenkins-slave/workspace/HBase-0.92-security/trunk/target/surefire/surefire703343214331893035tmp
Running org.apache.hadoop.hbase.replication.regionserver.TestReplicationSourceManager
Tests run: 1, Failures: 0, Errors: 0, Skipped: 0, Time elapsed: 0.844 sec
Forking command line: /bin/sh -c cd /x1/jenkins/jenkins-slave/workspace/HBase-0.92-security/trunk
&& /x1/jenkins/tools/java/jdk1.6.0_27-32/jre/bin/java -enableassertions -Xmx1400m
-Djava.security.egd=file:/dev/./urandom -jar /x1/jenkins/jenkins-slave/workspace/HBase-0.92-security/trunk/target/surefire/surefirebooter8651752056364736812.jar
/x1/jenkins/jenkins-slave/workspace/HBase-0.92-security/trunk/target/surefire/surefire8006839764665185867tmp
/x1/jenkins/jenkins-slave/workspace/HBase-0.92-security/trunk/target/surefire/surefire531704145686860332tmp
Running org.apache.hadoop.hbase.replication.TestReplicationSource
Tests run: 1, Failures: 0, Errors: 0, Skipped: 0, Time elapsed: 2.201 sec
Forking command line: /bin/sh -c cd /x1/jenkins/jenkins-slave/workspace/HBase-0.92-security/trunk
&& /x1/jenkins/tools/java/jdk1.6.0_27-32/jre/bin/java -enableassertions -Xmx1400m
-Djava.security.egd=file:/dev/./urandom -jar /x1/jenkins/jenkins-slave/workspace/HBase-0.92-security/trunk/target/surefire/surefirebooter3038430537883934967.jar
/x1/jenkins/jenkins-slave/workspace/HBase-0.92-security/trunk/target/surefire/surefire4039327653399992243tmp
/x1/jenkins/jenkins-slave/workspace/HBase-0.92-security/trunk/target/surefire/surefire6398127828182928954tmp
Running org.apache.hadoop.hbase.replication.TestReplication
Tests run: 8, Failures: 1, Errors: 0, Skipped: 0, Time elapsed: 141.481 sec <<< FAILURE!
Forking command line: /bin/sh -c cd /x1/jenkins/jenkins-slave/workspace/HBase-0.92-security/trunk
&& /x1/jenkins/tools/java/jdk1.6.0_27-32/jre/bin/java -enableassertions -Xmx1400m
-Djava.security.egd=file:/dev/./urandom -jar /x1/jenkins/jenkins-slave/workspace/HBase-0.92-security/trunk/target/surefire/surefirebooter6906231897748097399.jar
/x1/jenkins/jenkins-slave/workspace/HBase-0.92-security/trunk/target/surefire/surefire8989333080517871944tmp
/x1/jenkins/jenkins-slave/workspace/HBase-0.92-security/trunk/target/surefire/surefire629229904289856351tmp
Running org.apache.hadoop.hbase.replication.TestReplicationPeer
Tests run: 1, Failures: 0, Errors: 0, Skipped: 0, Time elapsed: 25.516 sec
Forking command line: /bin/sh -c cd /x1/jenkins/jenkins-slave/workspace/HBase-0.92-security/trunk
&& /x1/jenkins/tools/java/jdk1.6.0_27-32/jre/bin/java -enableassertions -Xmx1400m
-Djava.security.egd=file:/dev/./urandom -jar /x1/jenkins/jenkins-slave/workspace/HBase-0.92-security/trunk/target/surefire/surefirebooter1618887573764047429.jar
/x1/jenkins/jenkins-slave/workspace/HBase-0.92-security/trunk/target/surefire/surefire1182315918540865571tmp
/x1/jenkins/jenkins-slave/workspace/HBase-0.92-security/trunk/target/surefire/surefire2608873078461332640tmp
Running org.apache.hadoop.hbase.replication.TestMultiSlaveReplication
Tests run: 1, Failures: 0, Errors: 0, Skipped: 0, Time elapsed: 57.982 sec
Forking command line: /bin/sh -c cd /x1/jenkins/jenkins-slave/workspace/HBase-0.92-security/trunk
&& /x1/jenkins/tools/java/jdk1.6.0_27-32/jre/bin/java -enableassertions -Xmx1400m
-Djava.security.egd=file:/dev/./urandom -jar /x1/jenkins/jenkins-slave/workspace/HBase-0.92-security/trunk/target/surefire/surefirebooter4288939269466639040.jar
/x1/jenkins/jenkins-slave/workspace/HBase-0.92-security/trunk/target/surefire/surefire3891293067147353962tmp
/x1/jenkins/jenkins-slave/workspace/HBase-0.92-security/trunk/target/surefire/surefire5027814529104848619tmp
Running org.apache.hadoop.hbase.replication.TestMasterReplication
Tests run: 2, Failures: 0, Errors: 0, Skipped: 0, Time elapsed: 90.649 sec
Forking command line: /bin/sh -c cd /x1/jenkins/jenkins-slave/workspace/HBase-0.92-security/trunk
&& /x1/jenkins/tools/java/jdk1.6.0_27-32/jre/bin/java -enableassertions -Xmx1400m
-Djava.security.egd=file:/dev/./urandom -jar /x1/jenkins/jenkins-slave/workspace/HBase-0.92-security/trunk/target/surefire/surefirebooter5850750336668487986.jar
/x1/jenkins/jenkins-slave/workspace/HBase-0.92-security/trunk/target/surefire/surefire1638592716314839727tmp
/x1/jenkins/jenkins-slave/workspace/HBase-0.92-security/trunk/target/surefire/surefire5539351890072993882tmp
Running org.apache.hadoop.hbase.util.TestHBaseFsckComparator
Tests run: 7, Failures: 0, Errors: 0, Skipped: 0, Time elapsed: 0.138 sec
Forking command line: /bin/sh -c cd /x1/jenkins/jenkins-slave/workspace/HBase-0.92-security/trunk
&& /x1/jenkins/tools/java/jdk1.6.0_27-32/jre/bin/java -enableassertions -Xmx1400m
-Djava.security.egd=file:/dev/./urandom -jar /x1/jenkins/jenkins-slave/workspace/HBase-0.92-security/trunk/target/surefire/surefirebooter8511513363902319390.jar
/x1/jenkins/jenkins-slave/workspace/HBase-0.92-security/trunk/target/surefire/surefire2414391589633784909tmp
/x1/jenkins/jenkins-slave/workspace/HBase-0.92-security/trunk/target/surefire/surefire529841206780143897tmp
Running org.apache.hadoop.hbase.util.TestMergeTool
Tests run: 1, Failures: 0, Errors: 0, Skipped: 0, Time elapsed: 338.165 sec
Forking command line: /bin/sh -c cd /x1/jenkins/jenkins-slave/workspace/HBase-0.92-security/trunk
&& /x1/jenkins/tools/java/jdk1.6.0_27-32/jre/bin/java -enableassertions -Xmx1400m
-Djava.security.egd=file:/dev/./urandom -jar /x1/jenkins/jenkins-slave/workspace/HBase-0.92-security/trunk/target/surefire/surefirebooter274007441309438449.jar
/x1/jenkins/jenkins-slave/workspace/HBase-0.92-security/trunk/target/surefire/surefire4787583340994944053tmp
/x1/jenkins/jenkins-slave/workspace/HBase-0.92-security/trunk/target/surefire/surefire7177070711925528516tmp
Running org.apache.hadoop.hbase.util.TestFSTableDescriptors
Tests run: 10, Failures: 0, Errors: 0, Skipped: 0, Time elapsed: 0.76 sec
Forking command line: /bin/sh -c cd /x1/jenkins/jenkins-slave/workspace/HBase-0.92-security/trunk
&& /x1/jenkins/tools/java/jdk1.6.0_27-32/jre/bin/java -enableassertions -Xmx1400m
-Djava.security.egd=file:/dev/./urandom -jar /x1/jenkins/jenkins-slave/workspace/HBase-0.92-security/trunk/target/surefire/surefirebooter5917691120504467084.jar
/x1/jenkins/jenkins-slave/workspace/HBase-0.92-security/trunk/target/surefire/surefire1312159333480380834tmp
/x1/jenkins/jenkins-slave/workspace/HBase-0.92-security/trunk/target/surefire/surefire5127792548990839159tmp
Running org.apache.hadoop.hbase.util.TestIdLock
Tests run: 1, Failures: 0, Errors: 0, Skipped: 0, Time elapsed: 15.205 sec
Forking command line: /bin/sh -c cd /x1/jenkins/jenkins-slave/workspace/HBase-0.92-security/trunk
&& /x1/jenkins/tools/java/jdk1.6.0_27-32/jre/bin/java -enableassertions -Xmx1400m
-Djava.security.egd=file:/dev/./urandom -jar /x1/jenkins/jenkins-slave/workspace/HBase-0.92-security/trunk/target/surefire/surefirebooter5500001221948369691.jar
/x1/jenkins/jenkins-slave/workspace/HBase-0.92-security/trunk/target/surefire/surefire7881137282799786698tmp
/x1/jenkins/jenkins-slave/workspace/HBase-0.92-security/trunk/target/surefire/surefire2078010260678023690tmp
Running org.apache.hadoop.hbase.util.TestCompressionTest
Tests run: 1, Failures: 0, Errors: 0, Skipped: 0, Time elapsed: 0.305 sec
Forking command line: /bin/sh -c cd /x1/jenkins/jenkins-slave/workspace/HBase-0.92-security/trunk
&& /x1/jenkins/tools/java/jdk1.6.0_27-32/jre/bin/java -enableassertions -Xmx1400m
-Djava.security.egd=file:/dev/./urandom -jar /x1/jenkins/jenkins-slave/workspace/HBase-0.92-security/trunk/target/surefire/surefirebooter1121956806620291543.jar
/x1/jenkins/jenkins-slave/workspace/HBase-0.92-security/trunk/target/surefire/surefire7552020053714712934tmp
/x1/jenkins/jenkins-slave/workspace/HBase-0.92-security/trunk/target/surefire/surefire4068891363329050553tmp
Running org.apache.hadoop.hbase.util.TestBytes
Tests run: 13, Failures: 0, Errors: 0, Skipped: 0, Time elapsed: 0.115 sec
Forking command line: /bin/sh -c cd /x1/jenkins/jenkins-slave/workspace/HBase-0.92-security/trunk
&& /x1/jenkins/tools/java/jdk1.6.0_27-32/jre/bin/java -enableassertions -Xmx1400m
-Djava.security.egd=file:/dev/./urandom -jar /x1/jenkins/jenkins-slave/workspace/HBase-0.92-security/trunk/target/surefire/surefirebooter2161190927301657422.jar
/x1/jenkins/jenkins-slave/workspace/HBase-0.92-security/trunk/target/surefire/surefire7390637751668904648tmp
/x1/jenkins/jenkins-slave/workspace/HBase-0.92-security/trunk/target/surefire/surefire3796085782910158192tmp
Running org.apache.hadoop.hbase.util.TestSortedCopyOnWriteSet
Tests run: 2, Failures: 0, Errors: 0, Skipped: 0, Time elapsed: 0.056 sec
Forking command line: /bin/sh -c cd /x1/jenkins/jenkins-slave/workspace/HBase-0.92-security/trunk
&& /x1/jenkins/tools/java/jdk1.6.0_27-32/jre/bin/java -enableassertions -Xmx1400m
-Djava.security.egd=file:/dev/./urandom -jar /x1/jenkins/jenkins-slave/workspace/HBase-0.92-security/trunk/target/surefire/surefirebooter4343214408071827006.jar
/x1/jenkins/jenkins-slave/workspace/HBase-0.92-security/trunk/target/surefire/surefire5065392594959412373tmp
/x1/jenkins/jenkins-slave/workspace/HBase-0.92-security/trunk/target/surefire/surefire2985296120649847466tmp
Running org.apache.hadoop.hbase.util.TestEnvironmentEdgeManager
Tests run: 2, Failures: 0, Errors: 0, Skipped: 0, Time elapsed: 0.178 sec
Forking command line: /bin/sh -c cd /x1/jenkins/jenkins-slave/workspace/HBase-0.92-security/trunk
&& /x1/jenkins/tools/java/jdk1.6.0_27-32/jre/bin/java -enableassertions -Xmx1400m
-Djava.security.egd=file:/dev/./urandom -jar /x1/jenkins/jenkins-slave/workspace/HBase-0.92-security/trunk/target/surefire/surefirebooter6507864994878184233.jar
/x1/jenkins/jenkins-slave/workspace/HBase-0.92-security/trunk/target/surefire/surefire3918284943771557036tmp
/x1/jenkins/jenkins-slave/workspace/HBase-0.92-security/trunk/target/surefire/surefire492198117109019024tmp
Running org.apache.hadoop.hbase.util.TestKeying
Tests run: 1, Failures: 0, Errors: 0, Skipped: 0, Time elapsed: 0.021 sec
Forking command line: /bin/sh -c cd /x1/jenkins/jenkins-slave/workspace/HBase-0.92-security/trunk
&& /x1/jenkins/tools/java/jdk1.6.0_27-32/jre/bin/java -enableassertions -Xmx1400m
-Djava.security.egd=file:/dev/./urandom -jar /x1/jenkins/jenkins-slave/workspace/HBase-0.92-security/trunk/target/surefire/surefirebooter2100975054021594178.jar
/x1/jenkins/jenkins-slave/workspace/HBase-0.92-security/trunk/target/surefire/surefire7427751404966697262tmp
/x1/jenkins/jenkins-slave/workspace/HBase-0.92-security/trunk/target/surefire/surefire2230579625560193327tmp
Running org.apache.hadoop.hbase.util.TestByteBloomFilter
Tests run: 5, Failures: 0, Errors: 0, Skipped: 0, Time elapsed: 0.855 sec
Forking command line: /bin/sh -c cd /x1/jenkins/jenkins-slave/workspace/HBase-0.92-security/trunk
&& /x1/jenkins/tools/java/jdk1.6.0_27-32/jre/bin/java -enableassertions -Xmx1400m
-Djava.security.egd=file:/dev/./urandom -jar /x1/jenkins/jenkins-slave/workspace/HBase-0.92-security/trunk/target/surefire/surefirebooter5539118132210795669.jar
/x1/jenkins/jenkins-slave/workspace/HBase-0.92-security/trunk/target/surefire/surefire8553062781713279tmp
/x1/jenkins/jenkins-slave/workspace/HBase-0.92-security/trunk/target/surefire/surefire666845268389678737tmp
Running org.apache.hadoop.hbase.util.TestRootPath
Tests run: 1, Failures: 0, Errors: 0, Skipped: 0, Time elapsed: 0.087 sec
Forking command line: /bin/sh -c cd /x1/jenkins/jenkins-slave/workspace/HBase-0.92-security/trunk
&& /x1/jenkins/tools/java/jdk1.6.0_27-32/jre/bin/java -enableassertions -Xmx1400m
-Djava.security.egd=file:/dev/./urandom -jar /x1/jenkins/jenkins-slave/workspace/HBase-0.92-security/trunk/target/surefire/surefirebooter8076518810658683564.jar
/x1/jenkins/jenkins-slave/workspace/HBase-0.92-security/trunk/target/surefire/surefire2920833541618861146tmp
/x1/jenkins/jenkins-slave/workspace/HBase-0.92-security/trunk/target/surefire/surefire5146256918432680615tmp
Running org.apache.hadoop.hbase.util.TestMergeTable
Tests run: 1, Failures: 0, Errors: 0, Skipped: 0, Time elapsed: 30.869 sec
Forking command line: /bin/sh -c cd /x1/jenkins/jenkins-slave/workspace/HBase-0.92-security/trunk
&& /x1/jenkins/tools/java/jdk1.6.0_27-32/jre/bin/java -enableassertions -Xmx1400m
-Djava.security.egd=file:/dev/./urandom -jar /x1/jenkins/jenkins-slave/workspace/HBase-0.92-security/trunk/target/surefire/surefirebooter7184281215668254555.jar
/x1/jenkins/jenkins-slave/workspace/HBase-0.92-security/trunk/target/surefire/surefire3036015663894679621tmp
/x1/jenkins/jenkins-slave/workspace/HBase-0.92-security/trunk/target/surefire/surefire6110103657264768540tmp
Running org.apache.hadoop.hbase.util.TestHBaseFsck
Tests run: 6, Failures: 0, Errors: 0, Skipped: 0, Time elapsed: 41.737 sec
Forking command line: /bin/sh -c cd /x1/jenkins/jenkins-slave/workspace/HBase-0.92-security/trunk
&& /x1/jenkins/tools/java/jdk1.6.0_27-32/jre/bin/java -enableassertions -Xmx1400m
-Djava.security.egd=file:/dev/./urandom -jar /x1/jenkins/jenkins-slave/workspace/HBase-0.92-security/trunk/target/surefire/surefirebooter7732915677834437686.jar
/x1/jenkins/jenkins-slave/workspace/HBase-0.92-security/trunk/target/surefire/surefire738658791507709935tmp
/x1/jenkins/jenkins-slave/workspace/HBase-0.92-security/trunk/target/surefire/surefire3046032546772705071tmp
Running org.apache.hadoop.hbase.util.TestFSUtils
Tests run: 2, Failures: 0, Errors: 0, Skipped: 0, Time elapsed: 19.584 sec
Forking command line: /bin/sh -c cd /x1/jenkins/jenkins-slave/workspace/HBase-0.92-security/trunk
&& /x1/jenkins/tools/java/jdk1.6.0_27-32/jre/bin/java -enableassertions -Xmx1400m
-Djava.security.egd=file:/dev/./urandom -jar /x1/jenkins/jenkins-slave/workspace/HBase-0.92-security/trunk/target/surefire/surefirebooter6469973066581107056.jar
/x1/jenkins/jenkins-slave/workspace/HBase-0.92-security/trunk/target/surefire/surefire1386862703373950140tmp
/x1/jenkins/jenkins-slave/workspace/HBase-0.92-security/trunk/target/surefire/surefire1826598984025178401tmp
Running org.apache.hadoop.hbase.util.TestPoolMap
Tests run: 9, Failures: 0, Errors: 0, Skipped: 0, Time elapsed: 0.035 sec
Forking command line: /bin/sh -c cd /x1/jenkins/jenkins-slave/workspace/HBase-0.92-security/trunk
&& /x1/jenkins/tools/java/jdk1.6.0_27-32/jre/bin/java -enableassertions -Xmx1400m
-Djava.security.egd=file:/dev/./urandom -jar /x1/jenkins/jenkins-slave/workspace/HBase-0.92-security/trunk/target/surefire/surefirebooter3226054435819826840.jar
/x1/jenkins/jenkins-slave/workspace/HBase-0.92-security/trunk/target/surefire/surefire6877069393622160109tmp
/x1/jenkins/jenkins-slave/workspace/HBase-0.92-security/trunk/target/surefire/surefire8907237595747133322tmp
Running org.apache.hadoop.hbase.util.TestBase64
Tests run: 1, Failures: 0, Errors: 0, Skipped: 0, Time elapsed: 0.083 sec
Forking command line: /bin/sh -c cd /x1/jenkins/jenkins-slave/workspace/HBase-0.92-security/trunk
&& /x1/jenkins/tools/java/jdk1.6.0_27-32/jre/bin/java -enableassertions -Xmx1400m
-Djava.security.egd=file:/dev/./urandom -jar /x1/jenkins/jenkins-slave/workspace/HBase-0.92-security/trunk/target/surefire/surefirebooter43886232961983894.jar
/x1/jenkins/jenkins-slave/workspace/HBase-0.92-security/trunk/target/surefire/surefire4363169219629115094tmp
/x1/jenkins/jenkins-slave/workspace/HBase-0.92-security/trunk/target/surefire/surefire8493969146398829415tmp
Running org.apache.hadoop.hbase.util.hbck.TestOfflineMetaRebuildBase
Tests run: 1, Failures: 0, Errors: 0, Skipped: 0, Time elapsed: 31.009 sec
Forking command line: /bin/sh -c cd /x1/jenkins/jenkins-slave/workspace/HBase-0.92-security/trunk
&& /x1/jenkins/tools/java/jdk1.6.0_27-32/jre/bin/java -enableassertions -Xmx1400m
-Djava.security.egd=file:/dev/./urandom -jar /x1/jenkins/jenkins-slave/workspace/HBase-0.92-security/trunk/target/surefire/surefirebooter3096485902382274823.jar
/x1/jenkins/jenkins-slave/workspace/HBase-0.92-security/trunk/target/surefire/surefire6036054935622387681tmp
/x1/jenkins/jenkins-slave/workspace/HBase-0.92-security/trunk/target/surefire/surefire8619525381158965131tmp
Running org.apache.hadoop.hbase.util.hbck.TestOfflineMetaRebuildOverlap
Tests run: 1, Failures: 0, Errors: 0, Skipped: 0, Time elapsed: 32.612 sec
Forking command line: /bin/sh -c cd /x1/jenkins/jenkins-slave/workspace/HBase-0.92-security/trunk
&& /x1/jenkins/tools/java/jdk1.6.0_27-32/jre/bin/java -enableassertions -Xmx1400m
-Djava.security.egd=file:/dev/./urandom -jar /x1/jenkins/jenkins-slave/workspace/HBase-0.92-security/trunk/target/surefire/surefirebooter3196092462037866818.jar
/x1/jenkins/jenkins-slave/workspace/HBase-0.92-security/trunk/target/surefire/surefire2596360966373653599tmp
/x1/jenkins/jenkins-slave/workspace/HBase-0.92-security/trunk/target/surefire/surefire1441755565430497548tmp
Running org.apache.hadoop.hbase.util.hbck.TestOfflineMetaRebuildHole
Tests run: 1, Failures: 0, Errors: 0, Skipped: 0, Time elapsed: 30.757 sec
Forking command line: /bin/sh -c cd /x1/jenkins/jenkins-slave/workspace/HBase-0.92-security/trunk
&& /x1/jenkins/tools/java/jdk1.6.0_27-32/jre/bin/java -enableassertions -Xmx1400m
-Djava.security.egd=file:/dev/./urandom -jar /x1/jenkins/jenkins-slave/workspace/HBase-0.92-security/trunk/target/surefire/surefirebooter7057778136730789975.jar
/x1/jenkins/jenkins-slave/workspace/HBase-0.92-security/trunk/target/surefire/surefire2038767148046564078tmp
/x1/jenkins/jenkins-slave/workspace/HBase-0.92-security/trunk/target/surefire/surefire5052912577973820546tmp
Running org.apache.hadoop.hbase.util.TestDefaultEnvironmentEdge
Tests run: 1, Failures: 0, Errors: 0, Skipped: 0, Time elapsed: 0.044 sec
Forking command line: /bin/sh -c cd /x1/jenkins/jenkins-slave/workspace/HBase-0.92-security/trunk
&& /x1/jenkins/tools/java/jdk1.6.0_27-32/jre/bin/java -enableassertions -Xmx1400m
-Djava.security.egd=file:/dev/./urandom -jar /x1/jenkins/jenkins-slave/workspace/HBase-0.92-security/trunk/target/surefire/surefirebooter1537274383313072225.jar
/x1/jenkins/jenkins-slave/workspace/HBase-0.92-security/trunk/target/surefire/surefire580054989721192659tmp
/x1/jenkins/jenkins-slave/workspace/HBase-0.92-security/trunk/target/surefire/surefire9026675624093840708tmp
Running org.apache.hadoop.hbase.util.TestIncrementingEnvironmentEdge
Tests run: 1, Failures: 0, Errors: 0, Skipped: 0, Time elapsed: 0.043 sec
Forking command line: /bin/sh -c cd /x1/jenkins/jenkins-slave/workspace/HBase-0.92-security/trunk
&& /x1/jenkins/tools/java/jdk1.6.0_27-32/jre/bin/java -enableassertions -Xmx1400m
-Djava.security.egd=file:/dev/./urandom -jar /x1/jenkins/jenkins-slave/workspace/HBase-0.92-security/trunk/target/surefire/surefirebooter7816539186433498405.jar
/x1/jenkins/jenkins-slave/workspace/HBase-0.92-security/trunk/target/surefire/surefire740823245293002208tmp
/x1/jenkins/jenkins-slave/workspace/HBase-0.92-security/trunk/target/surefire/surefire3913448479818160018tmp
Running org.apache.hadoop.hbase.util.TestRegionSplitCalculator
Tests run: 14, Failures: 0, Errors: 0, Skipped: 0, Time elapsed: 0.142 sec
Forking command line: /bin/sh -c cd /x1/jenkins/jenkins-slave/workspace/HBase-0.92-security/trunk
&& /x1/jenkins/tools/java/jdk1.6.0_27-32/jre/bin/java -enableassertions -Xmx1400m
-Djava.security.egd=file:/dev/./urandom -jar /x1/jenkins/jenkins-slave/workspace/HBase-0.92-security/trunk/target/surefire/surefirebooter2715237504241493914.jar
/x1/jenkins/jenkins-slave/workspace/HBase-0.92-security/trunk/target/surefire/surefire8204329790534002520tmp
/x1/jenkins/jenkins-slave/workspace/HBase-0.92-security/trunk/target/surefire/surefire1190849710947278141tmp
Running org.apache.hadoop.hbase.TestHRegionLocation
Tests run: 3, Failures: 0, Errors: 0, Skipped: 0, Time elapsed: 0.109 sec
Forking command line: /bin/sh -c cd /x1/jenkins/jenkins-slave/workspace/HBase-0.92-security/trunk
&& /x1/jenkins/tools/java/jdk1.6.0_27-32/jre/bin/java -enableassertions -Xmx1400m
-Djava.security.egd=file:/dev/./urandom -jar /x1/jenkins/jenkins-slave/workspace/HBase-0.92-security/trunk/target/surefire/surefirebooter8255369726491443342.jar
/x1/jenkins/jenkins-slave/workspace/HBase-0.92-security/trunk/target/surefire/surefire2458310066490824166tmp
/x1/jenkins/jenkins-slave/workspace/HBase-0.92-security/trunk/target/surefire/surefire5344727588816821873tmp
Running org.apache.hadoop.hbase.migration.TestMigrationFrom090To092
Tests run: 1, Failures: 0, Errors: 0, Skipped: 0, Time elapsed: 0.214 sec
Forking command line: /bin/sh -c cd /x1/jenkins/jenkins-slave/workspace/HBase-0.92-security/trunk
&& /x1/jenkins/tools/java/jdk1.6.0_27-32/jre/bin/java -enableassertions -Xmx1400m
-Djava.security.egd=file:/dev/./urandom -jar /x1/jenkins/jenkins-slave/workspace/HBase-0.92-security/trunk/target/surefire/surefirebooter174054970693202644.jar
/x1/jenkins/jenkins-slave/workspace/HBase-0.92-security/trunk/target/surefire/surefire1944153435550925887tmp
/x1/jenkins/jenkins-slave/workspace/HBase-0.92-security/trunk/target/surefire/surefire5958219585428768001tmp
Running org.apache.hadoop.hbase.TestCompare
Tests run: 1, Failures: 0, Errors: 0, Skipped: 0, Time elapsed: 0.177 sec
Forking command line: /bin/sh -c cd /x1/jenkins/jenkins-slave/workspace/HBase-0.92-security/trunk
&& /x1/jenkins/tools/java/jdk1.6.0_27-32/jre/bin/java -enableassertions -Xmx1400m
-Djava.security.egd=file:/dev/./urandom -jar /x1/jenkins/jenkins-slave/workspace/HBase-0.92-security/trunk/target/surefire/surefirebooter4267321018204820958.jar
/x1/jenkins/jenkins-slave/workspace/HBase-0.92-security/trunk/target/surefire/surefire5737029877647558300tmp
/x1/jenkins/jenkins-slave/workspace/HBase-0.92-security/trunk/target/surefire/surefire3554691305462324551tmp
Running org.apache.hadoop.hbase.TestInfoServers
Tests run: 2, Failures: 0, Errors: 0, Skipped: 0, Time elapsed: 16.231 sec
Forking command line: /bin/sh -c cd /x1/jenkins/jenkins-slave/workspace/HBase-0.92-security/trunk
&& /x1/jenkins/tools/java/jdk1.6.0_27-32/jre/bin/java -enableassertions -Xmx1400m
-Djava.security.egd=file:/dev/./urandom -jar /x1/jenkins/jenkins-slave/workspace/HBase-0.92-security/trunk/target/surefire/surefirebooter7550773027046405726.jar
/x1/jenkins/jenkins-slave/workspace/HBase-0.92-security/trunk/target/surefire/surefire7631911816657128006tmp
/x1/jenkins/jenkins-slave/workspace/HBase-0.92-security/trunk/target/surefire/surefire38426586678052000tmp
Running org.apache.hadoop.hbase.TestHServerAddress
Tests run: 6, Failures: 0, Errors: 0, Skipped: 0, Time elapsed: 0.052 sec
Forking command line: /bin/sh -c cd /x1/jenkins/jenkins-slave/workspace/HBase-0.92-security/trunk
&& /x1/jenkins/tools/java/jdk1.6.0_27-32/jre/bin/java -enableassertions -Xmx1400m
-Djava.security.egd=file:/dev/./urandom -jar /x1/jenkins/jenkins-slave/workspace/HBase-0.92-security/trunk/target/surefire/surefirebooter241829197307291300.jar
/x1/jenkins/jenkins-slave/workspace/HBase-0.92-security/trunk/target/surefire/surefire6553518760502005895tmp
/x1/jenkins/jenkins-slave/workspace/HBase-0.92-security/trunk/target/surefire/surefire7375105121430063304tmp
Running org.apache.hadoop.hbase.TestServerName
Tests run: 4, Failures: 0, Errors: 0, Skipped: 0, Time elapsed: 0.105 sec

Results :

Failed tests:   queueFailover(org.apache.hadoop.hbase.replication.TestReplication): Waited
too much time for queueFailover replication

Tests in error: 
  testCheckHBaseAvailableClosesConnection(org.apache.hadoop.hbase.client.TestAdmin): An error
is preventing HBase from connecting to ZooKeeper

Tests run: 1110, Failures: 1, Errors: 1, Skipped: 8

[INFO] ------------------------------------------------------------------------
[INFO] BUILD FAILURE
[INFO] ------------------------------------------------------------------------
[INFO] Total time: 1:53:17.391s
[INFO] Finished at: Wed Feb 22 06:22:40 UTC 2012
[INFO] Final Memory: 44M/776M
[INFO] ------------------------------------------------------------------------
[ERROR] Failed to execute goal org.apache.maven.plugins:maven-surefire-plugin:2.10:test (default-test)
on project hbase: There are test failures.
[ERROR] 
[ERROR] Please refer to /x1/jenkins/jenkins-slave/workspace/HBase-0.92-security/trunk/target/surefire-reports
for the individual test results.
[ERROR] -> [Help 1]
org.apache.maven.lifecycle.LifecycleExecutionException: Failed to execute goal org.apache.maven.plugins:maven-surefire-plugin:2.10:test
(default-test) on project hbase: There are test failures.

Please refer to /x1/jenkins/jenkins-slave/workspace/HBase-0.92-security/trunk/target/surefire-reports
for the individual test results.
	at org.apache.maven.lifecycle.internal.MojoExecutor.execute(MojoExecutor.java:213)
	at org.apache.maven.lifecycle.internal.MojoExecutor.execute(MojoExecutor.java:153)
	at org.apache.maven.lifecycle.internal.MojoExecutor.execute(MojoExecutor.java:145)
	at org.apache.maven.lifecycle.internal.MojoExecutor.executeForkedExecutions(MojoExecutor.java:365)
	at org.apache.maven.lifecycle.internal.MojoExecutor.execute(MojoExecutor.java:199)
	at org.apache.maven.lifecycle.internal.MojoExecutor.execute(MojoExecutor.java:153)
	at org.apache.maven.lifecycle.internal.MojoExecutor.execute(MojoExecutor.java:145)
	at org.apache.maven.lifecycle.internal.LifecycleModuleBuilder.buildProject(LifecycleModuleBuilder.java:84)
	at org.apache.maven.lifecycle.internal.LifecycleModuleBuilder.buildProject(LifecycleModuleBuilder.java:59)
	at org.apache.maven.lifecycle.internal.LifecycleStarter.singleThreadedBuild(LifecycleStarter.java:183)
	at org.apache.maven.lifecycle.internal.LifecycleStarter.execute(LifecycleStarter.java:161)
	at org.apache.maven.DefaultMaven.doExecute(DefaultMaven.java:319)
	at org.apache.maven.DefaultMaven.execute(DefaultMaven.java:156)
	at org.apache.maven.cli.MavenCli.execute(MavenCli.java:537)
	at org.apache.maven.cli.MavenCli.doMain(MavenCli.java:196)
	at org.apache.maven.cli.MavenCli.main(MavenCli.java:141)
	at sun.reflect.NativeMethodAccessorImpl.invoke0(Native Method)
	at sun.reflect.NativeMethodAccessorImpl.invoke(NativeMethodAccessorImpl.java:39)
	at sun.reflect.DelegatingMethodAccessorImpl.invoke(DelegatingMethodAccessorImpl.java:25)
	at java.lang.reflect.Method.invoke(Method.java:597)
	at org.codehaus.plexus.classworlds.launcher.Launcher.launchEnhanced(Launcher.java:290)
	at org.codehaus.plexus.classworlds.launcher.Launcher.launch(Launcher.java:230)
	at org.codehaus.plexus.classworlds.launcher.Launcher.mainWithExitCode(Launcher.java:409)
	at org.codehaus.plexus.classworlds.launcher.Launcher.main(Launcher.java:352)
Caused by: org.apache.maven.plugin.MojoFailureException: There are test failures.

Please refer to /x1/jenkins/jenkins-slave/workspace/HBase-0.92-security/trunk/target/surefire-reports
for the individual test results.
	at org.apache.maven.plugin.surefire.SurefireHelper.reportExecution(SurefireHelper.java:87)
	at org.apache.maven.plugin.surefire.SurefirePlugin.writeSummary(SurefirePlugin.java:641)
	at org.apache.maven.plugin.surefire.SurefirePlugin.handleSummary(SurefirePlugin.java:615)
	at org.apache.maven.plugin.surefire.AbstractSurefireMojo.executeAfterPreconditionsChecked(AbstractSurefireMojo.java:137)
	at org.apache.maven.plugin.surefire.AbstractSurefireMojo.execute(AbstractSurefireMojo.java:98)
	at org.apache.maven.plugin.DefaultBuildPluginManager.executeMojo(DefaultBuildPluginManager.java:101)
	at org.apache.maven.lifecycle.internal.MojoExecutor.execute(MojoExecutor.java:209)
	... 23 more
[ERROR] 
[ERROR] 
[ERROR] For more information about the errors and possible solutions, please read the following
articles:
[ERROR] [Help 1] http://cwiki.apache.org/confluence/display/MAVEN/MojoFailureException
Build step 'Invoke top-level Maven targets' marked build as failure
Archiving artifacts
Updating HBASE-5209
Recording test results


Mime
View raw message