hbase-dev mailing list archives

Site index · List index
Message view « Date » · « Thread »
Top « Date » · « Thread »
From Apache Jenkins Server <jenk...@builds.apache.org>
Subject Build failed in Jenkins: HBase-0.92 #294
Date Tue, 21 Feb 2012 08:41:06 GMT
See <https://builds.apache.org/job/HBase-0.92/294/changes>

Changes:

[stack] HBASE-5209 HConnection/HMasterInterface should allow for way to get hostname of currently active master in multi-master HBase setup -- FIX BUILD ON 0.92; ADDENDUM

------------------------------------------
[...truncated 6158 lines...]
[DEBUG]   /home/jenkins/.m2/repository/org/codehaus/jettison/jettison/1.1/jettison-1.1.jar
[DEBUG]   /home/jenkins/.m2/repository/com/sun/xml/bind/jaxb-impl/2.1.12/jaxb-impl-2.1.12.jar
[DEBUG]   /home/jenkins/.m2/repository/com/sun/jersey/jersey-server/1.4/jersey-server-1.4.jar
[DEBUG]   /home/jenkins/.m2/repository/asm/asm/3.1/asm-3.1.jar
[DEBUG]   /home/jenkins/.m2/repository/javax/xml/bind/jaxb-api/2.1/jaxb-api-2.1.jar
[DEBUG]   /home/jenkins/.m2/repository/javax/activation/activation/1.1/activation-1.1.jar
[DEBUG]   /home/jenkins/.m2/repository/stax/stax-api/1.0.1/stax-api-1.0.1.jar
[DEBUG]   /home/jenkins/.m2/repository/junit/junit/4.10/junit-4.10.jar
[DEBUG]   /home/jenkins/.m2/repository/org/hamcrest/hamcrest-core/1.1/hamcrest-core-1.1.jar
[DEBUG]   /home/jenkins/.m2/repository/org/mockito/mockito-all/1.8.5/mockito-all-1.8.5.jar
[DEBUG]   /home/jenkins/.m2/repository/org/apache/commons/commons-math/2.1/commons-math-2.1.jar
[DEBUG]   /home/jenkins/.m2/repository/org/apache/hadoop/hadoop-core/1.0.0/hadoop-core-1.0.0.jar
[DEBUG]   /home/jenkins/.m2/repository/xmlenc/xmlenc/0.52/xmlenc-0.52.jar
[DEBUG]   /home/jenkins/.m2/repository/commons-net/commons-net/1.4.1/commons-net-1.4.1.jar
[DEBUG]   /home/jenkins/.m2/repository/org/apache/hadoop/hadoop-test/1.0.0/hadoop-test-1.0.0.jar
[DEBUG]   /home/jenkins/.m2/repository/org/apache/ftpserver/ftplet-api/1.0.0/ftplet-api-1.0.0.jar
[DEBUG]   /home/jenkins/.m2/repository/org/apache/mina/mina-core/2.0.0-M5/mina-core-2.0.0-M5.jar
[DEBUG]   /home/jenkins/.m2/repository/org/apache/ftpserver/ftpserver-core/1.0.0/ftpserver-core-1.0.0.jar
[DEBUG]   /home/jenkins/.m2/repository/org/apache/ftpserver/ftpserver-deprecated/1.0.0-M2/ftpserver-deprecated-1.0.0-M2.jar
[DEBUG] provider classpath classpath:
[DEBUG]   /home/jenkins/.m2/repository/org/apache/maven/surefire/surefire-junit4/2.10/surefire-junit4-2.10.jar
[DEBUG]   /home/jenkins/.m2/repository/org/apache/maven/surefire/surefire-api/2.10/surefire-api-2.10.jar

-------------------------------------------------------
 T E S T S
-------------------------------------------------------

-------------------------------------------------------
 T E S T S
-------------------------------------------------------
Forking command line: /bin/sh -c cd <https://builds.apache.org/job/HBase-0.92/ws/trunk> && /home/jenkins/tools/java/jdk1.6.0_27-32/jre/bin/java -enableassertions -Xmx1400m -Djava.security.egd=file:/dev/./urandom -jar <https://builds.apache.org/job/HBase-0.92/ws/trunk/target/surefire/surefirebooter215281045116264507.jar> <https://builds.apache.org/job/HBase-0.92/ws/trunk/target/surefire/surefire2755771734581042756tmp> <https://builds.apache.org/job/HBase-0.92/ws/trunk/target/surefire/surefire2636559604604606298tmp>
Running org.apache.hadoop.hbase.master.TestMaster
Tests run: 1, Failures: 0, Errors: 1, Skipped: 0, Time elapsed: 478.476 sec <<< FAILURE!
Forking command line: /bin/sh -c cd <https://builds.apache.org/job/HBase-0.92/ws/trunk> && /home/jenkins/tools/java/jdk1.6.0_27-32/jre/bin/java -enableassertions -Xmx1400m -Djava.security.egd=file:/dev/./urandom -jar <https://builds.apache.org/job/HBase-0.92/ws/trunk/target/surefire/surefirebooter7192690628074657469.jar> <https://builds.apache.org/job/HBase-0.92/ws/trunk/target/surefire/surefire5135628319518427466tmp> <https://builds.apache.org/job/HBase-0.92/ws/trunk/target/surefire/surefire6685042601637129331tmp>
Running org.apache.hadoop.hbase.master.TestMasterStatusServlet
Tests run: 5, Failures: 0, Errors: 0, Skipped: 0, Time elapsed: 1.002 sec
Forking command line: /bin/sh -c cd <https://builds.apache.org/job/HBase-0.92/ws/trunk> && /home/jenkins/tools/java/jdk1.6.0_27-32/jre/bin/java -enableassertions -Xmx1400m -Djava.security.egd=file:/dev/./urandom -jar <https://builds.apache.org/job/HBase-0.92/ws/trunk/target/surefire/surefirebooter2635015344346147654.jar> <https://builds.apache.org/job/HBase-0.92/ws/trunk/target/surefire/surefire3543327446323666900tmp> <https://builds.apache.org/job/HBase-0.92/ws/trunk/target/surefire/surefire3454519330876936309tmp>
Running org.apache.hadoop.hbase.master.TestDeadServer
Tests run: 1, Failures: 0, Errors: 0, Skipped: 0, Time elapsed: 0.135 sec
Forking command line: /bin/sh -c cd <https://builds.apache.org/job/HBase-0.92/ws/trunk> && /home/jenkins/tools/java/jdk1.6.0_27-32/jre/bin/java -enableassertions -Xmx1400m -Djava.security.egd=file:/dev/./urandom -jar <https://builds.apache.org/job/HBase-0.92/ws/trunk/target/surefire/surefirebooter5839255261919327563.jar> <https://builds.apache.org/job/HBase-0.92/ws/trunk/target/surefire/surefire8568863504315224499tmp> <https://builds.apache.org/job/HBase-0.92/ws/trunk/target/surefire/surefire7001249522943264703tmp>
Running org.apache.hadoop.hbase.master.TestMasterFailover
Tests run: 4, Failures: 2, Errors: 2, Skipped: 0, Time elapsed: 378.129 sec <<< FAILURE!
Forking command line: /bin/sh -c cd <https://builds.apache.org/job/HBase-0.92/ws/trunk> && /home/jenkins/tools/java/jdk1.6.0_27-32/jre/bin/java -enableassertions -Xmx1400m -Djava.security.egd=file:/dev/./urandom -jar <https://builds.apache.org/job/HBase-0.92/ws/trunk/target/surefire/surefirebooter1285475463393015946.jar> <https://builds.apache.org/job/HBase-0.92/ws/trunk/target/surefire/surefire2384190396496860200tmp> <https://builds.apache.org/job/HBase-0.92/ws/trunk/target/surefire/surefire1597273308024909899tmp>
Running org.apache.hadoop.hbase.master.TestCatalogJanitor
Tests run: 4, Failures: 0, Errors: 0, Skipped: 0, Time elapsed: 7.381 sec
Forking command line: /bin/sh -c cd <https://builds.apache.org/job/HBase-0.92/ws/trunk> && /home/jenkins/tools/java/jdk1.6.0_27-32/jre/bin/java -enableassertions -Xmx1400m -Djava.security.egd=file:/dev/./urandom -jar <https://builds.apache.org/job/HBase-0.92/ws/trunk/target/surefire/surefirebooter4954476074344882382.jar> <https://builds.apache.org/job/HBase-0.92/ws/trunk/target/surefire/surefire8950514397352852171tmp> <https://builds.apache.org/job/HBase-0.92/ws/trunk/target/surefire/surefire7611322914758738044tmp>
Running org.apache.hadoop.hbase.master.TestLogsCleaner
Tests run: 1, Failures: 0, Errors: 0, Skipped: 0, Time elapsed: 3.135 sec
Forking command line: /bin/sh -c cd <https://builds.apache.org/job/HBase-0.92/ws/trunk> && /home/jenkins/tools/java/jdk1.6.0_27-32/jre/bin/java -enableassertions -Xmx1400m -Djava.security.egd=file:/dev/./urandom -jar <https://builds.apache.org/job/HBase-0.92/ws/trunk/target/surefire/surefirebooter1283057970235845507.jar> <https://builds.apache.org/job/HBase-0.92/ws/trunk/target/surefire/surefire7609740043001268190tmp> <https://builds.apache.org/job/HBase-0.92/ws/trunk/target/surefire/surefire6262707510785812461tmp>
Running org.apache.hadoop.hbase.master.TestOpenedRegionHandler
Forking command line: /bin/sh -c cd <https://builds.apache.org/job/HBase-0.92/ws/trunk> && /home/jenkins/tools/java/jdk1.6.0_27-32/jre/bin/java -enableassertions -Xmx1400m -Djava.security.egd=file:/dev/./urandom -jar <https://builds.apache.org/job/HBase-0.92/ws/trunk/target/surefire/surefirebooter4043693470584944356.jar> <https://builds.apache.org/job/HBase-0.92/ws/trunk/target/surefire/surefire9188544581957544761tmp> <https://builds.apache.org/job/HBase-0.92/ws/trunk/target/surefire/surefire4114663747981825441tmp>
Running org.apache.hadoop.hbase.master.TestDistributedLogSplitting
Forking command line: /bin/sh -c cd <https://builds.apache.org/job/HBase-0.92/ws/trunk> && /home/jenkins/tools/java/jdk1.6.0_27-32/jre/bin/java -enableassertions -Xmx1400m -Djava.security.egd=file:/dev/./urandom -jar <https://builds.apache.org/job/HBase-0.92/ws/trunk/target/surefire/surefirebooter2803197496040999564.jar> <https://builds.apache.org/job/HBase-0.92/ws/trunk/target/surefire/surefire3354659804043515575tmp> <https://builds.apache.org/job/HBase-0.92/ws/trunk/target/surefire/surefire1867813677047078266tmp>
Running org.apache.hadoop.hbase.master.TestRestartCluster
Tests run: 2, Failures: 0, Errors: 2, Skipped: 0, Time elapsed: 612.147 sec <<< FAILURE!
Forking command line: /bin/sh -c cd <https://builds.apache.org/job/HBase-0.92/ws/trunk> && /home/jenkins/tools/java/jdk1.6.0_27-32/jre/bin/java -enableassertions -Xmx1400m -Djava.security.egd=file:/dev/./urandom -jar <https://builds.apache.org/job/HBase-0.92/ws/trunk/target/surefire/surefirebooter8232701096549650550.jar> <https://builds.apache.org/job/HBase-0.92/ws/trunk/target/surefire/surefire595984002743049669tmp> <https://builds.apache.org/job/HBase-0.92/ws/trunk/target/surefire/surefire648410283529097000tmp>
Running org.apache.hadoop.hbase.master.TestMasterTransitions
Tests run: 1, Failures: 0, Errors: 1, Skipped: 0, Time elapsed: 478.228 sec <<< FAILURE!
Forking command line: /bin/sh -c cd <https://builds.apache.org/job/HBase-0.92/ws/trunk> && /home/jenkins/tools/java/jdk1.6.0_27-32/jre/bin/java -enableassertions -Xmx1400m -Djava.security.egd=file:/dev/./urandom -jar <https://builds.apache.org/job/HBase-0.92/ws/trunk/target/surefire/surefirebooter1043687073712298360.jar> <https://builds.apache.org/job/HBase-0.92/ws/trunk/target/surefire/surefire1743730033164319784tmp> <https://builds.apache.org/job/HBase-0.92/ws/trunk/target/surefire/surefire1213622481653300488tmp>
Running org.apache.hadoop.hbase.master.TestActiveMasterManager
Tests run: 2, Failures: 1, Errors: 0, Skipped: 0, Time elapsed: 0.878 sec <<< FAILURE!
Forking command line: /bin/sh -c cd <https://builds.apache.org/job/HBase-0.92/ws/trunk> && /home/jenkins/tools/java/jdk1.6.0_27-32/jre/bin/java -enableassertions -Xmx1400m -Djava.security.egd=file:/dev/./urandom -jar <https://builds.apache.org/job/HBase-0.92/ws/trunk/target/surefire/surefirebooter7721649285154623277.jar> <https://builds.apache.org/job/HBase-0.92/ws/trunk/target/surefire/surefire3009237869160501986tmp> <https://builds.apache.org/job/HBase-0.92/ws/trunk/target/surefire/surefire5384721476515758483tmp>
Running org.apache.hadoop.hbase.master.TestMasterZKSessionRecovery
Tests run: 2, Failures: 1, Errors: 0, Skipped: 0, Time elapsed: 30.504 sec <<< FAILURE!
Forking command line: /bin/sh -c cd <https://builds.apache.org/job/HBase-0.92/ws/trunk> && /home/jenkins/tools/java/jdk1.6.0_27-32/jre/bin/java -enableassertions -Xmx1400m -Djava.security.egd=file:/dev/./urandom -jar <https://builds.apache.org/job/HBase-0.92/ws/trunk/target/surefire/surefirebooter5793430548164311921.jar> <https://builds.apache.org/job/HBase-0.92/ws/trunk/target/surefire/surefire5683437582505073631tmp> <https://builds.apache.org/job/HBase-0.92/ws/trunk/target/surefire/surefire6745166216895293847tmp>
Running org.apache.hadoop.hbase.master.TestMasterRestartAfterDisablingTable
Forking command line: /bin/sh -c cd <https://builds.apache.org/job/HBase-0.92/ws/trunk> && /home/jenkins/tools/java/jdk1.6.0_27-32/jre/bin/java -enableassertions -Xmx1400m -Djava.security.egd=file:/dev/./urandom -jar <https://builds.apache.org/job/HBase-0.92/ws/trunk/target/surefire/surefirebooter802619903817953879.jar> <https://builds.apache.org/job/HBase-0.92/ws/trunk/target/surefire/surefire6646553845769701808tmp> <https://builds.apache.org/job/HBase-0.92/ws/trunk/target/surefire/surefire7175524973982953431tmp>
Running org.apache.hadoop.hbase.master.TestClockSkewDetection
Tests run: 1, Failures: 0, Errors: 0, Skipped: 0, Time elapsed: 0.242 sec
Forking command line: /bin/sh -c cd <https://builds.apache.org/job/HBase-0.92/ws/trunk> && /home/jenkins/tools/java/jdk1.6.0_27-32/jre/bin/java -enableassertions -Xmx1400m -Djava.security.egd=file:/dev/./urandom -jar <https://builds.apache.org/job/HBase-0.92/ws/trunk/target/surefire/surefirebooter80309471585623046.jar> <https://builds.apache.org/job/HBase-0.92/ws/trunk/target/surefire/surefire5421475073838218325tmp> <https://builds.apache.org/job/HBase-0.92/ws/trunk/target/surefire/surefire1643665273401262730tmp>
Running org.apache.hadoop.hbase.master.TestHMasterRPCException
Tests run: 1, Failures: 0, Errors: 0, Skipped: 0, Time elapsed: 1.388 sec
Forking command line: /bin/sh -c cd <https://builds.apache.org/job/HBase-0.92/ws/trunk> && /home/jenkins/tools/java/jdk1.6.0_27-32/jre/bin/java -enableassertions -Xmx1400m -Djava.security.egd=file:/dev/./urandom -jar <https://builds.apache.org/job/HBase-0.92/ws/trunk/target/surefire/surefirebooter1430753779096833598.jar> <https://builds.apache.org/job/HBase-0.92/ws/trunk/target/surefire/surefire8443868570420798112tmp> <https://builds.apache.org/job/HBase-0.92/ws/trunk/target/surefire/surefire6071427044829357007tmp>
Running org.apache.hadoop.hbase.master.TestRollingRestart
Tests run: 1, Failures: 0, Errors: 1, Skipped: 0, Time elapsed: 300.144 sec <<< FAILURE!
Forking command line: /bin/sh -c cd <https://builds.apache.org/job/HBase-0.92/ws/trunk> && /home/jenkins/tools/java/jdk1.6.0_27-32/jre/bin/java -enableassertions -Xmx1400m -Djava.security.egd=file:/dev/./urandom -jar <https://builds.apache.org/job/HBase-0.92/ws/trunk/target/surefire/surefirebooter6669300179899603390.jar> <https://builds.apache.org/job/HBase-0.92/ws/trunk/target/surefire/surefire7774550955042702861tmp> <https://builds.apache.org/job/HBase-0.92/ws/trunk/target/surefire/surefire2182995056170877243tmp>
Running org.apache.hadoop.hbase.master.TestSplitLogManager
Tests run: 12, Failures: 0, Errors: 0, Skipped: 0, Time elapsed: 14.681 sec
Forking command line: /bin/sh -c cd <https://builds.apache.org/job/HBase-0.92/ws/trunk> && /home/jenkins/tools/java/jdk1.6.0_27-32/jre/bin/java -enableassertions -Xmx1400m -Djava.security.egd=file:/dev/./urandom -jar <https://builds.apache.org/job/HBase-0.92/ws/trunk/target/surefire/surefirebooter4229221084768921172.jar> <https://builds.apache.org/job/HBase-0.92/ws/trunk/target/surefire/surefire813456242084771705tmp> <https://builds.apache.org/job/HBase-0.92/ws/trunk/target/surefire/surefire6709795859588567086tmp>
Running org.apache.hadoop.hbase.master.TestDefaultLoadBalancer
Tests run: 4, Failures: 0, Errors: 0, Skipped: 0, Time elapsed: 1.469 sec
Forking command line: /bin/sh -c cd <https://builds.apache.org/job/HBase-0.92/ws/trunk> && /home/jenkins/tools/java/jdk1.6.0_27-32/jre/bin/java -enableassertions -Xmx1400m -Djava.security.egd=file:/dev/./urandom -jar <https://builds.apache.org/job/HBase-0.92/ws/trunk/target/surefire/surefirebooter5020055184340926247.jar> <https://builds.apache.org/job/HBase-0.92/ws/trunk/target/surefire/surefire6481435700709030070tmp> <https://builds.apache.org/job/HBase-0.92/ws/trunk/target/surefire/surefire1202708423612930715tmp>
Running org.apache.hadoop.hbase.master.TestZKBasedOpenCloseRegion
Tests run: 1, Failures: 0, Errors: 1, Skipped: 0, Time elapsed: 478.771 sec <<< FAILURE!
Forking command line: /bin/sh -c cd <https://builds.apache.org/job/HBase-0.92/ws/trunk> && /home/jenkins/tools/java/jdk1.6.0_27-32/jre/bin/java -enableassertions -Xmx1400m -Djava.security.egd=file:/dev/./urandom -jar <https://builds.apache.org/job/HBase-0.92/ws/trunk/target/surefire/surefirebooter25474403047599990.jar> <https://builds.apache.org/job/HBase-0.92/ws/trunk/target/surefire/surefire7420111012555777883tmp> <https://builds.apache.org/job/HBase-0.92/ws/trunk/target/surefire/surefire3702102280711808492tmp>
Running org.apache.hadoop.hbase.zookeeper.TestZooKeeperACL
Tests run: 5, Failures: 0, Errors: 0, Skipped: 0, Time elapsed: 41.033 sec
Forking command line: /bin/sh -c cd <https://builds.apache.org/job/HBase-0.92/ws/trunk> && /home/jenkins/tools/java/jdk1.6.0_27-32/jre/bin/java -enableassertions -Xmx1400m -Djava.security.egd=file:/dev/./urandom -jar <https://builds.apache.org/job/HBase-0.92/ws/trunk/target/surefire/surefirebooter597319441313639901.jar> <https://builds.apache.org/job/HBase-0.92/ws/trunk/target/surefire/surefire1431826572332871200tmp> <https://builds.apache.org/job/HBase-0.92/ws/trunk/target/surefire/surefire3117809693420261062tmp>
Running org.apache.hadoop.hbase.zookeeper.TestZooKeeperNodeTracker
Tests run: 2, Failures: 0, Errors: 0, Skipped: 0, Time elapsed: 0.738 sec
Forking command line: /bin/sh -c cd <https://builds.apache.org/job/HBase-0.92/ws/trunk> && /home/jenkins/tools/java/jdk1.6.0_27-32/jre/bin/java -enableassertions -Xmx1400m -Djava.security.egd=file:/dev/./urandom -jar <https://builds.apache.org/job/HBase-0.92/ws/trunk/target/surefire/surefirebooter6163741629253993060.jar> <https://builds.apache.org/job/HBase-0.92/ws/trunk/target/surefire/surefire7039695746697905665tmp> <https://builds.apache.org/job/HBase-0.92/ws/trunk/target/surefire/surefire4133516540184449913tmp>
Running org.apache.hadoop.hbase.zookeeper.TestZKLeaderManager
Tests run: 1, Failures: 0, Errors: 0, Skipped: 0, Time elapsed: 1.181 sec
Forking command line: /bin/sh -c cd <https://builds.apache.org/job/HBase-0.92/ws/trunk> && /home/jenkins/tools/java/jdk1.6.0_27-32/jre/bin/java -enableassertions -Xmx1400m -Djava.security.egd=file:/dev/./urandom -jar <https://builds.apache.org/job/HBase-0.92/ws/trunk/target/surefire/surefirebooter7432633667598377430.jar> <https://builds.apache.org/job/HBase-0.92/ws/trunk/target/surefire/surefire812572086791771150tmp> <https://builds.apache.org/job/HBase-0.92/ws/trunk/target/surefire/surefire85089657319366686tmp>
Running org.apache.hadoop.hbase.zookeeper.TestHQuorumPeer
Tests run: 3, Failures: 0, Errors: 0, Skipped: 0, Time elapsed: 0.823 sec
Forking command line: /bin/sh -c cd <https://builds.apache.org/job/HBase-0.92/ws/trunk> && /home/jenkins/tools/java/jdk1.6.0_27-32/jre/bin/java -enableassertions -Xmx1400m -Djava.security.egd=file:/dev/./urandom -jar <https://builds.apache.org/job/HBase-0.92/ws/trunk/target/surefire/surefirebooter3873782750375291406.jar> <https://builds.apache.org/job/HBase-0.92/ws/trunk/target/surefire/surefire8145747169792692466tmp> <https://builds.apache.org/job/HBase-0.92/ws/trunk/target/surefire/surefire666748260842774328tmp>
Running org.apache.hadoop.hbase.zookeeper.TestZooKeeperMainServerArg
Tests run: 1, Failures: 0, Errors: 0, Skipped: 0, Time elapsed: 0.229 sec
Forking command line: /bin/sh -c cd <https://builds.apache.org/job/HBase-0.92/ws/trunk> && /home/jenkins/tools/java/jdk1.6.0_27-32/jre/bin/java -enableassertions -Xmx1400m -Djava.security.egd=file:/dev/./urandom -jar <https://builds.apache.org/job/HBase-0.92/ws/trunk/target/surefire/surefirebooter2693752830109490209.jar> <https://builds.apache.org/job/HBase-0.92/ws/trunk/target/surefire/surefire3041397402515447847tmp> <https://builds.apache.org/job/HBase-0.92/ws/trunk/target/surefire/surefire8851858241381842549tmp>
Running org.apache.hadoop.hbase.zookeeper.TestZKTable
Tests run: 1, Failures: 0, Errors: 0, Skipped: 0, Time elapsed: 0.758 sec
Forking command line: /bin/sh -c cd <https://builds.apache.org/job/HBase-0.92/ws/trunk> && /home/jenkins/tools/java/jdk1.6.0_27-32/jre/bin/java -enableassertions -Xmx1400m -Djava.security.egd=file:/dev/./urandom -jar <https://builds.apache.org/job/HBase-0.92/ws/trunk/target/surefire/surefirebooter5451948018762590189.jar> <https://builds.apache.org/job/HBase-0.92/ws/trunk/target/surefire/surefire572338056246141931tmp> <https://builds.apache.org/job/HBase-0.92/ws/trunk/target/surefire/surefire4363087845332272823tmp>
Running org.apache.hadoop.hbase.TestHServerAddress
Tests run: 6, Failures: 0, Errors: 0, Skipped: 0, Time elapsed: 0.068 sec
Forking command line: /bin/sh -c cd <https://builds.apache.org/job/HBase-0.92/ws/trunk> && /home/jenkins/tools/java/jdk1.6.0_27-32/jre/bin/java -enableassertions -Xmx1400m -Djava.security.egd=file:/dev/./urandom -jar <https://builds.apache.org/job/HBase-0.92/ws/trunk/target/surefire/surefirebooter3930022263735418812.jar> <https://builds.apache.org/job/HBase-0.92/ws/trunk/target/surefire/surefire2571297019122242176tmp> <https://builds.apache.org/job/HBase-0.92/ws/trunk/target/surefire/surefire3511209072957109504tmp>
Running org.apache.hadoop.hbase.TestDrainingServer
Tests run: 1, Failures: 0, Errors: 1, Skipped: 0, Time elapsed: 486.413 sec <<< FAILURE!
Forking command line: /bin/sh -c cd <https://builds.apache.org/job/HBase-0.92/ws/trunk> && /home/jenkins/tools/java/jdk1.6.0_27-32/jre/bin/java -enableassertions -Xmx1400m -Djava.security.egd=file:/dev/./urandom -jar <https://builds.apache.org/job/HBase-0.92/ws/trunk/target/surefire/surefirebooter700289744135754021.jar> <https://builds.apache.org/job/HBase-0.92/ws/trunk/target/surefire/surefire2008789405351369303tmp> <https://builds.apache.org/job/HBase-0.92/ws/trunk/target/surefire/surefire2321553720182423304tmp>
Running org.apache.hadoop.hbase.monitoring.TestTaskMonitor
Tests run: 3, Failures: 0, Errors: 0, Skipped: 0, Time elapsed: 0.253 sec
Forking command line: /bin/sh -c cd <https://builds.apache.org/job/HBase-0.92/ws/trunk> && /home/jenkins/tools/java/jdk1.6.0_27-32/jre/bin/java -enableassertions -Xmx1400m -Djava.security.egd=file:/dev/./urandom -jar <https://builds.apache.org/job/HBase-0.92/ws/trunk/target/surefire/surefirebooter890202743995255662.jar> <https://builds.apache.org/job/HBase-0.92/ws/trunk/target/surefire/surefire8383371066868101910tmp> <https://builds.apache.org/job/HBase-0.92/ws/trunk/target/surefire/surefire6034193218734137862tmp>
Running org.apache.hadoop.hbase.monitoring.TestMemoryBoundedLogMessageBuffer
Tests run: 2, Failures: 0, Errors: 0, Skipped: 0, Time elapsed: 0.114 sec
Forking command line: /bin/sh -c cd <https://builds.apache.org/job/HBase-0.92/ws/trunk> && /home/jenkins/tools/java/jdk1.6.0_27-32/jre/bin/java -enableassertions -Xmx1400m -Djava.security.egd=file:/dev/./urandom -jar <https://builds.apache.org/job/HBase-0.92/ws/trunk/target/surefire/surefirebooter4750447160889537049.jar> <https://builds.apache.org/job/HBase-0.92/ws/trunk/target/surefire/surefire8670369720809342604tmp> <https://builds.apache.org/job/HBase-0.92/ws/trunk/target/surefire/surefire6719856552433457950tmp>
Running org.apache.hadoop.hbase.TestFullLogReconstruction
Tests run: 1, Failures: 0, Errors: 1, Skipped: 0, Time elapsed: 319.261 sec <<< FAILURE!
Forking command line: /bin/sh -c cd <https://builds.apache.org/job/HBase-0.92/ws/trunk> && /home/jenkins/tools/java/jdk1.6.0_27-32/jre/bin/java -enableassertions -Xmx1400m -Djava.security.egd=file:/dev/./urandom -jar <https://builds.apache.org/job/HBase-0.92/ws/trunk/target/surefire/surefirebooter3966868023894806165.jar> <https://builds.apache.org/job/HBase-0.92/ws/trunk/target/surefire/surefire6121166375509440840tmp> <https://builds.apache.org/job/HBase-0.92/ws/trunk/target/surefire/surefire3295369562253072027tmp>
Running org.apache.hadoop.hbase.TestHRegionLocation
Tests run: 3, Failures: 0, Errors: 0, Skipped: 0, Time elapsed: 0.142 sec
Forking command line: /bin/sh -c cd <https://builds.apache.org/job/HBase-0.92/ws/trunk> && /home/jenkins/tools/java/jdk1.6.0_27-32/jre/bin/java -enableassertions -Xmx1400m -Djava.security.egd=file:/dev/./urandom -jar <https://builds.apache.org/job/HBase-0.92/ws/trunk/target/surefire/surefirebooter8657561654988838273.jar> <https://builds.apache.org/job/HBase-0.92/ws/trunk/target/surefire/surefire2137736703437330502tmp> <https://builds.apache.org/job/HBase-0.92/ws/trunk/target/surefire/surefire6979802008398814148tmp>
Running org.apache.hadoop.hbase.TestRegionRebalancing
Tests run: 1, Failures: 0, Errors: 1, Skipped: 0, Time elapsed: 500.987 sec <<< FAILURE!
Forking command line: /bin/sh -c cd <https://builds.apache.org/job/HBase-0.92/ws/trunk> && /home/jenkins/tools/java/jdk1.6.0_27-32/jre/bin/java -enableassertions -Xmx1400m -Djava.security.egd=file:/dev/./urandom -jar <https://builds.apache.org/job/HBase-0.92/ws/trunk/target/surefire/surefirebooter118273912687414960.jar> <https://builds.apache.org/job/HBase-0.92/ws/trunk/target/surefire/surefire4196450493169397175tmp> <https://builds.apache.org/job/HBase-0.92/ws/trunk/target/surefire/surefire688904601938627797tmp>
Running org.apache.hadoop.hbase.TestMultiVersions
Forking command line: /bin/sh -c cd <https://builds.apache.org/job/HBase-0.92/ws/trunk> && /home/jenkins/tools/java/jdk1.6.0_27-32/jre/bin/java -enableassertions -Xmx1400m -Djava.security.egd=file:/dev/./urandom -jar <https://builds.apache.org/job/HBase-0.92/ws/trunk/target/surefire/surefirebooter3670531945570572329.jar> <https://builds.apache.org/job/HBase-0.92/ws/trunk/target/surefire/surefire4740651664789237257tmp> <https://builds.apache.org/job/HBase-0.92/ws/trunk/target/surefire/surefire5800473987796815466tmp>
Running org.apache.hadoop.hbase.TestInfoServers
Tests run: 2, Failures: 1, Errors: 1, Skipped: 0, Time elapsed: 16.469 sec <<< FAILURE!
Forking command line: /bin/sh -c cd <https://builds.apache.org/job/HBase-0.92/ws/trunk> && /home/jenkins/tools/java/jdk1.6.0_27-32/jre/bin/java -enableassertions -Xmx1400m -Djava.security.egd=file:/dev/./urandom -jar <https://builds.apache.org/job/HBase-0.92/ws/trunk/target/surefire/surefirebooter246144603294344622.jar> <https://builds.apache.org/job/HBase-0.92/ws/trunk/target/surefire/surefire7127161883836371805tmp> <https://builds.apache.org/job/HBase-0.92/ws/trunk/target/surefire/surefire3414184242101569579tmp>
Running org.apache.hadoop.hbase.util.TestMergeTable
Tests run: 1, Failures: 0, Errors: 1, Skipped: 0, Time elapsed: 300.309 sec <<< FAILURE!
Forking command line: /bin/sh -c cd <https://builds.apache.org/job/HBase-0.92/ws/trunk> && /home/jenkins/tools/java/jdk1.6.0_27-32/jre/bin/java -enableassertions -Xmx1400m -Djava.security.egd=file:/dev/./urandom -jar <https://builds.apache.org/job/HBase-0.92/ws/trunk/target/surefire/surefirebooter5914301777784596212.jar> <https://builds.apache.org/job/HBase-0.92/ws/trunk/target/surefire/surefire7438530135911281438tmp> <https://builds.apache.org/job/HBase-0.92/ws/trunk/target/surefire/surefire6030755028750528448tmp>
Running org.apache.hadoop.hbase.util.TestFSUtils
Tests run: 2, Failures: 0, Errors: 0, Skipped: 0, Time elapsed: 20.107 sec
Forking command line: /bin/sh -c cd <https://builds.apache.org/job/HBase-0.92/ws/trunk> && /home/jenkins/tools/java/jdk1.6.0_27-32/jre/bin/java -enableassertions -Xmx1400m -Djava.security.egd=file:/dev/./urandom -jar <https://builds.apache.org/job/HBase-0.92/ws/trunk/target/surefire/surefirebooter1427623594788705122.jar> <https://builds.apache.org/job/HBase-0.92/ws/trunk/target/surefire/surefire3925954266237881378tmp> <https://builds.apache.org/job/HBase-0.92/ws/trunk/target/surefire/surefire5068596754925910151tmp>
Running org.apache.hadoop.hbase.util.TestIncrementingEnvironmentEdge
Tests run: 1, Failures: 0, Errors: 0, Skipped: 0, Time elapsed: 0.065 sec
Forking command line: /bin/sh -c cd <https://builds.apache.org/job/HBase-0.92/ws/trunk> && /home/jenkins/tools/java/jdk1.6.0_27-32/jre/bin/java -enableassertions -Xmx1400m -Djava.security.egd=file:/dev/./urandom -jar <https://builds.apache.org/job/HBase-0.92/ws/trunk/target/surefire/surefirebooter4287678716276476551.jar> <https://builds.apache.org/job/HBase-0.92/ws/trunk/target/surefire/surefire405844056457329727tmp> <https://builds.apache.org/job/HBase-0.92/ws/trunk/target/surefire/surefire6052240711989500751tmp>
Running org.apache.hadoop.hbase.util.TestDefaultEnvironmentEdge
Tests run: 1, Failures: 0, Errors: 0, Skipped: 0, Time elapsed: 0.057 sec
Forking command line: /bin/sh -c cd <https://builds.apache.org/job/HBase-0.92/ws/trunk> && /home/jenkins/tools/java/jdk1.6.0_27-32/jre/bin/java -enableassertions -Xmx1400m -Djava.security.egd=file:/dev/./urandom -jar <https://builds.apache.org/job/HBase-0.92/ws/trunk/target/surefire/surefirebooter1772686335803413177.jar> <https://builds.apache.org/job/HBase-0.92/ws/trunk/target/surefire/surefire2023781399603305611tmp> <https://builds.apache.org/job/HBase-0.92/ws/trunk/target/surefire/surefire3394810128987789631tmp>
Running org.apache.hadoop.hbase.util.TestIdLock
Tests run: 1, Failures: 0, Errors: 0, Skipped: 0, Time elapsed: 15.28 sec
Forking command line: /bin/sh -c cd <https://builds.apache.org/job/HBase-0.92/ws/trunk> && /home/jenkins/tools/java/jdk1.6.0_27-32/jre/bin/java -enableassertions -Xmx1400m -Djava.security.egd=file:/dev/./urandom -jar <https://builds.apache.org/job/HBase-0.92/ws/trunk/target/surefire/surefirebooter3841283772375423684.jar> <https://builds.apache.org/job/HBase-0.92/ws/trunk/target/surefire/surefire5398464121883321240tmp> <https://builds.apache.org/job/HBase-0.92/ws/trunk/target/surefire/surefire3848092904138276081tmp>
Running org.apache.hadoop.hbase.util.TestBase64
Tests run: 1, Failures: 0, Errors: 0, Skipped: 0, Time elapsed: 0.129 sec
Forking command line: /bin/sh -c cd <https://builds.apache.org/job/HBase-0.92/ws/trunk> && /home/jenkins/tools/java/jdk1.6.0_27-32/jre/bin/java -enableassertions -Xmx1400m -Djava.security.egd=file:/dev/./urandom -jar <https://builds.apache.org/job/HBase-0.92/ws/trunk/target/surefire/surefirebooter4493115482417671541.jar> <https://builds.apache.org/job/HBase-0.92/ws/trunk/target/surefire/surefire2895714299984369442tmp> <https://builds.apache.org/job/HBase-0.92/ws/trunk/target/surefire/surefire1735886715579319800tmp>
Running org.apache.hadoop.hbase.util.TestRegionSplitCalculator
Tests run: 14, Failures: 0, Errors: 0, Skipped: 0, Time elapsed: 0.236 sec
Forking command line: /bin/sh -c cd <https://builds.apache.org/job/HBase-0.92/ws/trunk> && /home/jenkins/tools/java/jdk1.6.0_27-32/jre/bin/java -enableassertions -Xmx1400m -Djava.security.egd=file:/dev/./urandom -jar <https://builds.apache.org/job/HBase-0.92/ws/trunk/target/surefire/surefirebooter1024844201244583745.jar> <https://builds.apache.org/job/HBase-0.92/ws/trunk/target/surefire/surefire258642869714391764tmp> <https://builds.apache.org/job/HBase-0.92/ws/trunk/target/surefire/surefire7387702600080835311tmp>
Running org.apache.hadoop.hbase.util.TestKeying
Tests run: 1, Failures: 0, Errors: 0, Skipped: 0, Time elapsed: 0.028 sec
Forking command line: /bin/sh -c cd <https://builds.apache.org/job/HBase-0.92/ws/trunk> && /home/jenkins/tools/java/jdk1.6.0_27-32/jre/bin/java -enableassertions -Xmx1400m -Djava.security.egd=file:/dev/./urandom -jar <https://builds.apache.org/job/HBase-0.92/ws/trunk/target/surefire/surefirebooter3101298761038333655.jar> <https://builds.apache.org/job/HBase-0.92/ws/trunk/target/surefire/surefire4202213350742621946tmp> <https://builds.apache.org/job/HBase-0.92/ws/trunk/target/surefire/surefire1010509704590870970tmp>
Running org.apache.hadoop.hbase.util.TestHBaseFsck
Forking command line: /bin/sh -c cd <https://builds.apache.org/job/HBase-0.92/ws/trunk> && /home/jenkins/tools/java/jdk1.6.0_27-32/jre/bin/java -enableassertions -Xmx1400m -Djava.security.egd=file:/dev/./urandom -jar <https://builds.apache.org/job/HBase-0.92/ws/trunk/target/surefire/surefirebooter7080388871561143182.jar> <https://builds.apache.org/job/HBase-0.92/ws/trunk/target/surefire/surefire6157062404720955793tmp> <https://builds.apache.org/job/HBase-0.92/ws/trunk/target/surefire/surefire4270717231422595395tmp>
Running org.apache.hadoop.hbase.util.TestEnvironmentEdgeManager
Tests run: 2, Failures: 0, Errors: 0, Skipped: 0, Time elapsed: 0.242 sec
Forking command line: /bin/sh -c cd <https://builds.apache.org/job/HBase-0.92/ws/trunk> && /home/jenkins/tools/java/jdk1.6.0_27-32/jre/bin/java -enableassertions -Xmx1400m -Djava.security.egd=file:/dev/./urandom -jar <https://builds.apache.org/job/HBase-0.92/ws/trunk/target/surefire/surefirebooter7644577496455418983.jar> <https://builds.apache.org/job/HBase-0.92/ws/trunk/target/surefire/surefire6012805649285825229tmp> <https://builds.apache.org/job/HBase-0.92/ws/trunk/target/surefire/surefire398865838396812620tmp>
Running org.apache.hadoop.hbase.util.TestHBaseFsckComparator
Tests run: 7, Failures: 0, Errors: 0, Skipped: 0, Time elapsed: 0.17 sec
Forking command line: /bin/sh -c cd <https://builds.apache.org/job/HBase-0.92/ws/trunk> && /home/jenkins/tools/java/jdk1.6.0_27-32/jre/bin/java -enableassertions -Xmx1400m -Djava.security.egd=file:/dev/./urandom -jar <https://builds.apache.org/job/HBase-0.92/ws/trunk/target/surefire/surefirebooter8305018108006228674.jar> <https://builds.apache.org/job/HBase-0.92/ws/trunk/target/surefire/surefire2174823210940043610tmp> <https://builds.apache.org/job/HBase-0.92/ws/trunk/target/surefire/surefire5800151763058052391tmp>
Running org.apache.hadoop.hbase.util.TestMergeTool
Tests run: 1, Failures: 0, Errors: 0, Skipped: 0, Time elapsed: 339.914 sec
Forking command line: /bin/sh -c cd <https://builds.apache.org/job/HBase-0.92/ws/trunk> && /home/jenkins/tools/java/jdk1.6.0_27-32/jre/bin/java -enableassertions -Xmx1400m -Djava.security.egd=file:/dev/./urandom -jar <https://builds.apache.org/job/HBase-0.92/ws/trunk/target/surefire/surefirebooter7485698361774663403.jar> <https://builds.apache.org/job/HBase-0.92/ws/trunk/target/surefire/surefire6650239968274942477tmp> <https://builds.apache.org/job/HBase-0.92/ws/trunk/target/surefire/surefire3514712899622536120tmp>
Running org.apache.hadoop.hbase.util.TestCompressionTest
Tests run: 1, Failures: 0, Errors: 0, Skipped: 0, Time elapsed: 0.388 sec
Forking command line: /bin/sh -c cd <https://builds.apache.org/job/HBase-0.92/ws/trunk> && /home/jenkins/tools/java/jdk1.6.0_27-32/jre/bin/java -enableassertions -Xmx1400m -Djava.security.egd=file:/dev/./urandom -jar <https://builds.apache.org/job/HBase-0.92/ws/trunk/target/surefire/surefirebooter6423360884996944872.jar> <https://builds.apache.org/job/HBase-0.92/ws/trunk/target/surefire/surefire5407633195373392550tmp> <https://builds.apache.org/job/HBase-0.92/ws/trunk/target/surefire/surefire2534973198961682807tmp>
Running org.apache.hadoop.hbase.util.TestSortedCopyOnWriteSet
Tests run: 2, Failures: 0, Errors: 0, Skipped: 0, Time elapsed: 0.066 sec
Forking command line: /bin/sh -c cd <https://builds.apache.org/job/HBase-0.92/ws/trunk> && /home/jenkins/tools/java/jdk1.6.0_27-32/jre/bin/java -enableassertions -Xmx1400m -Djava.security.egd=file:/dev/./urandom -jar <https://builds.apache.org/job/HBase-0.92/ws/trunk/target/surefire/surefirebooter9059327784759211248.jar> <https://builds.apache.org/job/HBase-0.92/ws/trunk/target/surefire/surefire6568572105931845126tmp> <https://builds.apache.org/job/HBase-0.92/ws/trunk/target/surefire/surefire5882306152766868585tmp>
Running org.apache.hadoop.hbase.util.TestPoolMap
Tests run: 9, Failures: 0, Errors: 0, Skipped: 0, Time elapsed: 0.104 sec
Forking command line: /bin/sh -c cd <https://builds.apache.org/job/HBase-0.92/ws/trunk> && /home/jenkins/tools/java/jdk1.6.0_27-32/jre/bin/java -enableassertions -Xmx1400m -Djava.security.egd=file:/dev/./urandom -jar <https://builds.apache.org/job/HBase-0.92/ws/trunk/target/surefire/surefirebooter4783413514590673884.jar> <https://builds.apache.org/job/HBase-0.92/ws/trunk/target/surefire/surefire5820445666658932764tmp> <https://builds.apache.org/job/HBase-0.92/ws/trunk/target/surefire/surefire807618880920544207tmp>
Running org.apache.hadoop.hbase.util.hbck.TestOfflineMetaRebuildBase
Tests run: 1, Failures: 0, Errors: 1, Skipped: 0, Time elapsed: 479.767 sec <<< FAILURE!
Forking command line: /bin/sh -c cd <https://builds.apache.org/job/HBase-0.92/ws/trunk> && /home/jenkins/tools/java/jdk1.6.0_27-32/jre/bin/java -enableassertions -Xmx1400m -Djava.security.egd=file:/dev/./urandom -jar <https://builds.apache.org/job/HBase-0.92/ws/trunk/target/surefire/surefirebooter1762989325324465394.jar> <https://builds.apache.org/job/HBase-0.92/ws/trunk/target/surefire/surefire5421241087088976367tmp> <https://builds.apache.org/job/HBase-0.92/ws/trunk/target/surefire/surefire7996191843143696123tmp>
Running org.apache.hadoop.hbase.util.hbck.TestOfflineMetaRebuildOverlap
Tests run: 1, Failures: 0, Errors: 1, Skipped: 0, Time elapsed: 480.825 sec <<< FAILURE!
Forking command line: /bin/sh -c cd <https://builds.apache.org/job/HBase-0.92/ws/trunk> && /home/jenkins/tools/java/jdk1.6.0_27-32/jre/bin/java -enableassertions -Xmx1400m -Djava.security.egd=file:/dev/./urandom -jar <https://builds.apache.org/job/HBase-0.92/ws/trunk/target/surefire/surefirebooter1796525673467262781.jar> <https://builds.apache.org/job/HBase-0.92/ws/trunk/target/surefire/surefire3438962953848598485tmp> <https://builds.apache.org/job/HBase-0.92/ws/trunk/target/surefire/surefire7143770877129244934tmp>
Running org.apache.hadoop.hbase.util.hbck.TestOfflineMetaRebuildHole
Tests run: 1, Failures: 0, Errors: 1, Skipped: 0, Time elapsed: 480.709 sec <<< FAILURE!
Forking command line: /bin/sh -c cd <https://builds.apache.org/job/HBase-0.92/ws/trunk> && /home/jenkins/tools/java/jdk1.6.0_27-32/jre/bin/java -enableassertions -Xmx1400m -Djava.security.egd=file:/dev/./urandom -jar <https://builds.apache.org/job/HBase-0.92/ws/trunk/target/surefire/surefirebooter4620374407629701564.jar> <https://builds.apache.org/job/HBase-0.92/ws/trunk/target/surefire/surefire8224783462769362320tmp> <https://builds.apache.org/job/HBase-0.92/ws/trunk/target/surefire/surefire4192256259481821049tmp>
Running org.apache.hadoop.hbase.util.TestRootPath
Tests run: 1, Failures: 0, Errors: 0, Skipped: 0, Time elapsed: 0.113 sec
Forking command line: /bin/sh -c cd <https://builds.apache.org/job/HBase-0.92/ws/trunk> && /home/jenkins/tools/java/jdk1.6.0_27-32/jre/bin/java -enableassertions -Xmx1400m -Djava.security.egd=file:/dev/./urandom -jar <https://builds.apache.org/job/HBase-0.92/ws/trunk/target/surefire/surefirebooter1978964253391087462.jar> <https://builds.apache.org/job/HBase-0.92/ws/trunk/target/surefire/surefire182600534678603818tmp> <https://builds.apache.org/job/HBase-0.92/ws/trunk/target/surefire/surefire5015520910837583137tmp>
Running org.apache.hadoop.hbase.util.TestBytes
Tests run: 13, Failures: 0, Errors: 0, Skipped: 0, Time elapsed: 0.213 sec
Forking command line: /bin/sh -c cd <https://builds.apache.org/job/HBase-0.92/ws/trunk> && /home/jenkins/tools/java/jdk1.6.0_27-32/jre/bin/java -enableassertions -Xmx1400m -Djava.security.egd=file:/dev/./urandom -jar <https://builds.apache.org/job/HBase-0.92/ws/trunk/target/surefire/surefirebooter8870530536741179337.jar> <https://builds.apache.org/job/HBase-0.92/ws/trunk/target/surefire/surefire1630366676847755044tmp> <https://builds.apache.org/job/HBase-0.92/ws/trunk/target/surefire/surefire1518067158157937476tmp>
Running org.apache.hadoop.hbase.util.TestByteBloomFilter
Tests run: 5, Failures: 0, Errors: 0, Skipped: 0, Time elapsed: 1.341 sec
Forking command line: /bin/sh -c cd <https://builds.apache.org/job/HBase-0.92/ws/trunk> && /home/jenkins/tools/java/jdk1.6.0_27-32/jre/bin/java -enableassertions -Xmx1400m -Djava.security.egd=file:/dev/./urandom -jar <https://builds.apache.org/job/HBase-0.92/ws/trunk/target/surefire/surefirebooter6165443441032164374.jar> <https://builds.apache.org/job/HBase-0.92/ws/trunk/target/surefire/surefire8031520769562431842tmp> <https://builds.apache.org/job/HBase-0.92/ws/trunk/target/surefire/surefire5578796099638301944tmp>
Running org.apache.hadoop.hbase.util.TestFSTableDescriptors
Tests run: 10, Failures: 0, Errors: 0, Skipped: 0, Time elapsed: 1.004 sec
Forking command line: /bin/sh -c cd <https://builds.apache.org/job/HBase-0.92/ws/trunk> && /home/jenkins/tools/java/jdk1.6.0_27-32/jre/bin/java -enableassertions -Xmx1400m -Djava.security.egd=file:/dev/./urandom -jar <https://builds.apache.org/job/HBase-0.92/ws/trunk/target/surefire/surefirebooter2994594309851546192.jar> <https://builds.apache.org/job/HBase-0.92/ws/trunk/target/surefire/surefire8163815517375081111tmp> <https://builds.apache.org/job/HBase-0.92/ws/trunk/target/surefire/surefire6565227735226421273tmp>
Running org.apache.hadoop.hbase.security.TestUser
Tests run: 3, Failures: 0, Errors: 0, Skipped: 0, Time elapsed: 0.467 sec
Forking command line: /bin/sh -c cd <https://builds.apache.org/job/HBase-0.92/ws/trunk> && /home/jenkins/tools/java/jdk1.6.0_27-32/jre/bin/java -enableassertions -Xmx1400m -Djava.security.egd=file:/dev/./urandom -jar <https://builds.apache.org/job/HBase-0.92/ws/trunk/target/surefire/surefirebooter1228723779208332880.jar> <https://builds.apache.org/job/HBase-0.92/ws/trunk/target/surefire/surefire8992349532401928783tmp> <https://builds.apache.org/job/HBase-0.92/ws/trunk/target/surefire/surefire8895826137333002311tmp>
Running org.apache.hadoop.hbase.TestServerName
Tests run: 4, Failures: 0, Errors: 0, Skipped: 0, Time elapsed: 0.139 sec
Forking command line: /bin/sh -c cd <https://builds.apache.org/job/HBase-0.92/ws/trunk> && /home/jenkins/tools/java/jdk1.6.0_27-32/jre/bin/java -enableassertions -Xmx1400m -Djava.security.egd=file:/dev/./urandom -jar <https://builds.apache.org/job/HBase-0.92/ws/trunk/target/surefire/surefirebooter6645635414428093342.jar> <https://builds.apache.org/job/HBase-0.92/ws/trunk/target/surefire/surefire6227950985337650369tmp> <https://builds.apache.org/job/HBase-0.92/ws/trunk/target/surefire/surefire8058526659865472488tmp>
Running org.apache.hadoop.hbase.regionserver.TestServerCustomProtocol
Tests run: 1, Failures: 0, Errors: 1, Skipped: 0, Time elapsed: 478.644 sec <<< FAILURE!
Forking command line: /bin/sh -c cd <https://builds.apache.org/job/HBase-0.92/ws/trunk> && /home/jenkins/tools/java/jdk1.6.0_27-32/jre/bin/java -enableassertions -Xmx1400m -Djava.security.egd=file:/dev/./urandom -jar <https://builds.apache.org/job/HBase-0.92/ws/trunk/target/surefire/surefirebooter5027570134323983595.jar> <https://builds.apache.org/job/HBase-0.92/ws/trunk/target/surefire/surefire2323451993497282436tmp> <https://builds.apache.org/job/HBase-0.92/ws/trunk/target/surefire/surefire5459609595321176773tmp>
Running org.apache.hadoop.hbase.regionserver.TestMultiColumnScanner
Tests run: 6, Failures: 0, Errors: 0, Skipped: 0, Time elapsed: 18.297 sec
Forking command line: /bin/sh -c cd <https://builds.apache.org/job/HBase-0.92/ws/trunk> && /home/jenkins/tools/java/jdk1.6.0_27-32/jre/bin/java -enableassertions -Xmx1400m -Djava.security.egd=file:/dev/./urandom -jar <https://builds.apache.org/job/HBase-0.92/ws/trunk/target/surefire/surefirebooter8510211480305092217.jar> <https://builds.apache.org/job/HBase-0.92/ws/trunk/target/surefire/surefire8631801729803313182tmp> <https://builds.apache.org/job/HBase-0.92/ws/trunk/target/surefire/surefire5581980432766195364tmp>
Running org.apache.hadoop.hbase.regionserver.TestMasterAddressManager
Tests run: 1, Failures: 0, Errors: 0, Skipped: 0, Time elapsed: 0.699 sec
Forking command line: /bin/sh -c cd <https://builds.apache.org/job/HBase-0.92/ws/trunk> && /home/jenkins/tools/java/jdk1.6.0_27-32/jre/bin/java -enableassertions -Xmx1400m -Djava.security.egd=file:/dev/./urandom -jar <https://builds.apache.org/job/HBase-0.92/ws/trunk/target/surefire/surefirebooter5147779332712119730.jar> <https://builds.apache.org/job/HBase-0.92/ws/trunk/target/surefire/surefire7074484182579509354tmp> <https://builds.apache.org/job/HBase-0.92/ws/trunk/target/surefire/surefire1571864108773910649tmp>
Running org.apache.hadoop.hbase.regionserver.TestMinVersions
Tests run: 6, Failures: 0, Errors: 0, Skipped: 0, Time elapsed: 1.289 sec
Forking command line: /bin/sh -c cd <https://builds.apache.org/job/HBase-0.92/ws/trunk> && /home/jenkins/tools/java/jdk1.6.0_27-32/jre/bin/java -enableassertions -Xmx1400m -Djava.security.egd=file:/dev/./urandom -jar <https://builds.apache.org/job/HBase-0.92/ws/trunk/target/surefire/surefirebooter8471790803711728413.jar> <https://builds.apache.org/job/HBase-0.92/ws/trunk/target/surefire/surefire685584520460232335tmp> <https://builds.apache.org/job/HBase-0.92/ws/trunk/target/surefire/surefire5263165061018088500tmp>
Running org.apache.hadoop.hbase.regionserver.TestKeyValueSkipListSet
Tests run: 4, Failures: 0, Errors: 0, Skipped: 0, Time elapsed: 0.122 sec
Forking command line: /bin/sh -c cd <https://builds.apache.org/job/HBase-0.92/ws/trunk> && /home/jenkins/tools/java/jdk1.6.0_27-32/jre/bin/java -enableassertions -Xmx1400m -Djava.security.egd=file:/dev/./urandom -jar <https://builds.apache.org/job/HBase-0.92/ws/trunk/target/surefire/surefirebooter2939298149451245004.jar> <https://builds.apache.org/job/HBase-0.92/ws/trunk/target/surefire/surefire1905926408056770177tmp> <https://builds.apache.org/job/HBase-0.92/ws/trunk/target/surefire/surefire8889937366389349956tmp>
Running org.apache.hadoop.hbase.regionserver.TestScanDeleteTracker
Tests run: 6, Failures: 0, Errors: 0, Skipped: 0, Time elapsed: 0.596 sec
Forking command line: /bin/sh -c cd <https://builds.apache.org/job/HBase-0.92/ws/trunk> && /home/jenkins/tools/java/jdk1.6.0_27-32/jre/bin/java -enableassertions -Xmx1400m -Djava.security.egd=file:/dev/./urandom -jar <https://builds.apache.org/job/HBase-0.92/ws/trunk/target/surefire/surefirebooter4813546836970928259.jar> <https://builds.apache.org/job/HBase-0.92/ws/trunk/target/surefire/surefire988227370646725941tmp> <https://builds.apache.org/job/HBase-0.92/ws/trunk/target/surefire/surefire8798063025264382604tmp>
Running org.apache.hadoop.hbase.regionserver.TestRpcMetrics
Tests run: 1, Failures: 0, Errors: 0, Skipped: 0, Time elapsed: 2.202 sec
Forking command line: /bin/sh -c cd <https://builds.apache.org/job/HBase-0.92/ws/trunk> && /home/jenkins/tools/java/jdk1.6.0_27-32/jre/bin/java -enableassertions -Xmx1400m -Djava.security.egd=file:/dev/./urandom -jar <https://builds.apache.org/job/HBase-0.92/ws/trunk/target/surefire/surefirebooter1010758441416966353.jar> <https://builds.apache.org/job/HBase-0.92/ws/trunk/target/surefire/surefire7940450705298758317tmp> <https://builds.apache.org/job/HBase-0.92/ws/trunk/target/surefire/surefire624375596178745924tmp>
Running org.apache.hadoop.hbase.regionserver.TestReadWriteConsistencyControl
Tests run: 1, Failures: 0, Errors: 0, Skipped: 0, Time elapsed: 10.107 sec
Forking command line: /bin/sh -c cd <https://builds.apache.org/job/HBase-0.92/ws/trunk> && /home/jenkins/tools/java/jdk1.6.0_27-32/jre/bin/java -enableassertions -Xmx1400m -Djava.security.egd=file:/dev/./urandom -jar <https://builds.apache.org/job/HBase-0.92/ws/trunk/target/surefire/surefirebooter4008911794052638869.jar> <https://builds.apache.org/job/HBase-0.92/ws/trunk/target/surefire/surefire5949636795582989324tmp> <https://builds.apache.org/job/HBase-0.92/ws/trunk/target/surefire/surefire7336003698571726835tmp>
Running org.apache.hadoop.hbase.regionserver.TestStore
Tests run: 11, Failures: 0, Errors: 0, Skipped: 0, Time elapsed: 1.878 sec
Forking command line: /bin/sh -c cd <https://builds.apache.org/job/HBase-0.92/ws/trunk> && /home/jenkins/tools/java/jdk1.6.0_27-32/jre/bin/java -enableassertions -Xmx1400m -Djava.security.egd=file:/dev/./urandom -jar <https://builds.apache.org/job/HBase-0.92/ws/trunk/target/surefire/surefirebooter8208912390585248423.jar> <https://builds.apache.org/job/HBase-0.92/ws/trunk/target/surefire/surefire8087747367561111964tmp> <https://builds.apache.org/job/HBase-0.92/ws/trunk/target/surefire/surefire574573954973826781tmp>
Running org.apache.hadoop.hbase.regionserver.TestCompactSelection
Tests run: 1, Failures: 0, Errors: 0, Skipped: 0, Time elapsed: 0.857 sec
Forking command line: /bin/sh -c cd <https://builds.apache.org/job/HBase-0.92/ws/trunk> && /home/jenkins/tools/java/jdk1.6.0_27-32/jre/bin/java -enableassertions -Xmx1400m -Djava.security.egd=file:/dev/./urandom -jar <https://builds.apache.org/job/HBase-0.92/ws/trunk/target/surefire/surefirebooter483863450443382510.jar> <https://builds.apache.org/job/HBase-0.92/ws/trunk/target/surefire/surefire247882874317487103tmp> <https://builds.apache.org/job/HBase-0.92/ws/trunk/target/surefire/surefire4717400896191142886tmp>
Running org.apache.hadoop.hbase.regionserver.TestStoreFile
Tests run: 8, Failures: 0, Errors: 0, Skipped: 0, Time elapsed: 1.784 sec
Forking command line: /bin/sh -c cd <https://builds.apache.org/job/HBase-0.92/ws/trunk> && /home/jenkins/tools/java/jdk1.6.0_27-32/jre/bin/java -enableassertions -Xmx1400m -Djava.security.egd=file:/dev/./urandom -jar <https://builds.apache.org/job/HBase-0.92/ws/trunk/target/surefire/surefirebooter4356372499844906827.jar> <https://builds.apache.org/job/HBase-0.92/ws/trunk/target/surefire/surefire3445592219637031866tmp> <https://builds.apache.org/job/HBase-0.92/ws/trunk/target/surefire/surefire3873561245940897266tmp>
Running org.apache.hadoop.hbase.regionserver.TestScanner
Tests run: 7, Failures: 0, Errors: 0, Skipped: 0, Time elapsed: 4.819 sec
Forking command line: /bin/sh -c cd <https://builds.apache.org/job/HBase-0.92/ws/trunk> && /home/jenkins/tools/java/jdk1.6.0_27-32/jre/bin/java -enableassertions -Xmx1400m -Djava.security.egd=file:/dev/./urandom -jar <https://builds.apache.org/job/HBase-0.92/ws/trunk/target/surefire/surefirebooter2947467971757177044.jar> <https://builds.apache.org/job/HBase-0.92/ws/trunk/target/surefire/surefire7441056940895027034tmp> <https://builds.apache.org/job/HBase-0.92/ws/trunk/target/surefire/surefire8469963605814547963tmp>
Running org.apache.hadoop.hbase.regionserver.TestSplitTransactionOnCluster
Build timed out (after 191 minutes). Marking the build as failed.
Forking command line: /bin/sh -c cd <https://builds.apache.org/job/HBase-0.92/ws/trunk> && /home/jenkins/tools/java/jdk1.6.0_27-32/jre/bin/java -enableassertions -Xmx1400m -Djava.security.egd=file:/dev/./urandom -jar <https://builds.apache.org/job/HBase-0.92/ws/trunk/target/surefire/surefirebooter2461303376696610087.jar> <https://builds.apache.org/job/HBase-0.92/ws/trunk/target/surefire/surefire5989543118210350556tmp> <https://builds.apache.org/job/HBase-0.92/ws/trunk/target/surefire/surefire2744689265161730985tmp>
Running org.apache.hadoop.hbase.regionserver.TestExplicitColumnTracker
Tests run: 4, Failures: 0, Errors: 0, Skipped: 0, Time elapsed: 0.893 sec
Forking command line: /bin/sh -c cd <https://builds.apache.org/job/HBase-0.92/ws/trunk> && /home/jenkins/tools/java/jdk1.6.0_27-32/jre/bin/java -enableassertions -Xmx1400m -Djava.security.egd=file:/dev/./urandom -jar <https://builds.apache.org/job/HBase-0.92/ws/trunk/target/surefire/surefirebooter7777553928929461472.jar> <https://builds.apache.org/job/HBase-0.92/ws/trunk/target/surefire/surefire6395727529817314429tmp> <https://builds.apache.org/job/HBase-0.92/ws/trunk/target/surefire/surefire6874020616891255595tmp>
Running org.apache.hadoop.hbase.regionserver.TestMemStore
Tests run: 21, Failures: 0, Errors: 0, Skipped: 0, Time elapsed: 27.616 sec
Forking command line: /bin/sh -c cd <https://builds.apache.org/job/HBase-0.92/ws/trunk> && /home/jenkins/tools/java/jdk1.6.0_27-32/jre/bin/java -enableassertions -Xmx1400m -Djava.security.egd=file:/dev/./urandom -jar <https://builds.apache.org/job/HBase-0.92/ws/trunk/target/surefire/surefirebooter1950826422060082153.jar> <https://builds.apache.org/job/HBase-0.92/ws/trunk/target/surefire/surefire1497547074163740514tmp> <https://builds.apache.org/job/HBase-0.92/ws/trunk/target/surefire/surefire5315338707952942131tmp>
Archiving artifacts
Running org.apache.hadoop.hbase.regionserver.TestEndToEndSplitTransaction
Updating HBASE-5209
Recording test results


Mime
View raw message