hbase-dev mailing list archives

Site index · List index
Message view « Date » · « Thread »
Top « Date » · « Thread »
From Stack <st...@duboce.net>
Subject Re: Build failed in Jenkins: hbase-0.90 #385
Date Fri, 13 Jan 2012 03:07:16 GMT
Ram:

Did you commits change TestZKBasedOpenCloseRegion?  Do all tests pass for you?

St.Ack

On Thu, Jan 12, 2012 at 6:48 PM, Apache Jenkins Server
<jenkins@builds.apache.org> wrote:
> See <https://builds.apache.org/job/hbase-0.90/385/>
>
> ------------------------------------------
> [...truncated 953 lines...]
> A         src/examples/mapreduce/index-builder-setup.rb
> A         src/examples/README.txt
> A         bin
> AU        bin/hbase-daemons.sh
> A         bin/rename_table.rb
> AU        bin/hbase
> A         bin/copy_table.rb
> A         bin/check_meta.rb
> AU        bin/start-hbase.sh
> A         bin/hirb.rb
> A         bin/set_meta_block_caching.rb
> A         bin/loadtable.rb
> AU        bin/hbase-daemon.sh
> A         bin/region_mover.rb
> A         bin/hbase-config.sh
> A         bin/local-regionservers.sh
> AU        bin/zookeepers.sh
> A         bin/local-master-backup.sh
> A         bin/add_table.rb
> AU        bin/rolling-restart.sh
> AU        bin/regionservers.sh
> A         bin/graceful_stop.sh
> AU        bin/master-backup.sh
> A         bin/set_meta_memstore_size.rb
> A         bin/replication
> A         bin/replication/copy_tables_desc.rb
> AU        bin/stop-hbase.sh
> A         pom.xml
> A         README.txt
>  U        .
> At revision 1230858
> no change for https://svn.apache.org/repos/asf/hbase/branches/0.90 since the previous
build
> [locks-and-latches] Checking to see if we really have the locks
> [locks-and-latches] Have all the locks, build can start
> [hbase-0.90] $ /bin/bash -xe /tmp/hudson801135815889179014.sh
> + hostname
> vesta.apache.org
> + ulimit -a
> core file size          (blocks, -c) 0
> data seg size           (kbytes, -d) unlimited
> scheduling priority             (-e) 20
> file size               (blocks, -f) unlimited
> pending signals                 (-i) 16382
> max locked memory       (kbytes, -l) 64
> max memory size         (kbytes, -m) unlimited
> open files                      (-n) 40000
> pipe size            (512 bytes, -p) 8
> POSIX message queues     (bytes, -q) 819200
> real-time priority              (-r) 0
> stack size              (kbytes, -s) 8192
> cpu time               (seconds, -t) unlimited
> max user processes              (-u) unlimited
> virtual memory          (kbytes, -v) unlimited
> file locks                      (-x) unlimited
> + jps
> 17483 JUnitTestRunner
> 32649 jar
> 1365 Main
> 25589 JUnitTestRunner
> 28557 JUnitTestRunner
> 26651 Main
> 3978 Maven3Main
> 3124 Maven3Main
> 24497 jar
> 20164 jar
> 27840 Jps
> 32394 jar
> 24670 Main
> 21441 jar
> [trunk] $ /home/hudson/tools/maven/latest3/bin/mvn clean -Dmaven.test.redirectTestOutputToFile=true
site assembly:assembly
> [INFO] Scanning for projects...
> [INFO]
> [INFO] ------------------------------------------------------------------------
> [INFO] Building HBase 0.90.6-SNAPSHOT
> [INFO] ------------------------------------------------------------------------
> [WARNING] The POM for javax.jms:jms:jar:1.1 is invalid, transitive dependencies (if any)
will not be available, enable debug logging for more details
> [WARNING] The POM for com.sun.jdmk:jmxtools:jar:1.2.1 is invalid, transitive dependencies
(if any) will not be available, enable debug logging for more details
> [WARNING] The POM for com.sun.jmx:jmxri:jar:1.2.1 is invalid, transitive dependencies
(if any) will not be available, enable debug logging for more details
> [INFO]
> [INFO] --- maven-clean-plugin:2.4.1:clean (default-clean) @ hbase ---
> [INFO]
> [INFO] --- xml-maven-plugin:1.0-beta-3:transform (default) @ hbase ---
> [INFO] Transforming file: <https://builds.apache.org/job/hbase-0.90/ws/trunk/src/main/resources/hbase-default.xml>
> [INFO] Transformed 1 file(s).
> [INFO]
> [INFO] --- docbkx-maven-plugin:2.0.11:generate-html (default) @ hbase ---
> [INFO] Processing input file: troubleshooting.xml
> [INFO] <https://builds.apache.org/job/hbase-0.90/385/artifact/trunk/target/site/troubleshooting.html>
has been generated.
> [INFO] Processing input file: configuration.xml
> [INFO] <https://builds.apache.org/job/hbase-0.90/385/artifact/trunk/target/site/configuration.html>
has been generated.
> [INFO] Processing input file: getting_started.xml
> [INFO] <https://builds.apache.org/job/hbase-0.90/385/artifact/trunk/target/site/getting_started.html>
has been generated.
> [INFO] Processing input file: book.xml
> [INFO] <https://builds.apache.org/job/hbase-0.90/385/artifact/trunk/target/site/book.html>
has been generated.
> [INFO] <https://builds.apache.org/job/hbase-0.90/385/artifact/trunk/target/site/shell.html>
is up to date.
> [INFO] <https://builds.apache.org/job/hbase-0.90/385/artifact/trunk/target/site/performance.html>
is up to date.
> [INFO] <https://builds.apache.org/job/hbase-0.90/385/artifact/trunk/target/site/upgrading.html>
is up to date.
> [INFO] <https://builds.apache.org/job/hbase-0.90/385/artifact/trunk/target/site/preface.html>
is up to date.
> [INFO] <https://builds.apache.org/job/hbase-0.90/385/artifact/trunk/target/site/build.html>
is up to date.
> [INFO] Processing input file: developer.xml
> [INFO] <https://builds.apache.org/job/hbase-0.90/385/artifact/trunk/target/site/developer.html>
has been generated.
> [INFO]
> [INFO] --- maven-site-plugin:2.0.1:site (default-site) @ hbase ---
> [INFO] Unable to load parent project from a relative path: 1 problem was encountered
while building the effective model
> [FATAL] Non-readable POM <https://builds.apache.org/job/hbase-0.90/ws/pom.xml>:
<https://builds.apache.org/job/hbase-0.90/ws/pom.xml> (No such file or directory) @
>  for project  at <https://builds.apache.org/job/hbase-0.90/ws/pom.xml> for project
 at <https://builds.apache.org/job/hbase-0.90/ws/pom.xml>
> [INFO] Parent project loaded from repository.
> [INFO] Unable to load parent project from a relative path: 1 problem was encountered
while building the effective model
> [FATAL] Non-readable POM <https://builds.apache.org/job/hbase-0.90/ws/pom.xml>:
<https://builds.apache.org/job/hbase-0.90/ws/pom.xml> (No such file or directory) @
>  for project  at <https://builds.apache.org/job/hbase-0.90/ws/pom.xml> for project
 at <https://builds.apache.org/job/hbase-0.90/ws/pom.xml>
> [INFO] Parent project loaded from repository.
> Downloading: http://repository.codehaus.org/org/apache/maven/skins/maven-stylus-skin/maven-metadata.xml
> Downloading: http://repo1.maven.org/maven2/org/apache/maven/skins/maven-stylus-skin/maven-metadata.xml
> Downloading: http://download.java.net/maven/2/org/apache/maven/skins/maven-stylus-skin/maven-metadata.xml
> Downloading: http://people.apache.org/~rawson/repo/org/apache/maven/skins/maven-stylus-skin/maven-metadata.xml
>
> 458 B
>
>
> Downloaded: http://repo1.maven.org/maven2/org/apache/maven/skins/maven-stylus-skin/maven-metadata.xml
(458 B at 1.0 KB/sec)
>
> [INFO]
> [INFO] ------------------------------------------------------------------------
> [INFO] Building HBase 0.90.6-SNAPSHOT
> [INFO] ------------------------------------------------------------------------
> [INFO]
> [INFO] >>> maven-assembly-plugin:2.2-beta-5:assembly (default-cli) @ hbase >>>
> [INFO]
> [INFO] --- maven-antrun-plugin:1.3:run (generate) @ hbase ---
> [INFO] Executing tasks
>    [mkdir] Created dir: <https://builds.apache.org/job/hbase-0.90/ws/trunk/target/hbase-webapps>
>     [copy] Copying 4 files to <https://builds.apache.org/job/hbase-0.90/ws/trunk/target/hbase-webapps>
> SLF4J: Failed to load class "org.slf4j.impl.StaticLoggerBinder".
> SLF4J: See http://www.slf4j.org/codes.html#StaticLoggerBinder for further details.
> 2012-01-13 02:09:46.695:INFO::Logging to STDERR via org.mortbay.log.StdErrLog
>    [mkdir] Created dir: <https://builds.apache.org/job/hbase-0.90/ws/trunk/target/hbase-webapps/master/WEB-INF>
>    [mkdir] Created dir: <https://builds.apache.org/job/hbase-0.90/ws/trunk/target/hbase-webapps/regionserver/WEB-INF>
> [INFO] Executed tasks
> [INFO]
> [INFO] --- build-helper-maven-plugin:1.5:add-source (add-jspc-source) @ hbase ---
> [INFO] Source directory: <https://builds.apache.org/job/hbase-0.90/ws/trunk/target/jspc>
added.
> [INFO]
> [INFO] --- build-helper-maven-plugin:1.5:add-source (add-package-info) @ hbase ---
> [INFO] Source directory: <https://builds.apache.org/job/hbase-0.90/ws/trunk/target/generated-sources>
added.
> [INFO]
> [INFO] --- maven-remote-resources-plugin:1.1:process (default) @ hbase ---
> [INFO] Setting property: classpath.resource.loader.class => 'org.codehaus.plexus.velocity.ContextClassLoaderResourceLoader'.
> [INFO] Setting property: velocimacro.messages.on => 'false'.
> [INFO] Setting property: resource.loader => 'classpath'.
> [INFO] Setting property: resource.manager.logwhenfound => 'false'.
> [INFO]
> [INFO] --- maven-resources-plugin:2.4:resources (default-resources) @ hbase ---
> [INFO] Using 'UTF-8' encoding to copy filtered resources.
> [INFO] Copying 1 resource
> [INFO] Copying 6 resources
> [INFO] Copying 3 resources
> [INFO]
> [INFO] --- maven-antrun-plugin:1.3:run (default) @ hbase ---
> [INFO] Executing tasks
> [INFO] Executed tasks
> [INFO]
> [INFO] --- maven-compiler-plugin:2.0.2:compile (default-compile) @ hbase ---
> [INFO] Compiling 471 source files to <https://builds.apache.org/job/hbase-0.90/ws/trunk/target/classes>
> [INFO]
> [INFO] --- maven-resources-plugin:2.4:testResources (default-testResources) @ hbase ---
> [INFO] Using 'UTF-8' encoding to copy filtered resources.
> [INFO] Copying 4 resources
> [INFO] Copying 3 resources
> [INFO]
> [INFO] --- maven-compiler-plugin:2.0.2:testCompile (default-testCompile) @ hbase ---
> [INFO] Compiling 203 source files to <https://builds.apache.org/job/hbase-0.90/ws/trunk/target/test-classes>
> [INFO]
> [INFO] --- maven-surefire-plugin:2.4.3:test (default-test) @ hbase ---
> [INFO] Surefire report directory: <https://builds.apache.org/job/hbase-0.90/ws/trunk/target/surefire-reports>
>
> -------------------------------------------------------
>  T E S T S
> -------------------------------------------------------
> Running org.apache.hadoop.hbase.master.TestHMasterRPCException
> Tests run: 1, Failures: 0, Errors: 0, Skipped: 0, Time elapsed: 0.981 sec
> Running org.apache.hadoop.hbase.regionserver.TestColumnSeeking
> Tests run: 2, Failures: 0, Errors: 0, Skipped: 0, Time elapsed: 3.687 sec
> Running org.apache.hadoop.hbase.client.TestMultipleTimestamps
> Tests run: 8, Failures: 0, Errors: 0, Skipped: 0, Time elapsed: 58.862 sec
> Running org.apache.hadoop.hbase.regionserver.TestMemStoreLAB
> Tests run: 3, Failures: 0, Errors: 0, Skipped: 0, Time elapsed: 1.364 sec
> Running org.apache.hadoop.hbase.TestZooKeeper
> Tests run: 5, Failures: 1, Errors: 1, Skipped: 0, Time elapsed: 104.536 sec <<<
FAILURE!
> Running org.apache.hadoop.hbase.regionserver.wal.TestLogRolling
> Tests run: 3, Failures: 0, Errors: 0, Skipped: 0, Time elapsed: 568.646 sec
> Running org.apache.hadoop.hbase.io.hfile.TestCachedBlockQueue
> Tests run: 2, Failures: 0, Errors: 0, Skipped: 0, Time elapsed: 0.017 sec
> Running org.apache.hadoop.hbase.filter.TestPrefixFilter
> Tests run: 3, Failures: 0, Errors: 0, Skipped: 0, Time elapsed: 0.018 sec
> Running org.apache.hadoop.hbase.io.TestImmutableBytesWritable
> Tests run: 3, Failures: 0, Errors: 0, Skipped: 0, Time elapsed: 0.017 sec
> Running org.apache.hadoop.hbase.io.TestHeapSize
> Tests run: 2, Failures: 0, Errors: 0, Skipped: 0, Time elapsed: 0.031 sec
> Running org.apache.hadoop.hbase.rest.model.TestRowModel
> Tests run: 2, Failures: 0, Errors: 0, Skipped: 0, Time elapsed: 0.032 sec
> Running org.apache.hadoop.hbase.io.hfile.TestHFileSeek
> Tests run: 1, Failures: 0, Errors: 0, Skipped: 0, Time elapsed: 4.741 sec
> Running org.apache.hadoop.hbase.regionserver.wal.TestLogRollAbort
> Tests run: 1, Failures: 0, Errors: 0, Skipped: 0, Time elapsed: 255.836 sec
> Running org.apache.hadoop.hbase.regionserver.TestStore
> Tests run: 9, Failures: 0, Errors: 0, Skipped: 0, Time elapsed: 0.765 sec
> Running org.apache.hadoop.hbase.zookeeper.TestHQuorumPeer
> Tests run: 3, Failures: 0, Errors: 0, Skipped: 0, Time elapsed: 0.371 sec
> Running org.apache.hadoop.hbase.regionserver.TestSplitTransactionOnCluster
> Tests run: 2, Failures: 0, Errors: 0, Skipped: 0, Time elapsed: 55.234 sec
> Running org.apache.hadoop.hbase.rest.TestScannersWithFilters
> Tests run: 10, Failures: 0, Errors: 0, Skipped: 0, Time elapsed: 21.22 sec
> Running org.apache.hadoop.hbase.io.hfile.TestHFilePerformance
> Tests run: 1, Failures: 0, Errors: 0, Skipped: 0, Time elapsed: 5.563 sec
> Running org.apache.hadoop.hbase.regionserver.TestResettingCounters
> Tests run: 1, Failures: 0, Errors: 0, Skipped: 0, Time elapsed: 0.185 sec
> Running org.apache.hadoop.hbase.regionserver.handler.TestOpenRegionHandler
> Tests run: 1, Failures: 0, Errors: 0, Skipped: 0, Time elapsed: 0.464 sec
> Running org.apache.hadoop.hbase.io.TestHbaseObjectWritable
> Tests run: 3, Failures: 0, Errors: 0, Skipped: 0, Time elapsed: 0.074 sec
> Running org.apache.hadoop.hbase.regionserver.wal.TestHLogSplit
> Tests run: 24, Failures: 0, Errors: 0, Skipped: 0, Time elapsed: 203.133 sec
> Running org.apache.hadoop.hbase.thrift.TestThriftServer
> Tests run: 1, Failures: 0, Errors: 0, Skipped: 0, Time elapsed: 33.368 sec
> Running org.apache.hadoop.hbase.regionserver.TestRpcMetrics
> Tests run: 1, Failures: 0, Errors: 0, Skipped: 0, Time elapsed: 1.179 sec
> Running org.apache.hadoop.hbase.filter.TestColumnPrefixFilter
> Tests run: 2, Failures: 0, Errors: 0, Skipped: 0, Time elapsed: 1.698 sec
> Running org.apache.hadoop.hbase.master.TestZKBasedOpenCloseRegion
> killed.
> [INFO] ------------------------------------------------------------------------
> [INFO] BUILD FAILURE
> [INFO] ------------------------------------------------------------------------
> [INFO] Total time: 38:40.387s
> [INFO] Finished at: Fri Jan 13 02:48:08 UTC 2012
> [INFO] Final Memory: 45M/648M
> [INFO] ------------------------------------------------------------------------
> [ERROR] Failed to execute goal org.apache.maven.plugins:maven-surefire-plugin:2.4.3:test
(default-test) on project hbase: Error while executing forked tests.; nested exception is
org.apache.maven.surefire.booter.shade.org.codehaus.plexus.util.cli.CommandLineException:
Error while executing external command, process killed. Process timeout out after 900 seconds
-> [Help 1]
> [ERROR]
> [ERROR] To see the full stack trace of the errors, re-run Maven with the -e switch.
> [ERROR] Re-run Maven using the -X switch to enable full debug logging.
> [ERROR]
> [ERROR] For more information about the errors and possible solutions, please read the
following articles:
> [ERROR] [Help 1] http://cwiki.apache.org/confluence/display/MAVEN/MojoExecutionException
> Build step 'Invoke top-level Maven targets' marked build as failure
> [locks-and-latches] Releasing all the locks
> [locks-and-latches] All the locks released
> Archiving artifacts
> Recording test results
>

Mime
View raw message