hbase-dev mailing list archives

Site index · List index
Message view « Date » · « Thread »
Top « Date » · « Thread »
From Apache Jenkins Server <jenk...@builds.apache.org>
Subject Build failed in Jenkins: hbase-0.90 #408
Date Sun, 22 Jan 2012 14:27:33 GMT
See <https://builds.apache.org/job/hbase-0.90/408/changes>

Changes:

[ramkrishna] HBASE-5235 HLogSplitter writer thread's streams not getting closed when any of
the writer threads has exceptions. (Ram)

------------------------------------------
[...truncated 1521 lines...]
Running org.apache.hadoop.hbase.master.TestMasterRestartAfterDisablingTable
Tests run: 1, Failures: 0, Errors: 0, Skipped: 0, Time elapsed: 17.708 sec
Running org.apache.hadoop.hbase.regionserver.TestFSErrorsExposed
Tests run: 3, Failures: 0, Errors: 0, Skipped: 0, Time elapsed: 26.358 sec
Running org.apache.hadoop.hbase.client.replication.TestReplicationAdmin
Tests run: 1, Failures: 0, Errors: 0, Skipped: 0, Time elapsed: 0.261 sec
Running org.apache.hadoop.hbase.regionserver.TestScanDeleteTracker
Tests run: 6, Failures: 0, Errors: 0, Skipped: 0, Time elapsed: 0.086 sec
Running org.apache.hadoop.hbase.client.TestMetaScanner
Tests run: 1, Failures: 0, Errors: 0, Skipped: 0, Time elapsed: 12.312 sec
Running org.apache.hadoop.hbase.metrics.TestMetricsMBeanBase
Tests run: 2, Failures: 0, Errors: 0, Skipped: 0, Time elapsed: 0.033 sec
Running org.apache.hadoop.hbase.TestRegionRebalancing
Tests run: 1, Failures: 0, Errors: 0, Skipped: 0, Time elapsed: 74.383 sec
Running org.apache.hadoop.hbase.filter.TestSingleColumnValueExcludeFilter
Tests run: 1, Failures: 0, Errors: 0, Skipped: 0, Time elapsed: 0.016 sec
Running org.apache.hadoop.hbase.filter.TestInclusiveStopFilter
Tests run: 2, Failures: 0, Errors: 0, Skipped: 0, Time elapsed: 0.017 sec
Running org.apache.hadoop.hbase.mapreduce.TestTableSplit
Tests run: 1, Failures: 0, Errors: 0, Skipped: 0, Time elapsed: 0.017 sec
Running org.apache.hadoop.hbase.rest.TestTableResource
Tests run: 8, Failures: 0, Errors: 0, Skipped: 0, Time elapsed: 43.908 sec
Running org.apache.hadoop.hbase.TestHBaseTestingUtility
Tests run: 5, Failures: 0, Errors: 0, Skipped: 0, Time elapsed: 44.743 sec
Running org.apache.hadoop.hbase.mapreduce.TestLoadIncrementalHFiles
Tests run: 5, Failures: 0, Errors: 0, Skipped: 0, Time elapsed: 50.615 sec
Running org.apache.hadoop.hbase.regionserver.wal.TestWALReplay
Tests run: 4, Failures: 0, Errors: 0, Skipped: 0, Time elapsed: 24.387 sec
Running org.apache.hadoop.hbase.rest.TestSchemaResource
Tests run: 2, Failures: 0, Errors: 0, Skipped: 0, Time elapsed: 21.914 sec
Running org.apache.hadoop.hbase.regionserver.TestKeyValueScanFixture
Tests run: 1, Failures: 0, Errors: 0, Skipped: 0, Time elapsed: 0.016 sec
Running org.apache.hadoop.hbase.rest.model.TestTableListModel
Tests run: 3, Failures: 0, Errors: 0, Skipped: 0, Time elapsed: 0.133 sec
Running org.apache.hadoop.hbase.rest.model.TestColumnSchemaModel
Tests run: 2, Failures: 0, Errors: 0, Skipped: 0, Time elapsed: 0.031 sec
Running org.apache.hadoop.hbase.regionserver.TestStoreFile
Tests run: 7, Failures: 0, Errors: 0, Skipped: 0, Time elapsed: 22.412 sec
Running org.apache.hadoop.hbase.zookeeper.TestZooKeeperNodeTracker
Tests run: 2, Failures: 0, Errors: 0, Skipped: 0, Time elapsed: 0.225 sec
Running org.apache.hadoop.hbase.regionserver.wal.TestHLogMethods
Tests run: 3, Failures: 0, Errors: 0, Skipped: 0, Time elapsed: 0.288 sec
Running org.apache.hadoop.hbase.rest.model.TestScannerModel
Tests run: 3, Failures: 0, Errors: 0, Skipped: 0, Time elapsed: 0.134 sec
Running org.apache.hadoop.hbase.regionserver.TestHRegionServerBulkLoad
Tests run: 1, Failures: 0, Errors: 0, Skipped: 0, Time elapsed: 77.413 sec
Running org.apache.hadoop.hbase.rest.TestVersionResource
Tests run: 7, Failures: 0, Errors: 0, Skipped: 0, Time elapsed: 15.877 sec
Running org.apache.hadoop.hbase.filter.TestFilter
Tests run: 18, Failures: 0, Errors: 0, Skipped: 0, Time elapsed: 1.436 sec
Running org.apache.hadoop.hbase.regionserver.TestWideScanner
Tests run: 1, Failures: 0, Errors: 0, Skipped: 0, Time elapsed: 15.079 sec
Running org.apache.hadoop.hbase.regionserver.TestSplitTransaction
Tests run: 6, Failures: 0, Errors: 0, Skipped: 0, Time elapsed: 2.71 sec
Running org.apache.hadoop.hbase.replication.regionserver.TestReplicationSink
Tests run: 5, Failures: 0, Errors: 0, Skipped: 0, Time elapsed: 18.95 sec
Running org.apache.hadoop.hbase.regionserver.TestGetClosestAtOrBefore
Tests run: 3, Failures: 0, Errors: 0, Skipped: 0, Time elapsed: 6.173 sec
Running org.apache.hadoop.hbase.regionserver.TestReadWriteConsistencyControl
Tests run: 1, Failures: 0, Errors: 0, Skipped: 0, Time elapsed: 10.021 sec
Running org.apache.hadoop.hbase.util.TestMergeTable
Tests run: 1, Failures: 0, Errors: 0, Skipped: 0, Time elapsed: 37.361 sec
Running org.apache.hadoop.hbase.rest.model.TestVersionModel
Tests run: 3, Failures: 0, Errors: 0, Skipped: 0, Time elapsed: 0.129 sec
Running org.apache.hadoop.hbase.rest.model.TestCellSetModel
Tests run: 3, Failures: 0, Errors: 0, Skipped: 0, Time elapsed: 0.136 sec
Running org.apache.hadoop.hbase.rest.client.TestRemoteTable
Tests run: 3, Failures: 0, Errors: 0, Skipped: 0, Time elapsed: 17.921 sec
Running org.apache.hadoop.hbase.rest.model.TestStorageClusterStatusModel
Tests run: 3, Failures: 0, Errors: 0, Skipped: 0, Time elapsed: 0.135 sec
Running org.apache.hadoop.hbase.avro.TestAvroServer
Tests run: 3, Failures: 0, Errors: 0, Skipped: 0, Time elapsed: 27.85 sec
Running org.apache.hadoop.hbase.TestFullLogReconstruction
Tests run: 1, Failures: 0, Errors: 0, Skipped: 0, Time elapsed: 50.599 sec
Running org.apache.hadoop.hbase.TestSerialization
Tests run: 19, Failures: 0, Errors: 0, Skipped: 0, Time elapsed: 0.06 sec
Running org.apache.hadoop.hbase.regionserver.TestKeyValueHeap
Tests run: 3, Failures: 0, Errors: 0, Skipped: 0, Time elapsed: 0.066 sec
Running org.apache.hadoop.hbase.regionserver.TestStoreScanner
Tests run: 14, Failures: 0, Errors: 0, Skipped: 0, Time elapsed: 0.034 sec
Running org.apache.hadoop.hbase.TestHMsg
Tests run: 2, Failures: 0, Errors: 0, Skipped: 0, Time elapsed: 0.022 sec
Running org.apache.hadoop.hbase.io.hfile.TestReseekTo
Tests run: 1, Failures: 0, Errors: 0, Skipped: 0, Time elapsed: 0.175 sec
Running org.apache.hadoop.hbase.mapreduce.TestLoadIncrementalHFilesSplitRecovery
Tests run: 4, Failures: 0, Errors: 0, Skipped: 0, Time elapsed: 23.308 sec
Running org.apache.hadoop.hbase.regionserver.TestHRegionInfo
Tests run: 2, Failures: 0, Errors: 0, Skipped: 0, Time elapsed: 0.018 sec
Running org.apache.hadoop.hbase.regionserver.TestScanner
Tests run: 6, Failures: 0, Errors: 0, Skipped: 0, Time elapsed: 49.028 sec
Running org.apache.hadoop.hbase.util.TestIncrementingEnvironmentEdge
Tests run: 1, Failures: 0, Errors: 0, Skipped: 0, Time elapsed: 0.017 sec
Running org.apache.hadoop.hbase.util.TestKeying
Tests run: 1, Failures: 0, Errors: 0, Skipped: 0, Time elapsed: 0.018 sec
Running org.apache.hadoop.hbase.util.TestHBaseFsck
Tests run: 5, Failures: 0, Errors: 0, Skipped: 0, Time elapsed: 32.869 sec
Running org.apache.hadoop.hbase.master.TestRestartCluster
Tests run: 2, Failures: 0, Errors: 0, Skipped: 0, Time elapsed: 39.464 sec
Running org.apache.hadoop.hbase.client.TestShell
Tests run: 1, Failures: 0, Errors: 0, Skipped: 0, Time elapsed: 71.635 sec
Running org.apache.hadoop.hbase.rest.model.TestTableInfoModel
Tests run: 3, Failures: 0, Errors: 0, Skipped: 0, Time elapsed: 0.132 sec
Running org.apache.hadoop.hbase.TestInfoServers
Tests run: 1, Failures: 0, Errors: 0, Skipped: 0, Time elapsed: 12.222 sec
Running org.apache.hadoop.hbase.master.TestLogsCleaner
Tests run: 1, Failures: 0, Errors: 0, Skipped: 0, Time elapsed: 0.485 sec
Running org.apache.hadoop.hbase.regionserver.TestMasterAddressManager
Tests run: 1, Failures: 0, Errors: 0, Skipped: 0, Time elapsed: 0.194 sec
Running org.apache.hadoop.hbase.catalog.TestCatalogTrackerOnCluster
Tests run: 1, Failures: 0, Errors: 0, Skipped: 0, Time elapsed: 204.709 sec
Running org.apache.hadoop.hbase.regionserver.TestQueryMatcher
Tests run: 4, Failures: 0, Errors: 0, Skipped: 0, Time elapsed: 0.075 sec
Running org.apache.hadoop.hbase.zookeeper.TestZKTable
Tests run: 1, Failures: 0, Errors: 0, Skipped: 0, Time elapsed: 0.194 sec
Running org.apache.hadoop.hbase.client.TestAdmin
Tests run: 24, Failures: 0, Errors: 0, Skipped: 0, Time elapsed: 206.991 sec
Running org.apache.hadoop.hbase.util.TestMergeTool
Tests run: 1, Failures: 0, Errors: 0, Skipped: 0, Time elapsed: 16.539 sec
Running org.apache.hadoop.hbase.regionserver.TestPriorityCompactionQueue
Tests run: 1, Failures: 0, Errors: 0, Skipped: 0, Time elapsed: 1.072 sec
Running org.apache.hadoop.hbase.TestAcidGuarantees
Tests run: 3, Failures: 0, Errors: 0, Skipped: 3, Time elapsed: 0.016 sec
Running org.apache.hadoop.hbase.util.TestBase64
Tests run: 1, Failures: 0, Errors: 0, Skipped: 0, Time elapsed: 0.017 sec
Running org.apache.hadoop.hbase.regionserver.TestMemStore
Tests run: 21, Failures: 0, Errors: 0, Skipped: 0, Time elapsed: 52.589 sec
Running org.apache.hadoop.hbase.rest.TestScannerResource
Tests run: 5, Failures: 0, Errors: 0, Skipped: 0, Time elapsed: 37.908 sec
Running org.apache.hadoop.hbase.io.hfile.TestLruBlockCache
Tests run: 7, Failures: 0, Errors: 0, Skipped: 0, Time elapsed: 1.051 sec
Running org.apache.hadoop.hbase.master.TestDeadServer
Tests run: 1, Failures: 0, Errors: 0, Skipped: 0, Time elapsed: 0.02 sec
Running org.apache.hadoop.hbase.rest.TestGzipFilter
Tests run: 3, Failures: 0, Errors: 0, Skipped: 0, Time elapsed: 16.945 sec
Running org.apache.hadoop.hbase.TestKeyValue
Tests run: 11, Failures: 0, Errors: 0, Skipped: 0, Time elapsed: 0.026 sec
Running org.apache.hadoop.hbase.mapreduce.TestTableMapReduce
Tests run: 2, Failures: 0, Errors: 0, Skipped: 0, Time elapsed: 51.413 sec
Running org.apache.hadoop.hbase.client.TestMultiParallel
Tests run: 10, Failures: 0, Errors: 0, Skipped: 0, Time elapsed: 23.063 sec
Running org.apache.hadoop.hbase.master.TestMaster
Tests run: 1, Failures: 0, Errors: 0, Skipped: 0, Time elapsed: 73.276 sec
Running org.apache.hadoop.hbase.master.TestRollingRestart
Tests run: 1, Failures: 0, Errors: 0, Skipped: 0, Time elapsed: 56.621 sec
Running org.apache.hadoop.hbase.client.TestResult
Tests run: 3, Failures: 0, Errors: 0, Skipped: 0, Time elapsed: 0.04 sec
Running org.apache.hadoop.hbase.client.TestHTablePool
Tests run: 5, Failures: 0, Errors: 0, Skipped: 0, Time elapsed: 16.264 sec
Running org.apache.hadoop.hbase.master.TestOpenedRegionHandler
Tests run: 2, Failures: 0, Errors: 0, Skipped: 0, Time elapsed: 18.046 sec
Running org.apache.hadoop.hbase.util.TestByteBloomFilter
Tests run: 3, Failures: 0, Errors: 0, Skipped: 0, Time elapsed: 1.655 sec
Running org.apache.hadoop.hbase.rest.model.TestTableSchemaModel
Tests run: 3, Failures: 0, Errors: 0, Skipped: 0, Time elapsed: 0.135 sec
Running org.apache.hadoop.hbase.filter.TestFilterList
Tests run: 4, Failures: 0, Errors: 0, Skipped: 0, Time elapsed: 0.041 sec
Running org.apache.hadoop.hbase.mapreduce.TestTableInputFormatScan
Tests run: 11, Failures: 0, Errors: 0, Skipped: 0, Time elapsed: 311.978 sec
Running org.apache.hadoop.hbase.regionserver.TestHRegion
Tests run: 54, Failures: 1, Errors: 0, Skipped: 0, Time elapsed: 10.468 sec <<< FAILURE!
Running org.apache.hadoop.hbase.master.TestMasterFailover
Tests run: 4, Failures: 0, Errors: 0, Skipped: 0, Time elapsed: 68.667 sec
Running org.apache.hadoop.hbase.rest.model.TestTableRegionModel
Tests run: 4, Failures: 0, Errors: 0, Skipped: 0, Time elapsed: 0.033 sec
Running org.apache.hadoop.hbase.client.TestTimestampsFilter
Tests run: 3, Failures: 0, Errors: 0, Skipped: 0, Time elapsed: 26.851 sec
Running org.apache.hadoop.hbase.master.TestLoadBalancer
Tests run: 5, Failures: 0, Errors: 0, Skipped: 0, Time elapsed: 2.194 sec
Running org.apache.hadoop.hbase.util.TestRootPath
Tests run: 1, Failures: 0, Errors: 0, Skipped: 0, Time elapsed: 0.022 sec
Running org.apache.hadoop.hbase.mapred.TestTableMapReduce
Tests run: 1, Failures: 0, Errors: 0, Skipped: 0, Time elapsed: 31.409 sec
Running org.apache.hadoop.hbase.regionserver.wal.TestWALObserver
Tests run: 1, Failures: 0, Errors: 0, Skipped: 0, Time elapsed: 0.159 sec
Running org.apache.hadoop.hbase.client.TestScannerTimeout
Tests run: 4, Failures: 0, Errors: 0, Skipped: 0, Time elapsed: 44.691 sec
Running org.apache.hadoop.hbase.master.TestActiveMasterManager
Tests run: 2, Failures: 0, Errors: 0, Skipped: 0, Time elapsed: 0.24 sec
Running org.apache.hadoop.hbase.replication.regionserver.TestReplicationSourceManager
Tests run: 1, Failures: 0, Errors: 0, Skipped: 0, Time elapsed: 0.352 sec
Running org.apache.hadoop.hbase.util.TestBytes
Tests run: 10, Failures: 0, Errors: 0, Skipped: 0, Time elapsed: 0.024 sec
Running org.apache.hadoop.hbase.util.TestCompressionTest
Tests run: 1, Failures: 0, Errors: 0, Skipped: 0, Time elapsed: 0.025 sec
Running org.apache.hadoop.hbase.filter.TestDependentColumnFilter
Tests run: 2, Failures: 0, Errors: 0, Skipped: 0, Time elapsed: 0.211 sec
Running org.apache.hadoop.hbase.client.TestGetRowVersions
Tests run: 1, Failures: 0, Errors: 0, Skipped: 0, Time elapsed: 22.445 sec
Running org.apache.hadoop.hbase.rest.model.TestCellModel
Tests run: 3, Failures: 0, Errors: 0, Skipped: 0, Time elapsed: 0.129 sec
Running org.apache.hadoop.hbase.master.TestCatalogJanitor
Tests run: 2, Failures: 0, Errors: 0, Skipped: 0, Time elapsed: 0.353 sec
Running org.apache.hadoop.hbase.replication.TestReplicationSource
Tests run: 1, Failures: 0, Errors: 0, Skipped: 0, Time elapsed: 38.3 sec
Running org.apache.hadoop.hbase.catalog.TestCatalogTracker
Tests run: 8, Failures: 0, Errors: 0, Skipped: 0, Time elapsed: 2.658 sec
Running org.apache.hadoop.hbase.util.TestRegionSplitCalculator
Tests run: 14, Failures: 0, Errors: 0, Skipped: 0, Time elapsed: 0.056 sec
Running org.apache.hadoop.hbase.rest.TestRowResource
Tests run: 11, Failures: 0, Errors: 0, Skipped: 0, Time elapsed: 18.939 sec
Running org.apache.hadoop.hbase.io.hfile.TestHFile
Tests run: 7, Failures: 0, Errors: 0, Skipped: 0, Time elapsed: 0.2 sec
Running org.apache.hadoop.hbase.catalog.TestMetaReaderEditor
Tests run: 4, Failures: 0, Errors: 0, Skipped: 0, Time elapsed: 18.274 sec
Running org.apache.hadoop.hbase.mapreduce.TestImportTsv
Tests run: 7, Failures: 0, Errors: 0, Skipped: 0, Time elapsed: 15.558 sec
Running org.apache.hadoop.hbase.util.TestHBaseFsckComparator
Tests run: 7, Failures: 0, Errors: 0, Skipped: 0, Time elapsed: 0.168 sec
Running org.apache.hadoop.hbase.rest.client.TestRemoteAdmin
Tests run: 2, Failures: 0, Errors: 0, Skipped: 0, Time elapsed: 18.97 sec
Running org.apache.hadoop.hbase.regionserver.wal.TestHLog
Tests run: 8, Failures: 0, Errors: 0, Skipped: 0, Time elapsed: 67.659 sec
Running org.apache.hadoop.hbase.client.TestTimestamp
Tests run: 1, Failures: 0, Errors: 0, Skipped: 0, Time elapsed: 13.141 sec
Running org.apache.hadoop.hbase.TestScanMultipleVersions
Tests run: 1, Failures: 0, Errors: 0, Skipped: 0, Time elapsed: 28.04 sec
Running org.apache.hadoop.hbase.rest.model.TestStorageClusterVersionModel
Tests run: 2, Failures: 0, Errors: 0, Skipped: 0, Time elapsed: 0.031 sec
Running org.apache.hadoop.hbase.client.TestHCM
Tests run: 4, Failures: 0, Errors: 0, Skipped: 0, Time elapsed: 26.274 sec

Results :

Failed tests: 

Tests run: 703, Failures: 1, Errors: 0, Skipped: 9

[INFO] ------------------------------------------------------------------------
[INFO] BUILD FAILURE
[INFO] ------------------------------------------------------------------------
[INFO] Total time: 1:11:53.024s
[INFO] Finished at: Sun Jan 22 14:26:37 UTC 2012
[INFO] Final Memory: 36M/457M
[INFO] ------------------------------------------------------------------------
[ERROR] Failed to execute goal org.apache.maven.plugins:maven-surefire-plugin:2.4.3:test (default-test)
on project hbase: There are test failures.
[ERROR] 
[ERROR] Please refer to <https://builds.apache.org/job/hbase-0.90/ws/trunk/target/surefire-reports>
for the individual test results.
[ERROR] -> [Help 1]
[ERROR] 
[ERROR] To see the full stack trace of the errors, re-run Maven with the -e switch.
[ERROR] Re-run Maven using the -X switch to enable full debug logging.
[ERROR] 
[ERROR] For more information about the errors and possible solutions, please read the following
articles:
[ERROR] [Help 1] http://cwiki.apache.org/confluence/display/MAVEN/MojoFailureException
Build step 'Invoke top-level Maven targets' marked build as failure
[locks-and-latches] Releasing all the locks
[locks-and-latches] All the locks released
Archiving artifacts
Recording test results


Mime
View raw message