hbase-dev mailing list archives

Site index · List index
Message view « Date » · « Thread »
Top « Date » · « Thread »
From Apache Jenkins Server <jenk...@builds.apache.org>
Subject Build failed in Jenkins: HBase-TRUNK-security #61
Date Mon, 02 Jan 2012 05:42:54 GMT
See <https://builds.apache.org/job/HBase-TRUNK-security/61/changes>

Changes:

[tedyu] HBASE-5064 Addendum increases number of parallel processes to 4

------------------------------------------
[...truncated 1974 lines...]
Tests run: 1, Failures: 0, Errors: 0, Skipped: 0, Time elapsed: 35.179 sec
Running org.apache.hadoop.hbase.util.hbck.TestOfflineMetaRebuildOverlap
Tests run: 1, Failures: 0, Errors: 0, Skipped: 0, Time elapsed: 27.852 sec
Running org.apache.hadoop.hbase.util.TestPoolMap$TestRoundRobinPoolType
Tests run: 3, Failures: 0, Errors: 0, Skipped: 0, Time elapsed: 0.01 sec
Running org.apache.hadoop.hbase.util.TestPoolMap$TestThreadLocalPoolType
Tests run: 3, Failures: 0, Errors: 0, Skipped: 0, Time elapsed: 0.007 sec
Running org.apache.hadoop.hbase.util.TestPoolMap$TestReusablePoolType
Tests run: 3, Failures: 0, Errors: 0, Skipped: 0, Time elapsed: 0.033 sec
Running org.apache.hadoop.hbase.util.hbck.TestOfflineMetaRebuildBase
Tests run: 1, Failures: 0, Errors: 0, Skipped: 0, Time elapsed: 27.238 sec
Running org.apache.hadoop.hbase.util.hbck.TestOfflineMetaRebuildHole
Tests run: 1, Failures: 0, Errors: 0, Skipped: 0, Time elapsed: 25.299 sec
Running org.apache.hadoop.hbase.util.TestDefaultEnvironmentEdge
Tests run: 1, Failures: 0, Errors: 0, Skipped: 0, Time elapsed: 0.199 sec
Running org.apache.hadoop.hbase.util.TestIdLock
Tests run: 1, Failures: 0, Errors: 0, Skipped: 0, Time elapsed: 15.318 sec
Running org.apache.hadoop.hbase.util.TestFSTableDescriptors
Tests run: 10, Failures: 0, Errors: 0, Skipped: 0, Time elapsed: 0.898 sec
Running org.apache.hadoop.hbase.util.TestEnvironmentEdgeManager
Tests run: 2, Failures: 0, Errors: 0, Skipped: 0, Time elapsed: 0.389 sec
Running org.apache.hadoop.hbase.util.TestMiniClusterLoadParallel
Tests run: 2, Failures: 0, Errors: 0, Skipped: 0, Time elapsed: 149.316 sec
Running org.apache.hadoop.hbase.util.TestMiniClusterLoadSequential
Tests run: 2, Failures: 0, Errors: 0, Skipped: 0, Time elapsed: 184.439 sec
Running org.apache.hadoop.hbase.util.TestHBaseFsck
Tests run: 6, Failures: 0, Errors: 0, Skipped: 0, Time elapsed: 178.592 sec
Running org.apache.hadoop.hbase.mapred.TestTableInputFormat
Tests run: 6, Failures: 0, Errors: 0, Skipped: 0, Time elapsed: 27.818 sec
Running org.apache.hadoop.hbase.util.TestRegionSplitter
Tests run: 5, Failures: 0, Errors: 0, Skipped: 0, Time elapsed: 45.234 sec
Running org.apache.hadoop.hbase.regionserver.TestStore
Tests run: 11, Failures: 0, Errors: 0, Skipped: 0, Time elapsed: 1.327 sec
Running org.apache.hadoop.hbase.regionserver.TestStoreFileBlockCacheSummary
Tests run: 1, Failures: 0, Errors: 0, Skipped: 0, Time elapsed: 19.057 sec
Running org.apache.hadoop.hbase.mapred.TestTableMapReduce
Tests run: 1, Failures: 0, Errors: 0, Skipped: 0, Time elapsed: 70.514 sec
Running org.apache.hadoop.hbase.regionserver.handler.TestOpenRegionHandler
Tests run: 3, Failures: 0, Errors: 0, Skipped: 0, Time elapsed: 1.248 sec
Running org.apache.hadoop.hbase.regionserver.handler.TestCloseRegionHandler
Tests run: 1, Failures: 0, Errors: 0, Skipped: 0, Time elapsed: 0.895 sec
Running org.apache.hadoop.hbase.regionserver.TestParallelPut
Tests run: 2, Failures: 0, Errors: 0, Skipped: 0, Time elapsed: 5.702 sec
Running org.apache.hadoop.hbase.regionserver.TestRegionServerMetrics
Tests run: 1, Failures: 0, Errors: 0, Skipped: 0, Time elapsed: 46.604 sec
Running org.apache.hadoop.hbase.regionserver.TestAtomicOperation
Tests run: 3, Failures: 0, Errors: 0, Skipped: 0, Time elapsed: 7.659 sec
Running org.apache.hadoop.hbase.regionserver.TestBlocksRead
Tests run: 4, Failures: 0, Errors: 0, Skipped: 0, Time elapsed: 0.907 sec
Running org.apache.hadoop.hbase.regionserver.TestMasterAddressManager
Tests run: 1, Failures: 0, Errors: 0, Skipped: 0, Time elapsed: 0.859 sec
Running org.apache.hadoop.hbase.regionserver.TestSplitTransactionOnCluster
Tests run: 4, Failures: 0, Errors: 0, Skipped: 0, Time elapsed: 54.088 sec
Running org.apache.hadoop.hbase.regionserver.TestServerCustomProtocol
Tests run: 7, Failures: 0, Errors: 0, Skipped: 0, Time elapsed: 20.492 sec
Running org.apache.hadoop.hbase.regionserver.wal.TestHLogBench
Tests run: 1, Failures: 0, Errors: 0, Skipped: 0, Time elapsed: 1.327 sec
Running org.apache.hadoop.hbase.regionserver.wal.TestWALReplay
Tests run: 5, Failures: 0, Errors: 0, Skipped: 0, Time elapsed: 41.904 sec
Running org.apache.hadoop.hbase.regionserver.wal.TestHLog
Tests run: 9, Failures: 0, Errors: 0, Skipped: 0, Time elapsed: 68.314 sec
Running org.apache.hadoop.hbase.util.TestMergeTool
Tests run: 1, Failures: 0, Errors: 0, Skipped: 0, Time elapsed: 409.533 sec
Running org.apache.hadoop.hbase.regionserver.wal.TestLogRollAbort
Tests run: 1, Failures: 0, Errors: 0, Skipped: 0, Time elapsed: 157.21 sec
Running org.apache.hadoop.hbase.regionserver.TestRpcMetrics
Tests run: 1, Failures: 0, Errors: 0, Skipped: 0, Time elapsed: 1.745 sec
Running org.apache.hadoop.hbase.regionserver.TestStoreScanner
Tests run: 16, Failures: 0, Errors: 0, Skipped: 0, Time elapsed: 0.063 sec
Running org.apache.hadoop.hbase.regionserver.TestSeekOptimizations
Tests run: 6, Failures: 0, Errors: 0, Skipped: 0, Time elapsed: 2.909 sec
Running org.apache.hadoop.hbase.regionserver.metrics.TestSchemaMetrics
Tests run: 6, Failures: 0, Errors: 0, Skipped: 0, Time elapsed: 15.143 sec
Running org.apache.hadoop.hbase.regionserver.TestFSErrorsExposed
Tests run: 3, Failures: 0, Errors: 0, Skipped: 0, Time elapsed: 31.376 sec
Running org.apache.hadoop.hbase.regionserver.TestSplitLogWorker
Tests run: 5, Failures: 0, Errors: 0, Skipped: 0, Time elapsed: 2.976 sec
Running org.apache.hadoop.hbase.regionserver.TestHRegionServerBulkLoad
Tests run: 1, Failures: 0, Errors: 0, Skipped: 0, Time elapsed: 47.386 sec
Running org.apache.hadoop.hbase.regionserver.TestMultiColumnScanner
Tests run: 6, Failures: 0, Errors: 0, Skipped: 0, Time elapsed: 21.538 sec
Running org.apache.hadoop.hbase.regionserver.wal.TestLogRolling
Tests run: 3, Failures: 0, Errors: 0, Skipped: 0, Time elapsed: 309.004 sec
Running org.apache.hadoop.hbase.regionserver.TestHRegion
Tests run: 61, Failures: 0, Errors: 0, Skipped: 0, Time elapsed: 35.517 sec
Running org.apache.hadoop.hbase.client.replication.TestReplicationAdmin
Tests run: 1, Failures: 0, Errors: 0, Skipped: 0, Time elapsed: 1.146 sec
Running org.apache.hadoop.hbase.regionserver.TestEndToEndSplitTransaction
Tests run: 1, Failures: 0, Errors: 0, Skipped: 0, Time elapsed: 46.567 sec
Running org.apache.hadoop.hbase.client.TestTimestampsFilter
Tests run: 3, Failures: 0, Errors: 0, Skipped: 0, Time elapsed: 25.725 sec
Running org.apache.hadoop.hbase.client.TestMultipleTimestamps
Tests run: 8, Failures: 0, Errors: 0, Skipped: 0, Time elapsed: 37.47 sec
Running org.apache.hadoop.hbase.regionserver.wal.TestHLogSplit
Tests run: 30, Failures: 0, Errors: 0, Skipped: 1, Time elapsed: 266 sec
Running org.apache.hadoop.hbase.client.TestHCM
Tests run: 5, Failures: 0, Errors: 0, Skipped: 0, Time elapsed: 21.829 sec
Running org.apache.hadoop.hbase.client.TestHTablePool$TestHTableReusablePool
Tests run: 9, Failures: 0, Errors: 0, Skipped: 0, Time elapsed: 5.331 sec
Running org.apache.hadoop.hbase.client.TestHTablePool$TestHTableThreadLocalPool
Tests run: 9, Failures: 0, Errors: 0, Skipped: 0, Time elapsed: 27.95 sec
Running org.apache.hadoop.hbase.client.TestInstantSchemaChangeFailover
Tests run: 4, Failures: 0, Errors: 0, Skipped: 1, Time elapsed: 167.699 sec
Running org.apache.hadoop.hbase.client.TestHTableUtil
Tests run: 2, Failures: 0, Errors: 0, Skipped: 0, Time elapsed: 19.236 sec
Running org.apache.hadoop.hbase.client.TestInstantSchemaChangeSplit
Tests run: 3, Failures: 0, Errors: 0, Skipped: 0, Time elapsed: 173.254 sec
Running org.apache.hadoop.hbase.client.TestFromClientSide
Tests run: 50, Failures: 0, Errors: 0, Skipped: 3, Time elapsed: 188.013 sec
Running org.apache.hadoop.hbase.client.TestMetaScanner
Tests run: 1, Failures: 0, Errors: 0, Skipped: 0, Time elapsed: 17.431 sec
Running org.apache.hadoop.hbase.client.TestScannerTimeout
Tests run: 4, Failures: 0, Errors: 0, Skipped: 0, Time elapsed: 51.117 sec
Running org.apache.hadoop.hbase.client.TestMetaMigrationRemovingHTD
Tests run: 3, Failures: 0, Errors: 0, Skipped: 0, Time elapsed: 31.642 sec
Running org.apache.hadoop.hbase.client.TestShell
Tests run: 1, Failures: 0, Errors: 0, Skipped: 0, Time elapsed: 110.34 sec
Running org.apache.hadoop.hbase.client.TestMultiParallel
Tests run: 10, Failures: 0, Errors: 0, Skipped: 0, Time elapsed: 45.528 sec
Running org.apache.hadoop.hbase.TestMultiVersions
Tests run: 3, Failures: 0, Errors: 0, Skipped: 0, Time elapsed: 37.887 sec
Running org.apache.hadoop.hbase.client.TestInstantSchemaChange
Tests run: 10, Failures: 0, Errors: 0, Skipped: 0, Time elapsed: 258.321 sec
Running org.apache.hadoop.hbase.thrift.TestThriftServer
Tests run: 1, Failures: 0, Errors: 0, Skipped: 0, Time elapsed: 20.789 sec
Running org.apache.hadoop.hbase.master.TestActiveMasterManager
Tests run: 2, Failures: 0, Errors: 0, Skipped: 0, Time elapsed: 1.053 sec
Running org.apache.hadoop.hbase.master.TestDeadServer
Tests run: 1, Failures: 0, Errors: 0, Skipped: 0, Time elapsed: 0.2 sec
Running org.apache.hadoop.hbase.master.TestLogsCleaner
Tests run: 1, Failures: 0, Errors: 0, Skipped: 0, Time elapsed: 3.541 sec
Running org.apache.hadoop.hbase.client.TestAdmin
Tests run: 34, Failures: 0, Errors: 1, Skipped: 0, Time elapsed: 239.137 sec <<<
FAILURE!
Running org.apache.hadoop.hbase.master.TestZKBasedOpenCloseRegion
Tests run: 3, Failures: 0, Errors: 0, Skipped: 0, Time elapsed: 30.456 sec
Running org.apache.hadoop.hbase.master.TestMaster
Tests run: 1, Failures: 0, Errors: 0, Skipped: 0, Time elapsed: 18.945 sec
Running org.apache.hadoop.hbase.master.TestRollingRestart
Tests run: 1, Failures: 0, Errors: 0, Skipped: 0, Time elapsed: 58.285 sec
Running org.apache.hadoop.hbase.master.TestClockSkewDetection
Tests run: 1, Failures: 0, Errors: 0, Skipped: 0, Time elapsed: 0.278 sec
Running org.apache.hadoop.hbase.master.TestOpenedRegionHandler
Tests run: 2, Failures: 0, Errors: 0, Skipped: 0, Time elapsed: 17.494 sec
Running org.apache.hadoop.hbase.master.TestMasterTransitions
Tests run: 3, Failures: 0, Errors: 0, Skipped: 3, Time elapsed: 25.632 sec
Running org.apache.hadoop.hbase.thrift.TestThriftServerCmdLine
Tests run: 16, Failures: 0, Errors: 0, Skipped: 0, Time elapsed: 90.32 sec
Running org.apache.hadoop.hbase.master.TestDefaultLoadBalancer
Tests run: 4, Failures: 0, Errors: 0, Skipped: 0, Time elapsed: 1.452 sec
Running org.apache.hadoop.hbase.master.TestSplitLogManager
Tests run: 10, Failures: 0, Errors: 0, Skipped: 0, Time elapsed: 15.434 sec
Running org.apache.hadoop.hbase.master.TestMasterStatusServlet
Tests run: 5, Failures: 0, Errors: 0, Skipped: 0, Time elapsed: 1.057 sec
Running org.apache.hadoop.hbase.master.TestHMasterRPCException
Tests run: 1, Failures: 0, Errors: 0, Skipped: 0, Time elapsed: 1.346 sec
Running org.apache.hadoop.hbase.master.TestMasterRestartAfterDisablingTable
Tests run: 1, Failures: 0, Errors: 0, Skipped: 0, Time elapsed: 21.276 sec
Running org.apache.hadoop.hbase.master.TestMasterZKSessionRecovery
Tests run: 2, Failures: 0, Errors: 0, Skipped: 0, Time elapsed: 25.738 sec
Running org.apache.hadoop.hbase.master.TestRestartCluster
Tests run: 2, Failures: 0, Errors: 0, Skipped: 0, Time elapsed: 38.89 sec
Running org.apache.hadoop.hbase.master.TestMasterFailover
Tests run: 4, Failures: 0, Errors: 0, Skipped: 0, Time elapsed: 84.432 sec
Running org.apache.hadoop.hbase.avro.TestAvroServer
Tests run: 3, Failures: 0, Errors: 0, Skipped: 0, Time elapsed: 31.848 sec
Running org.apache.hadoop.hbase.TestRegionRebalancing
Tests run: 1, Failures: 0, Errors: 0, Skipped: 0, Time elapsed: 88.653 sec
Running org.apache.hadoop.hbase.master.TestDistributedLogSplitting
Tests run: 4, Failures: 0, Errors: 0, Skipped: 0, Time elapsed: 158.312 sec
Running org.apache.hadoop.hbase.ipc.TestDelayedRpc
Tests run: 4, Failures: 0, Errors: 0, Skipped: 0, Time elapsed: 2.315 sec
Running org.apache.hadoop.hbase.TestZooKeeper
Tests run: 7, Failures: 0, Errors: 0, Skipped: 0, Time elapsed: 47.376 sec
Running org.apache.hadoop.hbase.thrift2.TestThriftHBaseServiceHandler
Tests run: 11, Failures: 0, Errors: 0, Skipped: 0, Time elapsed: 14.636 sec
Running org.apache.hadoop.hbase.TestInfoServers
Tests run: 2, Failures: 0, Errors: 0, Skipped: 0, Time elapsed: 13.96 sec
Running org.apache.hadoop.hbase.TestAcidGuarantees
Tests run: 3, Failures: 0, Errors: 0, Skipped: 0, Time elapsed: 105.908 sec

Results :

Failed tests:   testClassLoadingFromLocalFS(org.apache.hadoop.hbase.coprocessor.TestClassLoading):
Class TestCP3 was missing on a region

Tests in error: 
  testDeleteEditUnknownColumnFamilyAndOrTable(org.apache.hadoop.hbase.client.TestAdmin): org.apache.hadoop.hbase.TableNotEnabledException:
t

Tests run: 791, Failures: 1, Errors: 1, Skipped: 10

[INFO] ------------------------------------------------------------------------
[INFO] BUILD FAILURE
[INFO] ------------------------------------------------------------------------
[INFO] Total time: 35:54.622s
[INFO] Finished at: Mon Jan 02 05:41:28 UTC 2012
[INFO] Final Memory: 46M/819M
[INFO] ------------------------------------------------------------------------
[ERROR] Failed to execute goal org.apache.maven.plugins:maven-surefire-plugin:2.12-TRUNK-HBASE-2:test
(secondPartTestsExecution) on project hbase: There are test failures.
[ERROR] 
[ERROR] Please refer to <https://builds.apache.org/job/HBase-TRUNK-security/ws/trunk/target/surefire-reports>
for the individual test results.
[ERROR] -> [Help 1]
org.apache.maven.lifecycle.LifecycleExecutionException: Failed to execute goal org.apache.maven.plugins:maven-surefire-plugin:2.12-TRUNK-HBASE-2:test
(secondPartTestsExecution) on project hbase: There are test failures.

Please refer to <https://builds.apache.org/job/HBase-TRUNK-security/ws/trunk/target/surefire-reports>
for the individual test results.
	at org.apache.maven.lifecycle.internal.MojoExecutor.execute(MojoExecutor.java:213)
	at org.apache.maven.lifecycle.internal.MojoExecutor.execute(MojoExecutor.java:153)
	at org.apache.maven.lifecycle.internal.MojoExecutor.execute(MojoExecutor.java:145)
	at org.apache.maven.lifecycle.internal.MojoExecutor.executeForkedExecutions(MojoExecutor.java:365)
	at org.apache.maven.lifecycle.internal.MojoExecutor.execute(MojoExecutor.java:199)
	at org.apache.maven.lifecycle.internal.MojoExecutor.execute(MojoExecutor.java:153)
	at org.apache.maven.lifecycle.internal.MojoExecutor.execute(MojoExecutor.java:145)
	at org.apache.maven.lifecycle.internal.LifecycleModuleBuilder.buildProject(LifecycleModuleBuilder.java:84)
	at org.apache.maven.lifecycle.internal.LifecycleModuleBuilder.buildProject(LifecycleModuleBuilder.java:59)
	at org.apache.maven.lifecycle.internal.LifecycleStarter.singleThreadedBuild(LifecycleStarter.java:183)
	at org.apache.maven.lifecycle.internal.LifecycleStarter.execute(LifecycleStarter.java:161)
	at org.apache.maven.DefaultMaven.doExecute(DefaultMaven.java:319)
	at org.apache.maven.DefaultMaven.execute(DefaultMaven.java:156)
	at org.apache.maven.cli.MavenCli.execute(MavenCli.java:537)
	at org.apache.maven.cli.MavenCli.doMain(MavenCli.java:196)
	at org.apache.maven.cli.MavenCli.main(MavenCli.java:141)
	at sun.reflect.NativeMethodAccessorImpl.invoke0(Native Method)
	at sun.reflect.NativeMethodAccessorImpl.invoke(NativeMethodAccessorImpl.java:39)
	at sun.reflect.DelegatingMethodAccessorImpl.invoke(DelegatingMethodAccessorImpl.java:25)
	at java.lang.reflect.Method.invoke(Method.java:597)
	at org.codehaus.plexus.classworlds.launcher.Launcher.launchEnhanced(Launcher.java:290)
	at org.codehaus.plexus.classworlds.launcher.Launcher.launch(Launcher.java:230)
	at org.codehaus.plexus.classworlds.launcher.Launcher.mainWithExitCode(Launcher.java:409)
	at org.codehaus.plexus.classworlds.launcher.Launcher.main(Launcher.java:352)
Caused by: org.apache.maven.plugin.MojoFailureException: There are test failures.

Please refer to <https://builds.apache.org/job/HBase-TRUNK-security/ws/trunk/target/surefire-reports>
for the individual test results.
	at org.apache.maven.plugin.surefire.SurefireHelper.reportExecution(SurefireHelper.java:87)
	at org.apache.maven.plugin.surefire.SurefirePlugin.writeSummary(SurefirePlugin.java:651)
	at org.apache.maven.plugin.surefire.SurefirePlugin.handleSummary(SurefirePlugin.java:625)
	at org.apache.maven.plugin.surefire.AbstractSurefireMojo.executeAfterPreconditionsChecked(AbstractSurefireMojo.java:137)
	at org.apache.maven.plugin.surefire.AbstractSurefireMojo.execute(AbstractSurefireMojo.java:98)
	at org.apache.maven.plugin.DefaultBuildPluginManager.executeMojo(DefaultBuildPluginManager.java:101)
	at org.apache.maven.lifecycle.internal.MojoExecutor.execute(MojoExecutor.java:209)
	... 23 more
[ERROR] 
[ERROR] Re-run Maven using the -X switch to enable full debug logging.
[ERROR] 
[ERROR] For more information about the errors and possible solutions, please read the following
articles:
[ERROR] [Help 1] http://cwiki.apache.org/confluence/display/MAVEN/MojoFailureException
Build step 'Invoke top-level Maven targets' marked build as failure
[locks-and-latches] Releasing all the locks
[locks-and-latches] All the locks released
Archiving artifacts
Recording test results
Updating HBASE-5064


Mime
View raw message